<svg version="1.1" id="Layer_1" xmlns="http://www.w3.org/2000/svg" xmlns:xlink="http://www.w3.org/1999/xlink" x="0px" y="0px"
	 viewBox="0 0 629.6 629.6" style="enable-background:new 0 0 629.6 629.6;" xml:space="preserve">
<style type="text/css">
	.st0{fill:none;stroke:url(#SVGID_1_);}
	.st1{fill:none;stroke:url(#SVGID_00000108291427950456988320000006381492850339283103_);}
	.st2{fill:none;stroke:url(#SVGID_00000041992481164873257970000001213856700269864320_);}
	.st3{fill:none;stroke:url(#SVGID_00000074409654391671703810000005695201784136449192_);}
	.st4{fill:none;stroke:url(#SVGID_00000094617888889569154960000005131883115589425580_);stroke-width:0.5;stroke-dasharray:4,4;}
	.st5{fill:#FFFFFF;}
	.st6{fill:url(#SVGID_00000057134246819035822720000003449481237299070338_);fill-opacity:0.7;}
	.st7{fill:none;stroke:url(#SVGID_00000107579387930320842290000013869898259834451607_);stroke-width:0.485;}
	.st8{fill:#22B8EB;}
	.st9{fill:url(#SVGID_00000034091509021684199400000018230260901246193559_);fill-opacity:0.7;}
	.st10{fill:none;stroke:url(#SVGID_00000052808875484824961770000009270749566766784422_);stroke-width:0.485;}
	.st11{fill:#9B100E;}
	.st12{fill:#AB1B12;}
	.st13{fill:#9A160E;}
	.st14{fill:#84170B;}
	.st15{fill:#A41C0F;}
	.st16{fill:#991913;}
	.st17{fill:#8B150D;}
	.st18{fill:#86170D;}
	.st19{fill:url(#SVGID_00000114051279521206622250000010960207748837838496_);fill-opacity:0.7;}
	.st20{fill:none;stroke:url(#SVGID_00000021102101464042156240000011820167456515643280_);stroke-width:0.485;}
	.st21{fill-rule:evenodd;clip-rule:evenodd;fill:#192434;}
	.st22{fill:url(#SVGID_00000141428927747491257900000003880527848513021334_);fill-opacity:0.7;}
	.st23{fill:none;stroke:url(#SVGID_00000076567760273122044450000010876301665396505988_);stroke-width:0.485;}
	.st24{fill:url(#SVGID_00000164481430817983137180000015326375796747934123_);}
	.st25{fill:#B14DED;}
	.st26{fill:url(#SVGID_00000141425899984095610210000011269689685408046783_);}
	.st27{fill:url(#SVGID_00000092457060367473774330000005044811620816021139_);}
	.st28{fill:url(#SVGID_00000091704051596332239110000012864748589876631737_);fill-opacity:0.7;}
	.st29{fill:none;stroke:url(#SVGID_00000057132762369587913660000016475625819430803893_);stroke-width:0.2748;}
	.st30{fill:#36A57A;}
	.st31{fill:url(#SVGID_00000172430242768395455220000012548390352277491893_);fill-opacity:0.7;}
	.st32{fill:none;stroke:url(#SVGID_00000122681942169039480080000006189554433124622758_);stroke-width:0.3471;}
	.st33{fill-rule:evenodd;clip-rule:evenodd;fill:url(#SVGID_00000075139824416358000670000016733792836336574851_);}
	.st34{fill-rule:evenodd;clip-rule:evenodd;fill:url(#SVGID_00000041999746576728562220000005261398299067009978_);}
	.st35{fill:url(#SVGID_00000003104755366239176290000004088948553792332167_);fill-opacity:0.7;}
	.st36{fill:none;stroke:url(#SVGID_00000065768758128027522230000015660318634881525639_);stroke-width:0.3448;}
	.st37{fill-rule:evenodd;clip-rule:evenodd;fill:#054063;}
	.st38{fill:#EEEEEE;}
	.st39{fill:url(#SVGID_00000146487298419832954540000002814415371832736654_);fill-opacity:0.7;}
	.st40{fill:none;stroke:url(#SVGID_00000030454648748625326910000017390208045434602408_);stroke-width:0.485;}
	.st41{fill-rule:evenodd;clip-rule:evenodd;fill:#231F20;}
	.st42{fill:url(#SVGID_00000060722910150979124400000002484648332609617333_);fill-opacity:0.7;}
	.st43{fill:none;stroke:url(#SVGID_00000126294380289698176130000009963310567917551001_);stroke-width:0.485;}
	.st44{fill:#4384F3;}
	.st45{fill:url(#SVGID_00000063613127272293573090000002908561778370250168_);fill-opacity:0.7;}
	.st46{fill:none;stroke:url(#SVGID_00000149384319844344421580000002786265857972259464_);stroke-width:0.485;}
	.st47{fill:#0B6BF5;}
	.st48{fill:#30E4EB;}
	.st49{fill:url(#SVGID_00000059306927245871028150000002563010438051260851_);fill-opacity:0.7;}
	.st50{fill:none;stroke:url(#SVGID_00000136387316905965242100000004464929053224388780_);stroke-width:0.485;}
	.st51{opacity:0.4;}
	.st52{fill:#4582EB;}
	.st53{fill:#3DA45B;}
	.st54{fill:#F6BA3A;}
	.st55{fill:#E4483C;}
	.st56{fill:#BF2926;}
	.st57{fill:url(#SVGID_00000106840468164792653960000000268190563027349685_);fill-opacity:0.7;}
	.st58{fill:none;stroke:url(#SVGID_00000064314504159455236780000005831943268188697222_);stroke-width:0.485;}
	.st59{opacity:0.4;fill:#4088D1;enable-background:new    ;}
	.st60{opacity:0.4;fill:#F5BA3A;enable-background:new    ;}
	.st61{opacity:0.4;fill:#3DA45A;enable-background:new    ;}
	.st62{fill:url(#SVGID_00000121266515224407536850000000476014695631196308_);fill-opacity:0.7;}
	.st63{fill:none;stroke:url(#SVGID_00000066516724081016507410000016677755777159721613_);stroke-width:0.485;}
	.st64{fill:#FFFFFF;filter:url(#Adobe_OpacityMaskFilter);}
	.st65{mask:url(#mask0_2255_6971_00000030479260134520258120000001124340916576247958_);}
	.st66{fill-rule:evenodd;clip-rule:evenodd;fill:#1B9DD9;}
	.st67{fill-rule:evenodd;clip-rule:evenodd;fill:#FFFFFB;}
	.st68{fill:url(#SVGID_00000027594380442257432550000016279780043445797053_);fill-opacity:0.7;}
	.st69{fill:none;stroke:url(#SVGID_00000058588076023452777170000014464934305720815750_);stroke-width:0.5172;}
	.st70{fill:#76A69A;}
	.st71{fill:url(#SVGID_00000164515083824064072340000016900881655621428640_);fill-opacity:0.7;}
	.st72{fill:none;stroke:url(#SVGID_00000069369460763905289260000009628591815854719654_);stroke-width:0.5172;}
	.st73{fill:#2073DF;}
	.st74{fill:#227F3F;}
	.st75{fill:#1E67C9;}
	.st76{fill:url(#SVGID_00000108295067658146086340000014427664498988878002_);fill-opacity:0.7;}
	.st77{fill:none;stroke:url(#SVGID_00000070114213330898332080000008859620926964980630_);stroke-width:0.5172;}
	.st78{fill:#F97D5F;}
	.st79{fill:url(#SVGID_00000003090959838303879370000013774151346867835541_);fill-opacity:0.7;}
	.st80{fill:none;stroke:url(#SVGID_00000080927580794284881130000015911958529661024177_);stroke-width:0.5172;}
	.st81{fill:url(#SVGID_00000022525504563449176270000012538030826917642916_);}
	.st82{fill:url(#SVGID_00000095306076710454809660000013133788002808219537_);}
	.st83{fill:url(#SVGID_00000063623094525597477330000010883797246665835138_);fill-opacity:0.7;}
	.st84{fill:none;stroke:url(#SVGID_00000072976482353752524360000014533444199850866863_);stroke-width:0.5172;}
	.st85{fill:#8CC45B;}
	.st86{fill:url(#SVGID_00000133501308046867224510000003257876933101650084_);fill-opacity:0.7;}
	.st87{fill:none;stroke:url(#SVGID_00000081622349024131897260000010237667743302292627_);stroke-width:0.5172;}
	.st88{fill:url(#SVGID_00000044140011900937491920000013187011016407475372_);}
	.st89{opacity:0.21;}
	.st90{fill:url(#SVGID_00000000912072383229204170000000999101096918030980_);}
	.st91{fill:#F7F7F7;}
	.st92{fill:none;stroke:#F0F1F2;stroke-width:0.544;}
	.st93{fill:url(#SVGID_00000121958081371585407750000013998832867949456770_);fill-opacity:0.36;stroke:#E2E4E8;stroke-width:1.36;}
	
		.st94{fill:url(#SVGID_00000065071690132816592730000016713755498588780162_);filter:url(#Adobe_OpacityMaskFilter_00000169530496441297161230000006713590364604044458_);}
	.st95{mask:url(#mask1_2255_6971_00000183934063851506784670000006464649824509816998_);}
	.st96{fill:none;stroke:url(#SVGID_00000097502607986586945990000016902204222272483254_);}
	.st97{fill:url(#SVGID_00000076579490980875674210000012290435246499893948_);fill-opacity:0.7;}
	.st98{fill:none;stroke:url(#SVGID_00000075843773217696745600000014365954502431684241_);stroke-width:0.5172;}
	.st99{fill:#9D7AD4;}
	.st100{fill:#270164;}
	.st101{fill:#380389;}
	.st102{fill:url(#SVGID_00000013170979598651502070000016399103169625830588_);fill-opacity:0.7;}
	.st103{fill:none;stroke:url(#SVGID_00000057843520540638434530000003257933726155126700_);stroke-width:0.5172;}
	.st104{fill:#D53D1F;}
	.st105{fill:#759EF3;}
	.st106{fill:url(#SVGID_00000163762222804813688150000002582171269229011354_);fill-opacity:0.7;}
	.st107{fill:none;stroke:url(#SVGID_00000175317718847419012760000005055462848723072133_);stroke-width:0.5172;}
	.st108{fill:none;}
	.st109{fill:url(#SVGID_00000048462176190256689910000004157194691982984629_);fill-opacity:0.7;}
	.st110{fill:none;stroke:url(#SVGID_00000182487708642078878010000013621871785297298061_);stroke-width:0.5172;}
	.st111{fill:#41C1EA;}
	.st112{fill:#3AB280;}
	.st113{fill:#E7B046;}
	.st114{fill:#DA285A;}
	.st115{fill:url(#SVGID_00000064326798169045876990000008634420349989420204_);}
	.st116{fill:#FA4D1F;}
	.st117{clip-path:url(#SVGID_00000182528373718186699080000005184476306511125898_);}
	.st118{clip-path:url(#SVGID_00000001645205333852818300000010562788611642194063_);}
	.st119{fill:#FF4D00;}
	.st120{fill:none;stroke:#4F4F4F;stroke-miterlimit:10;}
	.st121{fill:#606060;}
	.st122{fill:url(#SVGID_00000062189835225023190090000009774299824610887301_);}
	.st123{fill:url(#SVGID_00000053521342003567479650000009616614099157130415_);}
	.st124{fill:url(#SVGID_00000057121873150960391110000006886279324740211858_);}
	.st125{fill:url(#SVGID_00000019646829865300948610000005520708466355280026_);}
	.st126{fill:url(#SVGID_00000170985049837536608790000010490679183093482919_);}
	.st127{fill:url(#SVGID_00000034812812547404771540000001006715514768791983_);}
	.st128{fill:url(#SVGID_00000080912599100510357610000015286503447256110227_);}
	.st129{fill:url(#SVGID_00000141420325579495228060000011005285259026005142_);}
	.st130{fill:url(#SVGID_00000008121442687540183230000010361144270491269770_);}
	.st131{fill:url(#SVGID_00000016771019357812980270000003680631248663911563_);}
	.st132{fill:url(#SVGID_00000047025802590434543860000009917713223281963454_);}
	.st133{fill:url(#SVGID_00000095307537659481437730000003527930493504021420_);}
	.st134{fill:url(#SVGID_00000070808213607002816220000007309774723995622826_);}
	.st135{fill:url(#SVGID_00000079450661246576629040000006988609835102623120_);}
	.st136{fill:url(#SVGID_00000102532491582857962770000005632203830065546651_);}
	.st137{fill:url(#SVGID_00000108305029886175239270000009990300251029574577_);}
	.st138{fill:url(#SVGID_00000115480623797518474450000007360369339573534386_);}
	.st139{fill:url(#SVGID_00000173877883821712022620000007250860278731766202_);}
	.st140{fill:url(#SVGID_00000152223803001928691380000015643646170589760959_);}
	.st141{fill:url(#SVGID_00000062177850173852291420000018226556434479148734_);}
	.st142{fill:url(#SVGID_00000023971921716865934960000009917439583884521091_);}
	.st143{fill:none;stroke:url(#SVGID_00000032610338589833622010000015051331527073998471_);}
	.st144{fill:none;stroke:url(#SVGID_00000163038239008275982310000017585494385963747729_);}
	.st145{fill:none;stroke:url(#SVGID_00000171703180145176904730000005022556419805887107_);}
	.st146{fill:none;stroke:url(#SVGID_00000008139518094872306640000005826558397792859047_);}
	.st147{fill:none;stroke:url(#SVGID_00000047044552866514914260000013349923283755869602_);stroke-width:0.5;stroke-dasharray:4,4;}
	.st148{fill:url(#SVGID_00000108987376460810148340000006177463255650234537_);fill-opacity:0.7;}
	.st149{fill:none;stroke:url(#SVGID_00000124870679417306101310000013716007787331860132_);stroke-width:0.485;}
	.st150{fill:url(#SVGID_00000093156826351620180720000004119789001733566103_);fill-opacity:0.7;}
	.st151{fill:none;stroke:url(#SVGID_00000145765266383899409520000013975576692362452413_);stroke-width:0.485;}
	.st152{fill:url(#SVGID_00000082370034790700454950000011351580476806280585_);fill-opacity:0.7;}
	.st153{fill:none;stroke:url(#SVGID_00000054957365525291728170000014694012959171941003_);stroke-width:0.485;}
	.st154{fill:url(#SVGID_00000164484997811416281190000000949820446244358558_);fill-opacity:0.7;}
	.st155{fill:none;stroke:url(#SVGID_00000127733987136318757130000000483738431567557818_);stroke-width:0.485;}
	.st156{fill:url(#SVGID_00000129178429913614715300000002575570713018830990_);}
	.st157{fill:url(#SVGID_00000091718623879161427790000011876466882252822189_);}
	.st158{fill:url(#SVGID_00000129911309875916590860000002094535209180067767_);}
	.st159{fill:url(#SVGID_00000057860889144797889760000017752710536685447827_);fill-opacity:0.7;}
	.st160{fill:none;stroke:url(#SVGID_00000069363047502404696430000011891650323886319520_);stroke-width:0.2748;}
	.st161{fill:url(#SVGID_00000005978465836850250890000014157829392859731851_);fill-opacity:0.7;}
	.st162{fill:none;stroke:url(#SVGID_00000148627383207276062840000012798990638940369085_);stroke-width:0.3471;}
	.st163{fill-rule:evenodd;clip-rule:evenodd;fill:url(#SVGID_00000139289474712236053640000009876208056300311205_);}
	.st164{fill-rule:evenodd;clip-rule:evenodd;fill:url(#SVGID_00000072273837945281251550000003144288117562228378_);}
	.st165{fill:url(#SVGID_00000071524239058754012480000000114427327118211200_);fill-opacity:0.7;}
	.st166{fill:none;stroke:url(#SVGID_00000011031596044557543310000008536927037223974297_);stroke-width:0.3448;}
	.st167{fill:url(#SVGID_00000016765280868136383560000006048176924288026521_);fill-opacity:0.7;}
	.st168{fill:none;stroke:url(#SVGID_00000137128007463838044990000002067271027666372013_);stroke-width:0.485;}
	.st169{fill:url(#SVGID_00000054260485117176603200000009697448060143605425_);fill-opacity:0.7;}
	.st170{fill:none;stroke:url(#SVGID_00000005234039146055331490000016684281944279562674_);stroke-width:0.485;}
	.st171{fill:url(#SVGID_00000165218144212054686780000008285203447715642258_);fill-opacity:0.7;}
	.st172{fill:none;stroke:url(#SVGID_00000013192517847701301020000002075128904575500186_);stroke-width:0.485;}
	.st173{fill:url(#SVGID_00000093869812141722854170000006849139682606112955_);fill-opacity:0.7;}
	.st174{fill:none;stroke:url(#SVGID_00000003794642820756570320000007352388203169733517_);stroke-width:0.485;}
	.st175{fill:url(#SVGID_00000062870948093734378540000018134525272089039522_);fill-opacity:0.7;}
	.st176{fill:none;stroke:url(#SVGID_00000042714389120658436740000013105698557044550803_);stroke-width:0.485;}
	.st177{fill:url(#SVGID_00000182522950834980662280000005843455747819033766_);fill-opacity:0.7;}
	.st178{fill:none;stroke:url(#SVGID_00000090988590361099298530000013618862237070399161_);stroke-width:0.485;}
	.st179{fill:#FFFFFF;filter:url(#Adobe_OpacityMaskFilter_00000008863982293726974830000004649876227612281784_);}
	.st180{mask:url(#mask0_2255_6971_00000069367925854457862630000006625583043778286501_);}
	.st181{fill:url(#SVGID_00000013189106625171884490000018071973230772404398_);fill-opacity:0.7;}
	.st182{fill:none;stroke:url(#SVGID_00000110463956733435051330000002543425117786710683_);stroke-width:0.5172;}
	.st183{fill:url(#SVGID_00000175297593293861410030000002465215795033269690_);fill-opacity:0.7;}
	.st184{fill:none;stroke:url(#SVGID_00000137110655719401283460000001299090575731854518_);stroke-width:0.5172;}
	.st185{fill:url(#SVGID_00000059995506446065149740000006255674206617517459_);fill-opacity:0.7;}
	.st186{fill:none;stroke:url(#SVGID_00000099627335089824155930000015792822563856320158_);stroke-width:0.5172;}
	.st187{fill:url(#SVGID_00000127023839817744555880000002162734071288963470_);fill-opacity:0.7;}
	.st188{fill:none;stroke:url(#SVGID_00000105411206951693772570000000995348519443086266_);stroke-width:0.5172;}
	.st189{fill:url(#SVGID_00000160155887914344750180000009121407176504777884_);}
	.st190{fill:url(#SVGID_00000078003040435350331920000013289690483278001080_);}
	.st191{fill:url(#SVGID_00000052783997483416260730000000404704440928964743_);fill-opacity:0.7;}
	.st192{fill:none;stroke:url(#SVGID_00000032613620080603610470000003277537897840281266_);stroke-width:0.5172;}
	.st193{fill:url(#SVGID_00000165228339122517885390000014230461699556508351_);fill-opacity:0.7;}
	.st194{fill:none;stroke:url(#SVGID_00000038395972942541075850000002366018102831158660_);stroke-width:0.5172;}
	.st195{fill:url(#SVGID_00000132784035779368583750000015035347751917316494_);}
	.st196{fill:url(#SVGID_00000091012252256201513480000011576922441852550039_);}
	
		.st197{fill:url(#SVGID_00000065774118234706123280000003660937781209458838_);fill-opacity:0.36;stroke:#E2E4E8;stroke-width:1.36;}
	
		.st198{fill:url(#SVGID_00000029016157213912713350000001791580559128627875_);filter:url(#Adobe_OpacityMaskFilter_00000067206250533528319380000002097713610213348797_);}
	.st199{mask:url(#mask1_2255_6971_00000124127748978496635090000012249237626339961000_);}
	.st200{fill:none;stroke:url(#SVGID_00000067926804552224156180000008618960906392698537_);}
	.st201{fill:url(#SVGID_00000029023715570074507430000017409053818552668831_);fill-opacity:0.7;}
	.st202{fill:none;stroke:url(#SVGID_00000137128139484949607010000012618554096283507589_);stroke-width:0.5172;}
	.st203{fill:url(#SVGID_00000117668996645706660400000014270981344776032411_);fill-opacity:0.7;}
	.st204{fill:none;stroke:url(#SVGID_00000051380582889726659690000016445498267888339369_);stroke-width:0.5172;}
	.st205{fill:url(#SVGID_00000076566617623289331890000000748616342892554383_);fill-opacity:0.7;}
	.st206{fill:none;stroke:url(#SVGID_00000172431699705582708430000001805547805581770368_);stroke-width:0.5172;}
	.st207{fill:url(#SVGID_00000080920886253168262940000001190002365822276770_);fill-opacity:0.7;}
	.st208{fill:none;stroke:url(#SVGID_00000155852286408704753520000005286250715053044377_);stroke-width:0.5172;}
	.st209{fill:url(#SVGID_00000143589496743539477830000013309346713060186506_);}
	.st210{fill:url(#SVGID_00000047751951665735637220000003579645766293486757_);}
	.st211{fill:url(#SVGID_00000005264032655831913350000000038190525893655969_);}
	.st212{fill:url(#SVGID_00000067938154398693523620000002607531573071677619_);}
	.st213{fill:url(#SVGID_00000021088548069094721420000017505685010931018114_);}
	.st214{fill:url(#SVGID_00000158735190408703877580000001974869147338782625_);}
	.st215{fill:url(#SVGID_00000171709264453108215840000011649118607491163836_);}
	.st216{fill:url(#SVGID_00000070830008970427418330000001561755529232568482_);}
	.st217{fill:url(#SVGID_00000043421375478233537600000006781763470069661113_);}
	.st218{fill:url(#SVGID_00000093891087208349221740000007906085583396965260_);}
	.st219{fill:url(#SVGID_00000089555349516423248090000012366355141194553218_);}
	.st220{fill:url(#SVGID_00000079485304789356613050000014274924106644215432_);}
	.st221{fill:url(#SVGID_00000158024748680523358210000004357970918280717750_);}
	.st222{fill:url(#SVGID_00000045617865979919331070000011420769718586025646_);}
	.st223{fill:url(#SVGID_00000008136759975608077650000001114585850319451791_);}
	.st224{fill:url(#SVGID_00000115494539116787054170000004487677963096635820_);}
	.st225{fill:url(#SVGID_00000028304464058980524850000004759680487693531783_);}
	.st226{fill:url(#SVGID_00000067949888390917321770000000407658235753651110_);}
	.st227{fill:url(#SVGID_00000014626149122199495280000011431200865413599367_);}
	.st228{fill:url(#SVGID_00000106841133126363714680000012579232289991629758_);}
	.st229{fill:url(#SVGID_00000103223852499059732300000012620535120016378014_);}
	.st230{fill:url(#SVGID_00000049212852790901446630000003175834069198356123_);}
	.st231{fill:#B6A2D1;}
</style>
<g>
	<path class="st231" d="M82.7,314.8c0-128.2,103.9-232.1,232.1-232.1V0C141,0,0,141,0,314.8H82.7z"/>
	<path class="st119" d="M546.9,314.8c0,128.2-103.9,232.1-232.1,232.1v82.7c173.9,0,314.8-141,314.8-314.8H546.9z"/>
</g>
</svg>
