{
  "version": 1,
  "dependencies": {
    ".NETCoreApp,Version=v5.0": {
      "dep1": {
        "type": "Project",
        "dependencies": {
          "Dep2": "1.0.0"
        }
      },
      "dep2": {
        "type": "Project"
      }
    }
  }
}