1.02855 141
0.412963 274
0.20967 406
0.129584 531
0.0850281 656
0.0640844 780
0.0535922 903
0.048112 1027
0.0451526 1151
0.0434229 1272
0.0422828 1385
0.041582 1506
0.0410691 1620
0.0405821 1733
0.040138 1850
0.0397526 1976
0.0393814 2087
0.0390085 2211
0.0386192 2323
0.0382794 2437
0.0379785 2555
0.0377306 2663
0.0375175 2775
0.0373329 2890
0.0371603 3018
0.0369806 3132
0.0368053 3248
0.0366344 3360
0.0364698 3472
0.0363132 3586
0.0361651 3702
0.036031 3814
0.0359056 3949
0.0357876 4054
0.0356788 4157
0.0355773 4262
0.0354791 4365
0.0353808 4465
0.0352853 4567
0.035193 4669
0.0351024 4768
0.0350125 4875
0.0349236 4975
0.0348372 5079
0.034752 5184
0.0346687 5292
0.0345888 5393
0.0345133 5495
0.03444 5596
0.0343698 5697
0.034301 5797
0.0342306 5899
0.0341609 6000
0.0340917 6105
0.0340231 6215
0.0339564 6314
0.0338899 6418
0.0338239 6538
0.0337581 6634
0.0336936 6736
0.0336313 6842
0.0335688 6944
0.0335064 7046
0.0334443 7142
0.0333821 7244
0.033319 7343
0.033257 7443
0.0331956 7551
0.0331356 7656
0.0330744 7757
0.0330112 7855
0.0329462 7956
0.0328828 8057
0.0328201 8156
0.0327587 8254
0.0326963 8357
0.0326332 8455
0.032571 8554
0.0325096 8654
0.0324484 8752
0.0323878 8854
0.0323279 8963
0.0322677 9061
0.0322067 9159
0.0321456 9256
0.0320837 9355
0.0320211 9457
0.0319594 9553
0.0318977 9649
0.0318355 9747
0.0317744 9843
0.0317139 9942
0.0316535 10040
0.0315928 10141
0.0315321 10243
0.0314713 10340
0.0314105 10438
0.03135 10535
0.0312894 10633
0.0312288 10739
