255.47 24
1.49096 83
0.898495 165
0.690371 253
0.551167 347
0.452981 436
0.377486 529
0.320067 621
0.268317 719
0.221882 812
0.187276 899
0.163111 984
0.14609 1071
0.133664 1159
0.123831 1246
0.114281 1337
0.105736 1422
0.098695 1513
0.0926588 1600
0.0872517 1711
0.0823874 1801
0.0772176 1887
0.0718068 1968
0.0665082 2042
0.061329 2118
0.0564696 2192
0.0516349 2265
0.0470825 2337
0.0425559 2409
0.0382224 2481
0.0342162 2549
0.0304507 2615
0.0270648 2684
0.0242234 2750
0.0217856 2816
