60.465 167
1.03 251
0.653274 332
0.497894 419
0.377721 513
0.283185 610
0.222328 708
0.182728 798
0.156406 888
0.1353 976
0.116495 1062
0.100521 1148
0.088087 1236
0.078043 1320
0.0696854 1403
0.0630051 1488
0.0573394 1571
0.0526151 1651
0.0489437 1735
0.0461212 1817
0.0440095 1901
0.0422594 1982
0.0406749 2062
0.0393461 2141
0.0383571 2220
0.0375399 2302
0.036827 2384
0.0361586 2467
0.0355552 2552
0.0349768 2631
0.0344462 2719
0.033896 2801
0.0333196 2885
0.0326822 2970
0.0320019 3052
0.0312798 3136
0.0304806 3222
0.0296303 3307
0.0287435 3391
0.0278382 3477
0.0269103 3564
0.0259522 3656
0.0249587 3741
0.0239507 3825
0.0229841 3910
0.0221184 3997
0.0214346 4083
0.0208443 4168
0.0202852 4263
