17.758 44
1.67354 108
0.864354 170
0.59327 239
0.483074 315
0.417658 388
0.36373 467
0.317812 551
0.271677 633
0.224828 713
0.186285 796
0.155111 879
0.132347 963
0.114237 1045
0.0978685 1124
0.0845363 1206
0.0738534 1282
0.066493 1363
0.0610215 1443
0.0569829 1522
0.0539077 1601
0.0515881 1680
0.0495915 1762
0.0478074 1843
0.0461671 1925
0.0446102 2004
0.0430728 2085
0.0416725 2164
0.0403889 2243
0.0392231 2322
0.0381791 2401
0.0372993 2482
0.0364634 2564
0.035612 2643
0.0347209 2722
0.033861 2800
0.0330361 2881
0.0322061 2961
0.0314558 3039
0.0308321 3119
0.0302641 3200
0.029753 3281
0.0292457 3366
0.0287538 3448
0.0282523 3526
0.0277372 3606
0.0271874 3689
0.0265994 3773
0.0259335 3863
0.0252175 3947
0.024503 4030
0.0237852 4120
0.023112 4207
0.0224717 4295
0.0219171 4383
0.0213908 4466
0.0209237 4548
0.0204845 4633
0.0200341 4717
