Division,WeightClassKg,Place,Name,Team,BodyweightKg,Best3SquatKg,Best3BenchKg,Best3DeadliftKg,TotalKg,Equipment,Event,Sex,BirthDate
Girls,44.23,1,Valery Cano,Edinburg Idea College Prep,44.23,120.2,65.77,131.54,317.51,Single-ply,SBD,F,
Girls,44.23,2,Arely Ortega,Edinburg Quest College Prep,44.18,111.13,61.23,111.13,283.5,Single-ply,SBD,F,
Girls,44.23,3,Angelina Zuniga,San Benito,41.46,92.99,47.63,92.99,233.6,Single-ply,SBD,F,
Girls,44.23,4,Emily Davila,Los Fresnos,41.19,83.91,40.82,81.65,206.38,Single-ply,SBD,F,
Girls,44.23,DQ,Nevaeh Moreno,Rio Hondo,41.05,,,,,Single-ply,SBD,F,
Girls,44.23,DQ,Ana Sosa,Brownsville Lopez,43.45,70.31,,,,Single-ply,SBD,F,
Girls,47.85,1,Anna Rodriguez,Los Fresnos,46.9,97.52,47.63,108.86,254.01,Single-ply,SBD,F,
Girls,47.85,2,Abigail Vazquez,Edinburg Idea College Prep,46.54,97.52,31.75,99.79,229.06,Single-ply,SBD,F,
Girls,47.85,3,Adamari Guevara,Los Fresnos,47.08,77.11,36.29,102.06,215.46,Single-ply,SBD,F,
Girls,47.85,4,Monica Martinez,Brownsville Veterans Memorial,47.45,74.84,36.29,102.06,213.19,Single-ply,SBD,F,
Girls,47.85,5,Stephanie Ortega,Edinburg Quest College Prep,45.81,92.99,40.82,70.31,204.12,Single-ply,SBD,F,
Girls,47.85,DQ,Ruby Carrillo,Brownsville Rivera,47.81,61.23,,70.31,,Single-ply,SBD,F,
Girls,47.85,DQ,Destiny Torres,Brownsville Lopez,46.81,92.99,,,,Single-ply,SBD,F,
Girls,51.94,1,Devin Balderama,Los Fresnos,51.89,131.54,70.31,127.01,328.85,Single-ply,SBD,F,
Girls,51.94,2,Viviana Lopez,Port Isabel,50.71,127.01,58.97,127.01,312.98,Single-ply,SBD,F,
Girls,51.94,3,Amaris Garza,Edinburg Idea College Prep,51.26,115.67,68.04,127.01,310.71,Single-ply,SBD,F,
Girls,51.94,4,Isabell Sanchez,Mercedes,51.17,124.74,54.43,108.86,288.03,Single-ply,SBD,F,
Girls,51.94,5,Claudia Coronado,Brownsville Hanna,51.89,120.2,52.16,108.86,281.23,Single-ply,SBD,F,
Girls,51.94,6,Dana Rodriguez,Brownsville Pace,48.72,113.4,43.09,115.67,272.16,Single-ply,SBD,F,
Girls,51.94,7,Ahliyah Wheeler,Edinburg Quest College Prep,49.9,102.06,47.63,102.06,251.74,Single-ply,SBD,F,
Girls,51.94,8,Mia Gracia,Brownsville Lopez,48.53,81.65,52.16,104.33,238.14,Single-ply,SBD,F,
Girls,51.94,9,Hailey Rivas,Edinburg Quest College Prep,51.8,99.79,43.09,92.99,235.87,Single-ply,SBD,F,
Girls,51.94,10,Alessia Rodriguez,Brownsville Pace,51.89,86.18,40.82,77.11,204.12,Single-ply,SBD,F,
Girls,51.94,11,Brianna Aguilar,Brownsville Rivera,48.17,68.04,36.29,83.91,188.24,Single-ply,SBD,F,
Girls,51.94,12,Amber Cardenas,Santa Rosa,51.8,61.23,31.75,90.72,183.7,Single-ply,SBD,F,
Girls,51.94,13,Rosemary Carrillo,Brownsville Rivera,50.62,61.23,45.36,68.04,174.63,Single-ply,SBD,F,
Girls,51.94,DQ,Esmeralda Najera,San Benito,49.8,95.25,,,,Single-ply,SBD,F,
Girls,56.02,1,Alyzza Ortiz,Edinburg Quest College Prep,55.52,129.27,61.23,122.47,312.98,Single-ply,SBD,F,
Girls,56.02,2,Abigail Castellanos,Rio Hondo,54.79,140.61,58.97,111.13,310.71,Single-ply,SBD,F,
Girls,56.02,3,Jacqueline Perez,Port Isabel,55.7,102.06,52.16,120.2,274.42,Single-ply,SBD,F,
Girls,56.02,4,Claritza Flores,Los Fresnos,52.89,106.59,47.63,102.06,256.28,Single-ply,SBD,F,
Girls,56.02,5,Bridgette Sanchez,Mercedes,55.16,106.59,43.09,97.52,247.21,Single-ply,SBD,F,
Girls,56.02,6,Daniela De La Torre,Brownsville Pace,55.79,95.25,40.82,108.86,244.94,Single-ply,SBD,F,
Girls,56.02,7,Alejandra Reyes,Edinburg Quest College Prep,53.34,102.06,47.63,92.99,242.67,Single-ply,SBD,F,
Girls,56.02,8,Jocelyn Mata,Santa Rosa,52.8,65.77,29.48,65.77,161.03,Single-ply,SBD,F,
Girls,56.02,DQ,Aylinn Garza,Brownsville Rivera,54.61,81.65,,,,Single-ply,SBD,F,
Girls,56.02,DQ,America Bernal,Brownsville Pace,55.88,,,,,Single-ply,SBD,F,
Girls,56.02,DQ,Isis Perez,Brownsville Hanna,52.8,92.99,,,,Single-ply,SBD,F,
Girls,60.1,1,Isis Sandiford,Edinburg Idea College Prep,59.15,174.63,95.25,172.37,442.25,Single-ply,SBD,F,
Girls,60.1,2,Angelin Cruz,San Benito,58.42,133.81,58.97,167.83,360.61,Single-ply,SBD,F,
Girls,60.1,3,Valerie Soto,San Benito,59.15,142.88,72.57,117.93,333.39,Single-ply,SBD,F,
Girls,60.1,4,Brianna Garcia,Brownsville Pace,59.78,140.61,63.5,122.47,326.59,Single-ply,SBD,F,
Girls,60.1,5,Asia De Leon,Brownsville Pace,58.69,127.01,52.16,138.35,317.51,Single-ply,SBD,F,
Girls,60.1,6,Alexandra Davila,Brownsville Pace,57.52,124.74,56.7,124.74,306.17,Single-ply,SBD,F,
Girls,60.1,7,Morgan Williams,Los Fresnos,58.6,122.47,52.16,124.74,299.37,Single-ply,SBD,F,
Girls,60.1,8,Ashley Cardenas,Brownsville Hanna,60.06,108.86,70.31,111.13,290.3,Single-ply,SBD,F,
Girls,60.1,9,Crystal Jimenez,Mercedes,59.87,115.67,43.09,108.86,267.62,Single-ply,SBD,F,
Girls,60.1,10,Clarissa Flores,Los Fresnos,59.69,104.33,47.63,95.25,247.21,Single-ply,SBD,F,
Girls,60.1,11,Irene Sepulveda,Brownsville Porter,60.06,97.52,45.36,92.99,235.87,Single-ply,SBD,F,
Girls,60.1,12,Nicole Rivera,Brownsville Pace,58.24,79.38,52.16,102.06,233.6,Single-ply,SBD,F,
Girls,60.1,13,Mariana Jaime,Brownsville Hanna,59.6,61.23,38.56,79.38,179.17,Single-ply,SBD,F,
Girls,60.1,DQ,Alondra Rodriguez,Brownsville Pace,59.15,120.2,56.7,,,Single-ply,SBD,F,
Girls,60.1,DQ,Elyda Longoria,Harlingen South,57.7,,40.82,,,Single-ply,SBD,F,
Girls,60.1,DQ,Emily Flores,Rio Hondo,57.33,108.86,,,,Single-ply,SBD,F,
Girls,67.36,1,Jenifher Gallegos,San Benito,66.68,170.1,83.91,129.27,383.29,Single-ply,SBD,F,
Girls,67.36,2,Sindy Garcia,Edinburg Idea College Prep,66.68,149.69,79.38,138.35,367.41,Single-ply,SBD,F,
Girls,67.36,3,Mia Rincones,Edinburg Idea College Prep,60.6,145.15,68.04,124.74,337.93,Single-ply,SBD,F,
Girls,67.36,4,Andrea Rizo,Brownsville Pace,65.32,149.69,56.7,122.47,328.85,Single-ply,SBD,F,
Girls,67.36,5,Sophia Aguilera,Los Fresnos,62.51,131.54,61.23,133.81,326.59,Single-ply,SBD,F,
Girls,67.36,6,Marbella Galindo,Los Fresnos,66.5,124.74,58.97,122.47,306.17,Single-ply,SBD,F,
Girls,67.36,7,Samantha Perez,Brownsville Hanna,67.31,113.4,65.77,120.2,299.37,Single-ply,SBD,F,
Girls,67.36,8,Celeste Rodriguez,Lyford,66.68,106.59,61.23,113.4,281.23,Single-ply,SBD,F,
Girls,67.36,9,Yolanda Perez,Brownsville Jubilee,63.5,111.13,47.63,120.2,278.96,Single-ply,SBD,F,
Girls,67.36,10,Leslie Flores,Santa Rosa,65.41,104.33,43.09,124.74,272.16,Single-ply,SBD,F,
Girls,67.36,11,Aalyiah Martinez,Brownsville Rivera,65.91,83.91,61.23,111.13,256.28,Single-ply,SBD,F,
Girls,67.36,12,Jozclynn Rodriguez,Brownsville Hanna,66.41,99.79,56.7,99.79,256.28,Single-ply,SBD,F,
Girls,67.36,13,Litzy Martinez,San Benito,63.23,97.52,40.82,106.59,244.94,Single-ply,SBD,F,
Girls,67.36,14,Franki Zavala,Brownsville Hanna,61.42,90.72,54.43,92.99,238.14,Single-ply,SBD,F,
Girls,67.36,15,Julissa Gonzalez,Brownsville Lopez,60.51,83.91,54.43,92.99,231.33,Single-ply,SBD,F,
Girls,67.36,16,Jerlynn Lozano,Santa Rosa,65.5,79.38,47.63,102.06,229.06,Single-ply,SBD,F,
Girls,67.36,17,Litzy Venegas,Brownsville Veterans Memorial,60.42,81.65,52.16,88.45,222.26,Single-ply,SBD,F,
Girls,67.36,18,Aliyah Rodriguez,Harlingen South,63.23,81.65,43.09,97.52,222.26,Single-ply,SBD,F,
Girls,67.36,19,Dezirae Juarez,Mercedes,61.05,99.79,43.09,74.84,217.72,Single-ply,SBD,F,
Girls,67.36,20,Lourdes Bernal,Brownsville Rivera,60.87,70.31,38.56,79.38,188.24,Single-ply,SBD,F,
Girls,67.36,21,Valeria De Leon,Brownsville Rivera,61.96,65.77,40.82,70.31,176.9,Single-ply,SBD,F,
Girls,67.36,DQ,Arleen Arambula,Brownsville Pace,67.22,,,,,Single-ply,SBD,F,
Girls,67.36,DQ,Maria Gonzalez,Los Fresnos,66.13,,,,,Single-ply,SBD,F,
Girls,75.07,1,Jacqueline Ybarra,Edinburg Idea College Prep,74.03,149.69,83.91,142.88,376.48,Single-ply,SBD,F,
Girls,75.07,2,Lizette Zuniga,Rio Hondo,71.58,138.35,74.84,127.01,340.19,Single-ply,SBD,F,
Girls,75.07,3,Madelyn Galvan,Port Isabel,68.31,124.74,65.77,122.47,312.98,Single-ply,SBD,F,
Girls,75.07,4,Alexis Flores,Brownsville Hanna,69.54,120.2,56.7,111.13,288.03,Single-ply,SBD,F,
Girls,75.07,5,Idali Vasquez,Harlingen South,68.49,106.59,38.56,115.67,260.82,Single-ply,SBD,F,
Girls,75.07,6,Karla Rabanales,Edinburg Quest College Prep,70.94,120.2,52.16,83.91,256.28,Single-ply,SBD,F,
Girls,75.07,7,Evelyn Rodriguez,Brownsville Veterans Memorial,69.58,83.91,43.09,79.38,206.38,Single-ply,SBD,F,
Girls,75.07,8,Avery Alexander,Harlingen South,74.3,74.84,36.29,81.65,192.78,Single-ply,SBD,F,
Girls,75.07,DQ,Cassandra Martinez,Mercedes,72.03,124.74,,,,Single-ply,SBD,F,
Girls,75.07,DQ,Jaden Ybarra,San Benito,74.03,117.93,,,,Single-ply,SBD,F,
Girls,75.07,DQ,Alondra Gomez,Brownsville Rivera,68.04,61.23,,,,Single-ply,SBD,F,
Girls,82.33,1,Angelina Cervantes,Brownsville Rivera,82.01,136.08,83.91,136.08,356.07,Single-ply,SBD,F,
Girls,82.33,2,Julie Torres,Rio Hondo,80.29,108.86,61.23,129.27,299.37,Single-ply,SBD,F,
Girls,82.33,3,Juliet Gallardo,Brownsville Lopez,79.74,113.4,65.77,106.59,285.76,Single-ply,SBD,F,
Girls,82.33,4,Perla Mercado,Brownsville Porter,81.56,111.13,43.09,113.4,267.62,Single-ply,SBD,F,
Girls,82.33,5,Klyee Flores,Santa Rosa,78.47,81.65,40.82,102.06,224.53,Single-ply,SBD,F,
Girls,82.33,DQ,Gladys Castillo,Brownsville Porter,82.28,113.4,43.09,,,Single-ply,SBD,F,
Girls,82.33,DQ,Karla Mata,Brownsville Rivera,80.01,115.67,,,,Single-ply,SBD,F,
Girls,82.33,DQ,Perla Jarillo,Brownsville Porter,79.2,99.79,,,,Single-ply,SBD,F,
Girls,90.04,1,Alexandra Hall,Edinburg Quest College Prep,89.27,167.83,88.45,156.49,412.77,Single-ply,SBD,F,
Girls,90.04,2,Caroline Hernandez,San Benito,87.91,158.76,108.86,124.74,392.36,Single-ply,SBD,F,
Girls,90.04,3,Nayeli Lopez,Brownsville Veterans Memorial,87.91,149.69,77.11,142.88,369.68,Single-ply,SBD,F,
Girls,90.04,4,Reeana Esquivel,Edinburg Idea College Prep,89.36,142.88,74.84,145.15,362.87,Single-ply,SBD,F,
Girls,90.04,5,Jazylyn Hernandez,San Benito,88.18,122.47,56.7,127.01,306.17,Single-ply,SBD,F,
Girls,90.04,6,Kendra Garza,San Benito,87.36,122.47,52.16,129.27,303.91,Single-ply,SBD,F,
Girls,90.04,7,Litzy Herebia,Brownsville Porter,84.1,122.47,52.16,120.2,294.84,Single-ply,SBD,F,
Girls,90.04,8,Alexis Rodriguez,Brownsville Porter,90.04,124.74,61.23,108.86,294.84,Single-ply,SBD,F,
Girls,90.04,9,Bryanna Sosa,Brownsville Hanna,88.18,81.65,47.63,102.06,231.33,Single-ply,SBD,F,
Girls,90.04,DQ,Emily Gonzalez,Brownsville Pace,87.91,,,,,Single-ply,SBD,F,
Girls,100.02,1,Megan Ayala,San Benito,97.98,170.1,97.52,147.42,415.04,Single-ply,SBD,F,
Girls,100.02,2,April Puente,Port Isabel,91.08,136.08,65.77,117.93,319.78,Single-ply,SBD,F,
Girls,100.02,3,Caressma Barrera,San Benito,95.25,136.08,47.63,108.86,292.57,Single-ply,SBD,F,
Girls,100.02,4,Veronica Olivarez,Santa Rosa,91.35,81.65,36.29,97.52,215.46,Single-ply,SBD,F,
Girls,117.71,1,Marleen Salazar,Brownsville Lopez,100.97,192.78,102.06,176.9,471.74,Single-ply,SBD,F,
Girls,117.71,2,Karina Medina,Rio Hondo,100.97,167.83,79.38,158.76,405.97,Single-ply,SBD,F,
Girls,117.71,3,Amor Sosa,Rio Hondo,102.51,158.76,65.77,149.69,374.21,Single-ply,SBD,F,
Girls,117.71,4,Victoria Olivarez,Santa Rosa,102.06,149.69,74.84,147.42,371.95,Single-ply,SBD,F,
Girls,117.71,5,Yvonne De La Fuente,Brownsville Veterans Memorial,102.69,142.88,72.57,147.42,362.87,Single-ply,SBD,F,
Girls,117.71,6,Desiree Martinez,Raymondville,106.59,158.76,72.57,124.74,356.07,Single-ply,SBD,F,
Girls,117.71,7,Aaliyah Prater,Brownsville Porter,117.48,120.2,63.5,133.81,317.51,Single-ply,SBD,F,
Girls,117.71,8,Madelyn Garcia,Harlingen South,103.78,83.91,38.56,92.99,215.46,Single-ply,SBD,F,
