Name,Sex,Event,Division,WeightClassKg,Equipment,BirthYear,Team,State,BodyweightKg,Squat1Kg,Squat2Kg,Squat3Kg,Best3SquatKg,Bench1Kg,Bench2Kg,Bench3Kg,Best3BenchKg,Deadlift1Kg,Deadlift2Kg,Deadlift3Kg,Best3DeadliftKg,TotalKg,Age,BirthDate,Place
Jenny Wang,F,SBD,FR-HS,52,Raw,2002,Boston Latin School,MA,50.8,77.5,82.5,90,90,52.5,57.5,60,60,107.5,112.5,117.5,117.5,267.5,,,1
Jennifer Cowan,F,SBD,FR-HS,57,Raw,2002,,MA,55.2,90,95,100,100,55,57.5,60,60,102.5,107.5,-115,107.5,267.5,,,1
Hanyi Wang,F,SBD,FR-HS,57,Raw,2002,Boston Latin School,MA,54.6,55,65,70,70,-30,32.5,-35,32.5,72.5,80,87.5,87.5,190,,,2
Laura Valencia,F,SBD,FR-HS,63,Raw,2002,,MA,58.6,70,72.5,-77.5,72.5,42.5,-47.5,-50,42.5,100,105,110,110,225,,,1
Crystal Liu,F,SBD,FR-HS,84,Raw,2001,Boston Latin School,MA,82.2,-87.5,87.5,105,105,35,37.5,42.5,42.5,112.5,122.5,-132.5,122.5,270,,,1
Emily Odell,F,SBD,FR-HS,84,Raw,2001,,NY,72.9,52.5,57.5,-60,57.5,25,30,-32.5,30,-67.5,67.5,75,75,162.5,,,2
Louie Liu,M,SBD,M-G,120,Single-ply,1997,,MA,118.8,310,317.5,325,325,185,-195,200,200,-255,255,265,265,790,,,G
Michael Khalil,M,SBD,M-G,120+,Single-ply,1997,,MA,128.4,-290,290,302.5,302.5,160,170,180,180,230,245,257.5,257.5,740,,,G
Nolan Davis,M,SBD,MR-HSJV,59,Raw,2003,Saint John's High School,MA,57,130,137.5,-145,137.5,70,75,77.5,77.5,142.5,152.5,157.5,157.5,372.5,,,1
Maxwell Davis,M,SBD,MR-HSJV,59,Raw,2004,Saint John's High School,MA,57,102.5,112.5,117.5,117.5,60,62.5,65,65,125,135,145,145,327.5,,,2
Nathan Murphy-Merolle,M,SBD,MR-HSJV,59,Raw,2004,,NY,58.6,72.5,82.5,87.5,87.5,52.5,57.5,-70,57.5,-100,100,-107.5,100,245,,,3
Jack Lang,M,SBD,MR-HSJV,59,Raw,2004,,MA,55.6,-85,85,-92.5,85,45,-50,50,50,95,100,105,105,240,,,4
Liam Mahoney,M,SBD,MR-HSJV,59,Raw,2004,,MA,58.8,-72.5,75,-80,75,42.5,-47.5,47.5,47.5,92.5,97.5,100,100,222.5,,,5
Benjamin Heim,M,SBD,MR-HSJV,66,Raw,2003,,MA,64.3,115,-122.5,122.5,122.5,60,-62.5,-62.5,60,125,135,142.5,142.5,325,,,1
Alec Joyce,M,SBD,MR-HSJV,66,Raw,2004,,MA,61.4,-105,105,115,115,60,-62.5,62.5,62.5,100,110,115,115,292.5,,,2
Brady Graceffa,M,SBD,MR-HSJV,66,Raw,2003,Saint John's High School,MA,65.6,77.5,80,82.5,82.5,70,72.5,-75,72.5,115,127.5,132.5,132.5,287.5,,,3
Jose Perezgarcia,M,SBD,MR-HSJV,66,Raw,2005,Saint John's High School,MA,65.8,52.5,57.5,62.5,62.5,45,50,55,55,70,80,90,90,207.5,,,4
Andrew Gonsorcik,M,SBD,MR-HSJV,66,Raw,2004,Saint John's High School,MA,61.8,45,47.5,50,50,40,42.5,-47.5,42.5,87.5,95,-102.5,95,187.5,,,5
Jairus Jahner,M,SBD,MR-HSJV,74,Raw,2003,Saint John's High School,MA,73.2,125,130,135,135,75,80,82.5,82.5,125,-127.5,127.5,127.5,345,,,1
Grayson Pina,M,SBD,MR-HSJV,74,Raw,2004,,MA,73.4,115,-122.5,122.5,122.5,70,-72.5,-72.5,70,125,127.5,132.5,132.5,325,,,2
Jacob Nikas,M,SBD,MR-HSJV,74,Raw,2004,,MA,67.9,105,110,-112.5,110,62.5,65,67.5,67.5,90,100,110,110,287.5,,,3
Antonio Leandres,M,SBD,MR-HSJV,74,Raw,2004,Saint John's High School,MA,73.3,80,85,95,95,57.5,62.5,65,65,97.5,110,117.5,117.5,277.5,,,4
Nicolas ARTURA,M,SBD,MR-HSJV,74,Raw,2004,,MA,73.4,-60,62.5,70,70,60,62.5,-65,62.5,102.5,115,-125,115,247.5,,,5
Ayden Edwards,M,SBD,MR-HSJV,83,Raw,2003,,MA,74.4,-175,-175,175,175,-80,-82.5,82.5,82.5,140,150,-165,150,407.5,,,1
Colin Fay,M,SBD,MR-HSJV,93,Raw,2004,,MA,87.8,115,122.5,127.5,127.5,70,75,77.5,77.5,115,125,135,135,340,,,1
Jacob O'Dell,M,SBD,MR-HSJV,93,Raw,2004,,NY,87.9,80,87.5,100,100,52.5,62.5,67.5,67.5,125,135,-137.5,135,302.5,,,2
Michael Croteau Jr,M,SBD,MR-HSJV,105,Raw,2003,,MA,104.1,182.5,187.5,,187.5,127.5,132.5,137.5,137.5,215,227.5,-237.5,227.5,552.5,,,1
Nathan Church,M,SBD,MR-HSJV,105,Raw,2005,Saint John's High School,MA,102.4,115,120,127.5,127.5,87.5,92.5,-97.5,92.5,150,167.5,177.5,177.5,397.5,,,2
Michael Boutros,M,SBD,MR-HSJV,120+,Raw,2004,,MA,121,-175,177.5,185,185,125,-130,130,130,220,227.5,-235,227.5,542.5,,,1
Matthew Gjanci,M,SBD,MR-HSV,59,Raw,2002,Boston Latin School,MA,58,115,122.5,-130,122.5,-72.5,77.5,-82.5,77.5,162.5,172.5,182.5,182.5,382.5,,,1
Daniel Zhang,M,SBD,MR-HSV,59,Raw,2001,Saint John's High School,MA,59,102.5,107.5,-110,107.5,95,97.5,100,100,140,155,162.5,162.5,370,,,2
Jason Gao,M,SBD,MR-HSV,59,Raw,2002,Boston Latin School,MA,54.7,115,122.5,-130,122.5,67.5,72.5,75,75,135,142.5,150,150,347.5,,,3
Anthony Migridichian,M,SBD,MR-HSV,59,Raw,2002,,MA,58,102.5,110,-117.5,110,77.5,82.5,85,85,125,137.5,142.5,142.5,337.5,,,4
Kwaku Nyarko,M,SBD,MR-HSV,59,Raw,2002,,MA,54.8,100,107.5,112.5,112.5,80,85,-87.5,85,135,-150,-150,135,332.5,,,5
Eric Migridichian,M,SBD,MR-HSV,59,Raw,2002,,MA,55.1,80,-87.5,90,90,60,65,-67.5,65,92.5,100,102.5,102.5,257.5,,,6
Michael Mcauley-MacDonald,M,SBD,MR-HSV,66,Raw,2002,,MA,65.1,175,177.5,187.5,187.5,110,117.5,-125,117.5,175,185,192.5,192.5,497.5,,,1
Evan Gonsorcik,M,SBD,MR-HSV,66,Raw,2003,Saint John's High School,MA,62.9,102.5,107.5,112.5,112.5,70,72.5,75,75,142.5,150,157.5,157.5,345,,,2
Matthew Czaja,M,SBD,MR-HSV,66,Raw,2003,Saint John's High School,MA,65,92.5,97.5,105,105,65,70,72.5,72.5,132.5,137.5,-140,137.5,315,,,3
Noah Long,M,SBD,MR-HSV,66,Raw,2002,Saint John's High School,MA,62.3,92.5,97.5,102.5,102.5,62.5,65,-67.5,65,115,122.5,127.5,127.5,295,,,4
Zachery Creekmore,M,SBD,MR-HSV,66,Raw,2003,,CT,59.3,80,82.5,92.5,92.5,52.5,62.5,-65,62.5,125,-132.5,137.5,137.5,292.5,,,5
Kyle Pierson,M,SBD,MR-HSV,74,Raw,2001,Saint John's High School,MA,72.2,-132.5,-132.5,135,135,82.5,87.5,90,90,165,175,185,185,410,,,1
Christopher Joyce,M,SBD,MR-HSV,74,Raw,2002,,MA,72.6,120,122.5,125,125,67.5,72.5,77.5,77.5,132.5,135,140,140,342.5,,,2
Misal Patel,M,SBD,MR-HSV,74,Raw,2002,Saint John's High School,MA,71.1,97.5,102.5,105,105,60,62.5,67.5,67.5,122.5,140,145,145,317.5,,,3
Liam Hartson,M,SBD,MR-HSV,74,Raw,2003,Saint John's High School,MA,71.1,92.5,97.5,105,105,85,-87.5,-87.5,85,107.5,125,-127.5,125,315,,,4
Colin Marczely,M,SBD,MR-HSV,74,Raw,2003,,MA,69,-117.5,117.5,-122.5,117.5,-72.5,-72.5,-72.5,,135,142.5,150,150,,,,DQ
Fabian Valencia,M,SBD,MR-HSV,74,Raw,2003,,MA,69.2,-142.5,-145,145,145,-85,-85,-85,,177.5,192.5,-200,192.5,,,,DQ
Tin Nguyen,M,SBD,MR-HSV,83,Raw,2002,Boston Latin School,MA,80.9,-162.5,177.5,-182.5,177.5,-85,92.5,95,95,167.5,170,180,180,452.5,,,1
Zachary O'Toole,M,SBD,MR-HSV,83,Raw,2003,Saint John's High School,MA,81.9,137.5,150,157.5,157.5,85,-87.5,-87.5,85,170,190,207.5,207.5,450,,,2
Waleed Alhabeeb,M,SBD,MR-HSV,83,Raw,2002,,MA,77,-142.5,150,-157.5,150,95,100,105,105,155,162.5,167.5,167.5,422.5,,,3
Patrick Agora,M,SBD,MR-HSV,83,Raw,2002,Saint John's High School,MA,82.3,-142.5,142.5,-157.5,142.5,75,-80,80,80,162.5,172.5,177.5,177.5,400,,,4
Hery Hernandez,M,SBD,MR-HSV,83,Raw,2002,Saint John's High School,MA,79.7,102.5,112.5,120,120,80,85,87.5,87.5,162.5,172.5,-182.5,172.5,380,,,5
Kyle Rollins,M,SBD,MR-HSV,93,Raw,2002,,MA,90.3,192.5,202.5,210,210,102.5,110,117.5,117.5,227.5,247.5,265,265,592.5,,,1
Ethan Shibley,M,SBD,MR-HSV,93,Raw,2003,Saint John's High School,MA,89.4,-170,-170,175,175,102.5,107.5,110,110,192.5,205,-215,205,490,,,2
Phineas Cashman,M,SBD,MR-HSV,93,Raw,2004,Saint John's High School,MA,87.7,92.5,102.5,110,110,75,-80,80,80,115,125,132.5,132.5,322.5,,,3
Luke Shibley,M,SBD,MR-HSV,105,Raw,2001,Saint John's High School,MA,102.2,165,170,-172.5,170,112.5,117.5,122.5,122.5,205,217.5,222.5,222.5,515,,,1
Minh Tran,M,SBD,MR-HSV,105,Raw,2002,,MA,101.8,165,172.5,177.5,177.5,85,92.5,-97.5,92.5,165,177.5,185,185,455,,,2
Owen Bright,M,SBD,MR-HSV,105,Raw,2002,,MA,99.9,145,155,-165,155,85,87.5,-92.5,87.5,162.5,172.5,182.5,182.5,425,,,3
Aidan Tucker,M,SBD,MR-HSV,105,Raw,2003,,MA,98.7,120,127.5,137.5,137.5,85,90,95,95,175,182.5,-187.5,182.5,415,,,4
Joseph Evasius,M,SBD,MR-HSV,105,Raw,2003,,MA,101.3,130,132.5,135,135,75,80,90,90,132.5,140,155,155,380,,,5
Brenden Dowling,M,SBD,MR-HSV,120,Raw,2003,,MA,117.9,162.5,-167.5,167.5,167.5,-125,127.5,132.5,132.5,175,190,-200,190,490,,,1
Kyle Tucker,M,SBD,MR-HSV,120,Raw,2002,,MA,117.3,-142.5,-145,145,145,-102.5,105,112.5,112.5,165,187.5,202.5,202.5,460,,,2
Rolando Perea,M,SBD,MR-HSV,120,Raw,2002,Saint John's High School,MA,118.8,145,152.5,160,160,100,105,110,110,170,182.5,187.5,187.5,457.5,,,3
Samuel Sullivan,M,SBD,MR-HSV,120,Raw,2003,Boston Latin School,MA,114.8,125,135,140,140,75,-80,-80,75,170,180,187.5,187.5,402.5,,,4
Christopher Torres,M,SBD,MR-HSV,120,Raw,2002,,MA,117.4,-125,-132.5,132.5,132.5,,,,,,,,,,,,DQ
Alexander Doiron,M,SBD,MR-HSV,120+,Raw,2002,,MA,140.2,-237.5,237.5,250,250,125,137.5,-140,137.5,252.5,267.5,-272.5,267.5,655,,,1
Alex Saladino,M,SBD,MR-HSV,120+,Raw,2002,,MA,143,200,205,210,210,117.5,122.5,-125,122.5,190,200,-215,200,532.5,,,2
