Division,WeightClassKg,Place,Name,Team,BodyweightKg,Best3SquatKg,Best3BenchKg,Best3DeadliftKg,TotalKg,Equipment,Event,Sex
Boys,51.71,1,Esteban Urquieta,Corpus Christi Tuloso-Midway,50.89,174.63,83.91,188.24,446.79,Single-ply,SBD,M
Boys,51.71,2,Seth Munoz,Mathis,50.89,133.81,70.31,156.49,360.61,Single-ply,SBD,M
Boys,51.71,3,Chris Edwards,Aransas Pass,47.9,120.2,72.57,133.81,326.59,Single-ply,SBD,M
Boys,51.71,4,Isaiah Glasglow,Kingsville King,51.62,99.79,52.16,124.74,276.69,Single-ply,SBD,M
Boys,51.71,5,Leroy Burke,Rockport-Fulton,51.71,95.25,63.5,117.93,276.69,Single-ply,SBD,M
Boys,51.71,6,Jose Huerta,Bishop,47.72,99.79,58.97,115.67,274.42,Single-ply,SBD,M
Boys,55.79,1,Jose Hernandez,Corpus Christi West Oso,55.79,172.37,92.99,183.7,449.06,Single-ply,SBD,M
Boys,55.79,2,Chris Trevino,San Diego,55.34,127.01,81.65,149.69,358.34,Single-ply,SBD,M
Boys,55.79,3,Josh Trevino,Corpus Christi West Oso,54.52,133.81,61.23,142.88,337.93,Single-ply,SBD,M
Boys,55.79,4,Alex Vela,Corpus Christi Calallen,54.88,120.2,65.77,151.95,337.93,Single-ply,SBD,M
Boys,55.79,5,Brian Dominguez,Corpus Christi Calallen,52.98,122.47,68.04,142.88,333.39,Single-ply,SBD,M
Boys,55.79,6,Matt Lopez,Mathis,54.88,122.47,61.23,142.88,326.59,Single-ply,SBD,M
Boys,55.79,NS,Ruben Leal,Aransas Pass,,,,,,Single-ply,SBD,M
Boys,55.79,DQ,Bryan Gutierrez,Bishop,55.16,,,,,Single-ply,SBD,M
Boys,55.79,DQ,Anthony Ramirez,Corpus Christi West Oso,54.7,120.2,,,,Single-ply,SBD,M
Boys,55.79,DQ,Mark Moreno,Odem,53.98,,,,,Single-ply,SBD,M
Boys,59.87,1,Damian Diaz,Hebbronville,59.51,183.7,83.91,181.44,449.06,Single-ply,SBD,M
Boys,59.87,2,Seth Bazan,Bishop,59.87,158.76,81.65,165.56,405.97,Single-ply,SBD,M
Boys,59.87,3,Michael Lopez,Robstown,59.33,147.42,92.99,158.76,399.16,Single-ply,SBD,M
Boys,59.87,4,Gabriel García,Bishop,59.69,158.76,83.91,151.95,394.63,Single-ply,SBD,M
Boys,59.87,DQ,AJ Perez,Ben Bolt-Palito Blanco,57.42,,,,,Single-ply,SBD,M
Boys,59.87,DQ,Juan Vasquez,Corpus Christi Calallen,58.69,176.9,,,,Single-ply,SBD,M
Boys,59.87,DQ,Gavin Chapa,Corpus Christi London,59.87,183.7,111.13,,,Single-ply,SBD,M
Boys,59.87,DQ,Gabriel Herrera,Mathis,58.42,131.54,92.99,,,Single-ply,SBD,M
Boys,59.87,DQ,Austin Mendez,San Diego,59.51,156.49,97.52,,,Single-ply,SBD,M
Boys,67.13,1,Felix Del Rio,Robstown,67.13,213.19,131.54,204.12,548.85,Single-ply,SBD,M
Boys,67.13,2,Angel Trujillo,Rockport-Fulton,64.86,192.78,111.13,188.24,492.15,Single-ply,SBD,M
Boys,67.13,3,John Robali,Robstown,67.13,190.51,97.52,179.17,467.2,Single-ply,SBD,M
Boys,67.13,4,Ramiro DeLeon,Mathis,67.04,172.37,102.06,183.7,458.13,Single-ply,SBD,M
Boys,67.13,5,Ryan Franscham,Orange Grove,66.41,174.63,88.45,183.7,446.79,Single-ply,SBD,M
Boys,67.13,6,Angelus Lopez,Kingsville King,65.05,156.49,102.06,183.7,442.25,Single-ply,SBD,M
Boys,67.13,7,Jose Saenz,San Diego,65.59,165.56,111.13,163.29,439.98,Single-ply,SBD,M
Boys,67.13,8,Robert Hughes,Sinton,61.6,154.22,92.99,190.51,437.72,Single-ply,SBD,M
Boys,67.13,9,Jose Garza,Kingsville King,64.86,156.49,111.13,163.29,430.91,Single-ply,SBD,M
Boys,67.13,10,Dominic Sanchez,Mathis,61.69,151.95,115.67,149.69,417.3,Single-ply,SBD,M
Boys,67.13,11,Leonel Guerrero,Hebbronville,64.68,147.42,88.45,158.76,394.63,Single-ply,SBD,M
Boys,67.13,12,Jose Leyva,Bishop,66.59,145.15,86.18,163.29,394.63,Single-ply,SBD,M
Boys,67.13,13,Adan Diaz,Aransas Pass,65.95,124.74,102.06,149.69,376.48,Single-ply,SBD,M
Boys,67.13,14,Austin Candaleria,Corpus Christi Tuloso-Midway,67.13,147.42,81.65,147.42,376.48,Single-ply,SBD,M
Boys,67.13,15,Jay Gutierrez,Corpus Christi Tuloso-Midway,64.86,129.27,72.57,172.37,374.21,Single-ply,SBD,M
Boys,67.13,16,Rolando Ramos,Hebbronville,62.96,140.61,81.65,145.15,367.41,Single-ply,SBD,M
Boys,67.13,DQ,Andrew Garcia,Mathis,65.77,,,,,Single-ply,SBD,M
Boys,67.13,DQ,Jacob Sandoval,Bishop,65.68,151.95,,,,Single-ply,SBD,M
Boys,67.13,DQ,Nico Perez,Benavides,67.04,,,,,Single-ply,SBD,M
Boys,67.13,DQ,Andres Garza,San Diego,65.5,163.29,,,,Single-ply,SBD,M
Boys,74.84,1,Anthony Perez,San Diego,69.22,269.89,176.9,242.67,689.46,Single-ply,SBD,M
Boys,74.84,2,Chiso Nwampka,Corpus Christi Tuloso-Midway,74.3,185.97,124.74,219.99,530.7,Single-ply,SBD,M
Boys,74.84,3,Carlos Gonzales,Mathis,72.12,176.9,115.67,176.9,469.47,Single-ply,SBD,M
Boys,74.84,4,Gavin Gonzalez,Corpus Christi Tuloso-Midway,73.94,174.63,79.38,142.88,396.89,Single-ply,SBD,M
Boys,74.84,5,Gus Byrom,Sinton,73.12,131.54,81.65,142.88,356.07,Single-ply,SBD,M
Boys,74.84,DQ,Cole Walker,Rockport-Fulton,73.94,,,,,Single-ply,SBD,M
Boys,74.84,DQ,Aaron Champion,Mathis,74.03,185.97,,,,Single-ply,SBD,M
Boys,82.1,1,Lee Bazan,San Diego,76.75,278.96,156.49,219.99,655.44,Single-ply,SBD,M
Boys,82.1,2,Demetri Sanchez,Corpus Christi London,82.1,206.38,117.93,226.8,551.11,Single-ply,SBD,M
Boys,82.1,3,Bobby Dorsch,Corpus Christi Calallen,82.1,217.72,124.74,208.65,551.11,Single-ply,SBD,M
Boys,82.1,4,Matthew Garza,Corpus Christi West Oso,79.56,188.24,131.54,185.97,505.76,Single-ply,SBD,M
Boys,82.1,5,Nick Lazo,Corpus Christi Tuloso-Midway,80.74,188.24,115.67,181.44,485.34,Single-ply,SBD,M
Boys,82.1,6,Kenny Guerra,Benavides,79.38,188.24,92.99,195.04,476.27,Single-ply,SBD,M
Boys,82.1,7,Juan Santana,Bishop,80.74,172.37,88.45,176.9,437.72,Single-ply,SBD,M
Boys,82.1,8,TJ Salazar,Corpus Christi Tuloso-Midway,81.01,156.49,86.18,183.7,426.38,Single-ply,SBD,M
Boys,82.1,9,Ryan Pena,Kingsville King,82.01,122.47,65.77,124.74,312.98,Single-ply,SBD,M
Boys,82.1,DQ,Connor Bowers,Bishop,80.56,,,,,Single-ply,SBD,M
Boys,82.1,DQ,Dale Baez,Hebbronville,82.1,,,,,Single-ply,SBD,M
Boys,82.1,DQ,Gabriel Rivera,Robstown,78.02,,,,,Single-ply,SBD,M
Boys,82.1,DQ,Landon Garza,Odem,82.01,,,,,Single-ply,SBD,M
Boys,89.81,1,Joseph Araujo,San Diego,87,247.21,158.76,251.74,657.71,Single-ply,SBD,M
Boys,89.81,2,Ivan Naranjo,Robstown,88.54,238.14,174.63,222.26,635.03,Single-ply,SBD,M
Boys,89.81,3,Damien Campos,Bishop,88,233.6,129.27,219.99,582.87,Single-ply,SBD,M
Boys,89.81,4,Orlando Gonzalez,Odem,87.09,231.33,127.01,213.19,571.53,Single-ply,SBD,M
Boys,89.81,5,Jacob Gonzalez,Kingsville King,88,217.72,131.54,215.46,564.72,Single-ply,SBD,M
Boys,89.81,6,Caleb Marshall,Hebbronville,82.64,176.9,147.42,195.04,519.36,Single-ply,SBD,M
Boys,89.81,7,Elijah Aguilar,Kingsville King,89.72,136.08,92.99,149.69,378.75,Single-ply,SBD,M
Boys,89.81,DQ,Cody Rosas,Robstown,88.81,217.72,133.81,,,Single-ply,SBD,M
Boys,89.81,DQ,Dante Vasquez,Corpus Christi Tuloso-Midway,89.54,,,,,Single-ply,SBD,M
Boys,99.79,1,Damian Hinojosa,Corpus Christi Calallen,90.54,260.82,188.24,231.33,680.39,Single-ply,SBD,M
Boys,99.79,2,Ryan Rasbury,Mathis,98.25,269.89,133.81,240.4,644.1,Single-ply,SBD,M
Boys,99.79,3,Alejandro Ortega,Corpus Christi Calallen,99.34,258.55,140.61,201.85,601.01,Single-ply,SBD,M
Boys,99.79,4,Franklin Ramirez,Rockport-Fulton,99.16,240.4,151.95,197.31,589.67,Single-ply,SBD,M
Boys,99.79,5,Cameron Ngo,Rockport-Fulton,97.25,233.6,131.54,217.72,582.87,Single-ply,SBD,M
Boys,99.79,6,Jordan Longoria,Bishop,93.08,240.4,117.93,206.38,564.72,Single-ply,SBD,M
Boys,99.79,7,Juan Chavera,Falfurrias,94.8,240.4,133.81,188.24,562.45,Single-ply,SBD,M
Boys,99.79,8,Chance Pena,Rockport-Fulton,92.53,215.46,127.01,217.72,560.19,Single-ply,SBD,M
Boys,99.79,9,Roberto Torres,Sinton,98.07,226.8,127.01,188.24,542.04,Single-ply,SBD,M
Boys,99.79,10,Marcos Gonzalez,Ben Bolt-Palito Blanco,90.54,208.65,131.54,195.04,535.24,Single-ply,SBD,M
Boys,99.79,11,Michael Barajas,Mathis,93.26,204.12,111.13,190.51,505.76,Single-ply,SBD,M
Boys,99.79,12,Isaac Martinez,Corpus Christi Tuloso-Midway,96.62,210.92,120.2,172.37,503.49,Single-ply,SBD,M
Boys,99.79,13,Armando Benavides,Corpus Christi West Oso,94.62,185.97,106.59,176.9,469.47,Single-ply,SBD,M
Boys,99.79,14,Josiah Gonzalez,Hebbronville,97.89,170.1,81.65,145.15,396.89,Single-ply,SBD,M
Boys,99.79,DQ,Tristan Perez,Ben Bolt-Palito Blanco,91.9,,,,,Single-ply,SBD,M
Boys,99.79,DQ,Alejandro Gómez,Hebbronville,92.17,,,,,Single-ply,SBD,M
Boys,109.77,1,Brandon Rodriguez,Robstown,106.96,219.99,149.69,224.53,594.21,Single-ply,SBD,M
Boys,109.77,2,Darriel Gonzalez,Hebbronville,107.32,244.94,142.88,192.78,580.6,Single-ply,SBD,M
Boys,109.77,3,Isaiah Rios,Corpus Christi West Oso,106.78,226.8,140.61,206.38,573.79,Single-ply,SBD,M
Boys,109.77,4,Mason Pena,Ben Bolt-Palito Blanco,106.59,215.46,131.54,208.65,555.65,Single-ply,SBD,M
Boys,109.77,DQ,Richard Alvarado,Aransas Pass,102.87,208.65,140.61,,,Single-ply,SBD,M
Boys,124.74,1,Michael Salaiz,San Diego,116.94,312.98,190.51,267.62,771.11,Single-ply,SBD,M
Boys,124.74,2,Jakob Encinia,Sinton,116.57,260.82,181.44,201.85,644.1,Single-ply,SBD,M
Boys,124.74,3,Francisco Gonzalez,Sinton,114.49,249.48,163.29,226.8,639.57,Single-ply,SBD,M
Boys,124.74,4,Julian Gomez,Odem,114.4,247.21,158.76,231.33,637.3,Single-ply,SBD,M
Boys,124.74,5,Brandon Kilough,Rockport-Fulton,117.48,226.8,145.15,238.14,610.08,Single-ply,SBD,M
Boys,124.74,6,Chris Chavez,Corpus Christi West Oso,119.02,231.33,149.69,226.8,607.81,Single-ply,SBD,M
Boys,124.74,7,Lance Lopez,Orange Grove,110.4,249.48,133.81,206.38,589.67,Single-ply,SBD,M
Boys,124.74,8,Anthony Martinez,Corpus Christi Tuloso-Midway,110.95,174.63,142.88,172.37,489.88,Single-ply,SBD,M
Boys,124.74,9,Michael Soliz,Kingsville King,110.59,181.44,92.99,183.7,458.13,Single-ply,SBD,M
Boys,124.74,10,Aaron Griffin,Corpus Christi Tuloso-Midway,114.12,163.29,90.72,133.81,387.82,Single-ply,SBD,M
Boys,124.74,DQ,Paul Pena,Robstown,122.83,263.08,,,,Single-ply,SBD,M
Boys,124.74,DQ,Steve Peña #2,Robstown,110.59,240.4,,,,Single-ply,SBD,M
Boys,124.74,DQ,Diego Gutierrez,Mathis,121.74,238.14,,,,Single-ply,SBD,M
Boys,124.74+,1,Aaron Flores,Santa Gertrudis Academy,148.05,242.67,113.4,226.8,582.87,Single-ply,SBD,M
Boys,124.74+,DQ,Riley Hawkins,Corpus Christi Tuloso-Midway,144.61,,,,,Single-ply,SBD,M
Boys,124.74+,DQ,Joshua Johnson,Kingsville King,146.51,,,,,Single-ply,SBD,M
Boys,124.74+,DQ,Jeffrey Hobbs,Orange Grove,137.44,,,,,Single-ply,SBD,M
Boys,,NS,Severo Garcia,Kingsville King,,,,,,Single-ply,SBD,M
Boys,,NS,Javier Jasso,Corpus Christi London,,,,,,Single-ply,SBD,M
Boys,,NS,Nathan Reyes,Corpus Christi West Oso,,,,,,Single-ply,SBD,M
Boys,,NS,Hector Lopez,Corpus Christi West Oso,,,,,,Single-ply,SBD,M
Boys,,NS,Gilbert Acuna,Corpus Christi West Oso,,,,,,Single-ply,SBD,M
Boys,,NS,Ismael Gonzalez,Kingsville King,,,,,,Single-ply,SBD,M
Boys,,NS,Kaleb Speckman,Kingsville King,,,,,,Single-ply,SBD,M
Boys,,NS,Adrian Davila,Aransas Pass,,,,,,Single-ply,SBD,M
Boys,,NS,Andrew Martinez,Aransas Pass,,,,,,Single-ply,SBD,M
Boys,,NS,Nick Teer,Aransas Pass,,,,,,Single-ply,SBD,M
Boys,,NS,Isaiah Chavera,Hebbronville,,,,,,Single-ply,SBD,M
Boys,,NS,Pete Dominguez,Hebbronville,,,,,,Single-ply,SBD,M
Boys,,NS,Ademar Garcia,Hebbronville,,,,,,Single-ply,SBD,M
Boys,,NS,Non Lifter,Odem,,,,,,Single-ply,SBD,M
Boys,,NS,Isaiah Allen,Corpus Christi Tuloso-Midway,,,,,,Single-ply,SBD,M
Boys,,NS,Austin Gonzales,Robstown,,,,,,Single-ply,SBD,M
Boys,,NS,Alejandro Ramirez,Hebbronville,,,,,,Single-ply,SBD,M
Boys,,NS,Leo Soliz,Corpus Christi Tuloso-Midway,,,,,,Single-ply,SBD,M
Boys,,NS,Phillip Sullivan,Corpus Christi Tuloso-Midway,,,,,,Single-ply,SBD,M
Boys,,NS,Brenden Baham,Corpus Christi Tuloso-Midway,,,,,,Single-ply,SBD,M
Boys,,NS,Brody Guerrero,Rockport-Fulton,,,,,,Single-ply,SBD,M
