Place,WeightClassKg,Division,Name,Equipment,Event,Sex,Age,BodyweightKg,State,Best3SquatKg,Best3BenchKg,Best3DeadliftKg,TotalKg
1,52,Open,Cathy Eaton,Wraps,SBD,F,59,50.48,OH,45.36,34.02,83.91,163.29
1,52,Masters 55-59,Cathy Eaton,Wraps,SBD,F,59,50.48,OH,45.36,34.02,83.91,163.29
1,67.5,Juniors,Molly Sellins,Wraps,SBD,F,23,66.32,OH,92.99,56.7,149.69,299.37
1,82.5,Open,Heather Camp,Wraps,SBD,F,37,76.11,KY,79.38,52.16,122.47,254.01
1,67.5,Police and Fire,Julie Marzheuser,Wraps,SBD,F,33,61.51,KY,77.11,45.36,97.52,219.99
1,100,Open,Amy Thomas,Wraps,SBD,F,38,98.79,OH,145.15,63.5,176.9,385.55
1,110,Open,Meridith Martin,Wraps,SBD,F,41,107.68,KY,136.08,72.57,138.35,347
1,75,Teenage 16-17,Danny Pfetzer,Wraps,SBD,M,16,70.49,KY,104.33,72.57,136.08,312.98
1,67.5,Juniors,Sam Bowles,Wraps,SBD,M,22,67.22,OH,149.69,108.86,204.12,462.66
2,90,Juniors,Josh Selidge,Wraps,SBD,M,21,89.9,,183.7,151.95,226.8,562.45
1,100,Juniors,Zackary Sanders,Wraps,SBD,M,20,95.35,OH,226.8,161.03,256.28,644.1
1,90,Juniors,Louie Altomare,Wraps,SBD,M,,89.63,OH,235.87,154.22,290.3,680.39
3,90,Open,Christian Bartolomei,Wraps,SBD,M,29,89.36,OH,199.58,124.74,229.06,553.38
1,90,Open,John Branch,Wraps,SBD,M,24,82.83,WV,192.78,129.27,238.14,560.19
1,100,Open,Eric Deidesheimer,Wraps,SBD,M,29,93.98,OH,210.92,163.29,215.46,589.67
1,110,Open,Darwin Robinson,Wraps,SBD,M,24,105.05,OH,285.76,181.44,278.96,746.16
3,110,Open,Issac Morgan,Wraps,SBD,M,24,109.41,OH,260.82,192.78,242.67,696.26
2,110,Open,Dustin Isaacv,Wraps,SBD,M,29,108.32,OH,274.42,170.1,278.96,723.48
1,118,Open,John Murray,Wraps,SBD,M,26,113.58,OH,242.67,181.44,272.16,696.26
1,110,Masters 40-44,Lewis Miller,Wraps,SBD,M,44,109.5,OH,226.8,172.37,301.64,700.8
1,75,Masters 55-59,Scott Bowles,Wraps,SBD,M,57,74.75,OH,97.52,90.72,147.42,335.66
1,125,Masters 45-49,Sam Garus,Wraps,SBD,M,49,120.93,KY,113.4,104.33,185.97,403.7
1,110,Police and Fire,James Kreinest,Wraps,SBD,M,33,107.14,KY,208.65,147.42,254.01,610.08
1,75,Masters 65-69,Harry Hensley,Wraps,SBD,M,68,72.12,OH,58.97,40.82,90.72,190.51
1,60,Open,Miranda Craiger,Single-ply,SBD,F,24,59.51,WV,115.67,47.63,127.01,290.3
1,67.5,Open,Cara Westin,Multi-ply,SBD,F,52,66.68,CA,226.8,147.42,192.78,566.99
1,67.5,Juniors,Chris Suozzi,Multi-ply,SBD,M,22,66.95,OH,208.65,138.35,229.06,576.06
2,100,Open,Josh Pfetzer,Multi-ply,SBD,M,28,96.25,KY,331.12,124.74,274.42,730.28
1,100,Open,Jeff Wampler,Multi-ply,SBD,M,,99.84,OH,381.02,231.33,294.84,907.18
1,125,Open,Jake Norman,Multi-ply,SBD,M,25,123.38,OH,408.23,240.4,371.95,1020.58
1,75,Open,Ethan Paulucci,Multi-ply,SBD,M,21,73.03,OH,254.01,181.44,229.06,664.51
1,75,Masters 65-69,Harry Hensley,Raw,BD,M,68,72.12,OH,,40.82,90.72,131.54
1,52,Masters 55-59,Cathy Eaton,Raw,BD,F,59,,OH,,34.02,83.91,117.93
1,44,Special Olympics,Chris Hensley,Raw,B,F,44,,OH,,27.22,,27.22
1,44,Open,Chris Hensley,Raw,B,F,44,,OH,,27.22,,27.22
1,44,Masters 40-44,Chris Hensley,Raw,B,F,44,,OH,,27.22,,27.22
1,52,Masters 55-59,Cathy Eaton,Raw,B,F,,50.48,OH,,34.02,,34.02
1,52,Open,Cathy Eaton,Raw,B,F,,50.48,OH,,34.02,,34.02
1,90,Submasters,Jason Davis,Raw,B,M,,85.73,KY,,145.15,,145.15
DQ,90,Masters 40-44,Chris Ernest,Raw,B,M,,86.09,OH,,,,
1,100,Masters 50-54,Rob Grisson,Raw,B,M,,99.06,OH,,151.95,,151.95
1,52,Masters 55-59,Cathy Eaton,Raw,D,F,,50.48,OH,,,83.91,83.91
1,52,Masters 55-59,Cathy Eaton,Wraps,S,F,,50.48,OH,45.36,,,45.36
1,75,Open,Wes McCormick,Multi-ply,SBD,M,25,74.57,OH,365.14,238.14,272.16,875.43
1,100,Open,Jason Coker,Multi-ply,SBD,M,40,99.79,OH,385.55,385.55,249.48,1020.58
1,90,Open,Christian Haywood,Multi-ply,SBD,M,28,89.54,OH,371.95,242.67,317.51,932.13
2,90,Open,Joe Rother,Multi-ply,SBD,M,24,88,OH,362.87,244.94,308.44,916.26
3,90,Open,Vince Carone,Multi-ply,SBD,M,25,89.63,OH,340.19,240.4,317.51,898.11
1,75,Open,Liz Freel,Multi-ply,SBD,F,40,73.57,CA,254.01,170.1,217.72,641.83
1,110,Open,Allen Antonelli,Multi-ply,SBD,M,37,108.5,OH,344.73,256.28,285.76,886.77
1,118,Open,Jim Benson,Multi-ply,SBD,M,29,112.31,GA,453.59,299.37,299.37,1052.33
1,125,Open,Elliot Baum,Multi-ply,SBD,M,26,124.65,OH,390.09,331.12,226.8,948.01
1,140+,Open,Chris Spegal,Multi-ply,D,M,27,189.51,OH,,,387.82,387.82
