Division,WeightClassKg,Place,Name,Team,BodyweightKg,Best3SquatKg,Best3BenchKg,Best3DeadliftKg,TotalKg,Equipment,Event,Sex,BirthDate
Boys,51.71,1,Blake Zubritski,Justin Northwest,45.36,56.7,38.56,65.77,161.03,Single-ply,SBD,M,
Boys,55.79,1,Jeremiah Parks,Justin Northwest,53.98,113.4,68.04,117.93,299.37,Single-ply,SBD,M,
Boys,59.87,1,John Harris,Northwest Eaton,59.87,142.88,86.18,136.08,365.14,Single-ply,SBD,M,
Boys,59.87,2,Kaedan McDaniel,Northwest Nelson,59.42,95.25,63.5,124.74,283.5,Single-ply,SBD,M,
Boys,59.87,3,Addison Cureton,Northwest Nelson,59.42,102.06,47.63,117.93,267.62,Single-ply,SBD,M,
Boys,59.87,DQ,Daxon Dogget,Justin Northwest,58.97,,,,,Single-ply,SBD,M,
Boys,67.13,1,Amarie Antwine,Northwest Nelson,61.69,120.2,70.31,142.88,333.39,Single-ply,SBD,M,
Boys,74.84,1,Mike Jones,Northwest Nelson,69.85,158.76,95.25,183.7,437.72,Single-ply,SBD,M,
Boys,74.84,2,Cooper Stillwell,Northwest Nelson,74.39,154.22,90.72,170.1,415.04,Single-ply,SBD,M,
Boys,74.84,3,Charlie Walker,Northwest Nelson,70.76,142.88,95.25,158.76,396.89,Single-ply,SBD,M,
Boys,74.84,4,Isaac Jones,Northwest Eaton,70.76,151.95,86.18,142.88,381.02,Single-ply,SBD,M,
Boys,74.84,5,Jason Laster,Justin Northwest,73.03,136.08,74.84,136.08,347,Single-ply,SBD,M,
Boys,74.84,6,Marcus Carillo,Justin Northwest,74.84,86.18,63.5,83.91,233.6,Single-ply,SBD,M,
Boys,82.1,1,Ibrahim Durodoye,Justin Northwest,81.65,188.24,124.74,183.7,496.68,Single-ply,SBD,M,
Boys,82.1,2,Reed Leonard,Northwest Nelson,78.47,174.63,102.06,181.44,458.13,Single-ply,SBD,M,
Boys,82.1,3,Andrew Perkins,Northwest Eaton,80.29,158.76,92.99,170.1,421.84,Single-ply,SBD,M,
Boys,82.1,4,Erik Maidhoff,Northwest Nelson,78.47,145.15,83.91,158.76,387.82,Single-ply,SBD,M,
Boys,89.81,1,Kaleth Polanco,Northwest Eaton,83.46,185.97,127.01,192.78,505.76,Single-ply,SBD,M,
Boys,89.81,2,Sean Conrad,Northwest Eaton,87.09,163.29,117.93,165.56,446.79,Single-ply,SBD,M,
Boys,89.81,3,Grant Winninger,Northwest Eaton,87.09,167.83,106.59,170.1,444.52,Single-ply,SBD,M,
Boys,89.81,4,Gavin Roark,Northwest Nelson,86.64,165.56,92.99,181.44,439.98,Single-ply,SBD,M,
Boys,89.81,5,Adam Wells,Northwest Eaton,86.18,165.56,97.52,170.1,433.18,Single-ply,SBD,M,
Boys,89.81,6,Braden St Ama,Northwest Eaton,89.81,158.76,102.06,158.76,419.57,Single-ply,SBD,M,
Boys,89.81,7,Camron Langley,Justin Northwest,88.45,142.88,99.79,161.03,403.7,Single-ply,SBD,M,
Boys,89.81,8,Kyndel Simms,Justin Northwest,83.91,147.42,95.25,149.69,392.36,Single-ply,SBD,M,
Boys,89.81,9,Luis Chavez,Justin Northwest,86.64,138.35,92.99,154.22,385.55,Single-ply,SBD,M,
Boys,99.79,1,Jeremiah Armstriong,Northwest Nelson,95.71,192.78,120.2,195.04,508.02,Single-ply,SBD,M,
Boys,99.79,2,Cooper Donoho,Northwest Nelson,99.34,158.76,120.2,181.44,460.4,Single-ply,SBD,M,
Boys,99.79,3,Joshua Champlin,Northwest Eaton,92.08,158.76,90.72,204.12,453.59,Single-ply,SBD,M,
Boys,99.79,4,Ty Berreth,Northwest Eaton,94.8,170.1,111.13,172.37,453.59,Single-ply,SBD,M,
Boys,99.79,5,Brock Hayward,Northwest Eaton,94.8,145.15,120.2,183.7,449.06,Single-ply,SBD,M,
Boys,99.79,6,Zach Boozer,Northwest Nelson,91.17,147.42,108.86,170.1,426.38,Single-ply,SBD,M,
Boys,99.79,7,Noah Knotts,Northwest Nelson,99.34,158.76,97.52,167.83,424.11,Single-ply,SBD,M,
Boys,99.79,8,Efren Rojas,Justin Northwest,93.89,149.69,83.91,117.93,351.53,Single-ply,SBD,M,
Boys,99.79,9,Collin Langley,Justin Northwest,97.52,111.13,65.77,124.74,301.64,Single-ply,SBD,M,
Boys,109.77,1,Cyril Etim,Northwest Eaton,109.32,210.92,136.08,233.6,580.6,Single-ply,SBD,M,
Boys,109.77,2,Jayden Gray,Northwest Eaton,101.15,208.65,120.2,233.6,562.45,Single-ply,SBD,M,
Boys,109.77,3,Braedon Koiner,Northwest Nelson,108.86,183.7,108.86,188.24,480.81,Single-ply,SBD,M,
Boys,109.77,4,Caleb Sullard,Northwest Nelson,108.41,172.37,106.59,188.24,467.2,Single-ply,SBD,M,
Boys,109.77,5,Angel Zuniga,Northwest Nelson,104.33,181.44,99.79,181.44,462.66,Single-ply,SBD,M,
Boys,109.77,6,Adon Ruiz,Justin Northwest,108.86,154.22,102.06,149.69,405.97,Single-ply,SBD,M,
Boys,109.77,7,Wyatt Baker,Justin Northwest,105.23,158.76,77.11,158.76,394.63,Single-ply,SBD,M,
Boys,109.77,8,Austin Mangun,Justin Northwest,106.14,142.88,99.79,149.69,392.36,Single-ply,SBD,M,
Boys,109.77,9,Aiden Hughes,Justin Northwest,105.69,79.38,72.57,102.06,254.01,Single-ply,SBD,M,
Boys,124.74,1,Caden Bogan,Northwest Nelson,112.49,181.44,117.93,190.51,489.88,Single-ply,SBD,M,
Boys,124.74,2,Zach Tubbs,Northwest Nelson,113.4,192.78,102.06,192.78,487.61,Single-ply,SBD,M,
Boys,124.74,3,Hunter Erb,Northwest Eaton,124.74,179.17,117.93,188.24,485.34,Single-ply,SBD,M,
Boys,124.74,4,Mike Nichols,Justin Northwest,120.2,170.1,122.47,181.44,474,Single-ply,SBD,M,
Boys,124.74,5,Matt Luna,Justin Northwest,114.31,127.01,120.2,163.29,410.5,Single-ply,SBD,M,
Boys,124.74,6,Jaylen Harris,Northwest Nelson,112.04,122.47,92.99,192.78,408.23,Single-ply,SBD,M,
Boys,124.74,7,Gavin Burris,Justin Northwest,114.31,111.13,61.23,115.67,288.03,Single-ply,SBD,M,
Boys,124.74,DQ,Yonas Daniel,Northwest Eaton,123.38,,,,,Single-ply,SBD,M,
Boys,124.74+,1,Femi Sakiri,Northwest Nelson,127.01,226.8,120.2,226.8,573.79,Single-ply,SBD,M,
Boys,124.74+,2,Tadd McGaughy,Northwest Nelson,135.62,215.46,115.67,229.06,560.19,Single-ply,SBD,M,
Boys,124.74+,3,Joshua Garza,Northwest Eaton,125.65,204.12,142.88,195.04,542.04,Single-ply,SBD,M,
Boys,124.74+,4,Brady Blankenship,Northwest Eaton,128.82,204.12,136.08,195.04,535.24,Single-ply,SBD,M,
Boys,124.74+,5,Matt Larsen,Justin Northwest,136.98,201.85,115.67,197.31,514.83,Single-ply,SBD,M,
Boys,124.74+,6,Heston Edwards,Northwest Eaton,140.16,174.63,122.47,181.44,478.54,Single-ply,SBD,M,
Boys,124.74+,7,Blaton Alexander,Justin Northwest,141.07,127.01,81.65,136.08,344.73,Single-ply,SBD,M,
Boys,124.74+,DQ,Micah Walters,Justin Northwest,125.65,,,,,Single-ply,SBD,M,
