Division,WeightClassKg,Place,Name,Team,BodyweightKg,Best3SquatKg,Best3BenchKg,Best3DeadliftKg,TotalKg,Equipment,Event,Sex,BirthDate
Girls,44.23,1,Ella Morton,Rusk,40.91,61.23,27.22,61.23,149.69,Single-ply,SBD,F,
Girls,44.23,2,Kaylynn Morris,Rusk,42.91,56.7,22.68,49.9,129.27,Single-ply,SBD,F,
Girls,47.85,1,Allisa Talley,Elkhart,44.72,90.72,38.56,97.52,226.8,Single-ply,SBD,F,
Girls,47.85,2,Laika Sanders,Shelbyville,47.72,88.45,36.29,99.79,224.53,Single-ply,SBD,F,
Girls,47.85,3,Hailey Reagan,Overton,46.08,81.65,38.56,86.18,206.38,Single-ply,SBD,F,
Girls,47.85,4,Sarah Whitt,Tatum,46.72,70.31,31.75,65.77,167.83,Single-ply,SBD,F,
Girls,51.94,1,Zoe Fields,Rusk,51.89,111.13,38.56,115.67,265.35,Single-ply,SBD,F,
Girls,51.94,2,Callie Selman,Frankston,50.98,99.79,40.82,97.52,238.14,Single-ply,SBD,F,
Girls,51.94,3,Jaycee Eastman,Troup,51.44,88.45,38.56,88.45,215.46,Single-ply,SBD,F,
Girls,51.94,4,Molly Choate,Warren,49.08,70.31,38.56,95.25,204.12,Single-ply,SBD,F,
Girls,51.94,5,Melanie Santos,Rusk,51.35,68.04,31.75,83.91,183.7,Single-ply,SBD,F,
Girls,51.94,DQ,Ja'Miyah Burton,Frankston,48.44,,,,,Single-ply,SBD,F,
Girls,56.02,1,Jordan Stephens,Elkhart,55.43,104.33,58.97,106.59,269.89,Single-ply,SBD,F,
Girls,56.02,2,Ruby Aquirre,Elkhart,54.98,88.45,38.56,92.99,219.99,Single-ply,SBD,F,
Girls,56.02,3,Hailey Attaway,Troup,53.61,63.5,38.56,65.77,167.83,Single-ply,SBD,F,
Girls,56.02,4,Zuri Flores,Rusk,54.52,61.23,24.95,77.11,163.29,Single-ply,SBD,F,
Girls,56.02,DQ,Kayla Moore,Elkhart,55.88,,,,,Single-ply,SBD,F,
Girls,60.1,1,Chloe Ives,Elkhart,59.33,147.42,63.5,131.54,342.46,Single-ply,SBD,F,
Girls,60.1,2,Alexis Cleaver,Rusk,59.6,92.99,36.29,117.93,247.21,Single-ply,SBD,F,
Girls,60.1,3,Mallorie Friday,Elkhart,59.78,92.99,45.36,92.99,231.33,Single-ply,SBD,F,
Girls,60.1,4,Cailyn Chapman,Grapeland,59.6,83.91,29.48,81.65,195.04,Single-ply,SBD,F,
Girls,60.1,5,Neena Smith,Shelbyville,56.43,68.04,31.75,81.65,181.44,Single-ply,SBD,F,
Girls,60.1,6,Giselle Hernandez,Shelbyville,59.06,63.5,31.75,86.18,181.44,Single-ply,SBD,F,
Girls,60.1,7,Keira DeCluette,Grapeland,60.06,115.67,,,115.67,Single-ply,S,F,
Girls,67.36,1,Arrana Gonzalez,Elkhart,64.59,133.81,58.97,122.47,315.25,Single-ply,SBD,F,
Girls,67.36,2,Tara Wells,Troup,64.86,124.74,47.63,120.2,292.57,Single-ply,SBD,F,
Girls,67.36,3,Lexi Vestal,Tatum,66.95,113.4,61.23,108.86,283.5,Single-ply,SBD,F,
Girls,67.36,4,Mason Blalock,Rusk,67.04,115.67,47.63,120.2,283.5,Single-ply,SBD,F,
Girls,67.36,5,Cailie Smith,Tatum,65.32,83.91,38.56,99.79,222.26,Single-ply,SBD,F,
Girls,67.36,6,Haylee Priest,Troup,63.78,74.84,49.9,86.18,210.92,Single-ply,SBD,F,
Girls,67.36,7,Emily Trowbridge,Rusk,65.95,74.84,36.29,79.38,190.51,Single-ply,SBD,F,
Girls,75.07,1,Kaela Davis,Frankston,74.57,145.15,81.65,149.69,376.48,Single-ply,SBD,F,
Girls,75.07,2,Makayla Martin,Tatum,75.02,129.27,79.38,133.81,342.46,Single-ply,SBD,F,
Girls,75.07,3,Quiaja Gates,Shelbyville,69.58,117.93,45.36,117.93,281.23,Single-ply,SBD,F,
Girls,75.07,4,Kaytee Compton,Warren,70.03,113.4,47.63,120.2,281.23,Single-ply,SBD,F,
Girls,75.07,5,Brilee King,Rusk,74.57,102.06,49.9,115.67,267.62,Single-ply,SBD,F,
Girls,75.07,6,Chloe Cleaver,Rusk,73.48,102.06,43.09,120.2,265.35,Single-ply,SBD,F,
Girls,75.07,7,Aniya Sutton,Rusk,73.66,90.72,43.09,113.4,247.21,Single-ply,SBD,F,
Girls,75.07,8,Talasia Lister,Shelbyville,74.66,90.72,45.36,102.06,238.14,Single-ply,SBD,F,
Girls,75.07,9,Skylar Harvey,Joaquin,69.22,,45.36,106.59,151.95,Single-ply,BD,F,
Girls,82.33,1,Natalie Jones,Frankston,76.48,129.27,65.77,127.01,322.05,Single-ply,SBD,F,
Girls,82.33,2,Sailor-Moon Nguyen,Frankston,77.29,120.2,52.16,108.86,281.23,Single-ply,SBD,F,
Girls,82.33,3,Alexis Shelton,Troup,75.93,113.4,61.23,104.33,278.96,Single-ply,SBD,F,
Girls,82.33,4,Asijia Moore,Shelbyville,81.01,113.4,43.09,97.52,254.01,Single-ply,SBD,F,
Girls,82.33,5,Ma'Kayja Horton,Shelbyville,79.65,97.52,49.9,104.33,251.74,Single-ply,SBD,F,
Girls,90.04,1,Stacy Perez,Grapeland,86.45,129.27,38.56,136.08,303.91,Single-ply,SBD,F,
Girls,90.04,2,Samantha Hall,Tatum,88.45,83.91,43.09,81.65,208.65,Single-ply,SBD,F,
Girls,90.04,3,Haley Boehm,Grapeland,84.01,83.91,,,83.91,Single-ply,S,F,
Girls,100.02,1,Amaiyah Coiciough,Tatum,97.89,154.22,90.72,154.22,399.16,Single-ply,SBD,F,
Girls,100.02,2,Baylea Densman,Tatum,98.25,161.03,65.77,136.08,362.87,Single-ply,SBD,F,
Girls,100.02,3,Regan Shofner,Troup,93.26,117.93,61.23,108.86,288.03,Single-ply,SBD,F,
Girls,100.02,4,Shi Norris,Joaquin,93.53,120.2,52.16,113.4,285.76,Single-ply,SBD,F,
Girls,100.02,5,Peyton Sartor,Overton,99.43,92.99,52.16,131.54,276.69,Single-ply,SBD,F,
Girls,100.02,6,Gabby Flores,Rusk,95.62,90.72,47.63,115.67,254.01,Single-ply,SBD,F,
Girls,117.71,1,Laci Clinard,Warren,101.42,129.27,63.5,133.81,326.59,Single-ply,SBD,F,
Girls,117.71,2,Kiriyana Roland,Overton,111.77,106.59,61.23,136.08,303.91,Single-ply,SBD,F,
Girls,117.71+,1,Alondra Salinas,Troup,128.73,226.8,99.79,165.56,492.15,Single-ply,SBD,F,
Girls,117.71+,2,Arionna Davis,Grapeland,130.09,156.49,63.5,124.74,344.73,Single-ply,SBD,F,
Girls,117.71+,3,Arielle Barnett,Grapeland,122.92,102.06,45.36,102.06,249.48,Single-ply,SBD,F,
