{
	"name":"JavaScript-server",
	"version": "1.0.0",
	"description" : "Boilerplate server-application",
	"main": "index.js",
	"scripts": {
		"test":"echo \"Error: no test specified\" && exit 1"
	}
}



{
  "name": "d1",
  "version": "1.0.0",
  "description": "This is just a demo of pkg.json file",
  "main": "script.js",
  "scripts": {
    "test": "echo \"Error: no test specified\" && exit 1"
  },
  "author": "Kristin Rammos",
  "license": "ISC"
}
