,Page_blocks0 F1 Score,Page_blocks0 G-Mean,Pima F1 Score,Pima G-Mean,Poker F1 Score,Poker G-Mean,Abalone19 F1 Score,Abalone19 G-Mean,Vehicle1 F1 Score,Vehicle1 G-Mean,Shuttle F1 Score,Shuttle G-Mean,Yeast1 F1 Score,Yeast1 G-Mean,Yeast3 F1 Score,Yeast3 G-Mean,Wine_Red F1 Score,Wine_Red G-Mean,Segment0 F1 Score,Segment0 G-Mean
Baseline,0.909 ± 0.012,0.889 ± 0.016,0.694 ± 0.026,0.688 ± 0.026,0.598 ± 0.100,0.562 ± 0.062,0.498 ± 0.000,0.500 ± 0.000,0.694 ± 0.034,0.691 ± 0.036,0.996 ± 0.004,0.992 ± 0.008,0.667 ± 0.024,0.658 ± 0.024,0.855 ± 0.025,0.835 ± 0.032,0.507 ± 0.029,0.508 ± 0.016,0.984 ± 0.007,0.983 ± 0.009
"SMOTE(k=3, samples=1)",0.906 ± 0.011,0.927 ± 0.011,0.690 ± 0.030,0.719 ± 0.028,0.787 ± 0.111,0.733 ± 0.111,0.503 ± 0.021,0.503 ± 0.016,0.707 ± 0.023,0.755 ± 0.029,0.996 ± 0.004,0.992 ± 0.008,0.659 ± 0.024,0.683 ± 0.026,0.836 ± 0.023,0.887 ± 0.024,0.553 ± 0.053,0.546 ± 0.047,0.977 ± 0.006,0.987 ± 0.007
"SMOTE(k=3, samples=5)",0.787 ± 0.013,0.910 ± 0.010,0.523 ± 0.035,0.624 ± 0.025,0.827 ± 0.089,0.917 ± 0.105,0.508 ± 0.018,0.518 ± 0.035,0.624 ± 0.024,0.734 ± 0.024,0.989 ± 0.011,0.991 ± 0.009,0.563 ± 0.026,0.650 ± 0.027,0.674 ± 0.020,0.848 ± 0.018,0.537 ± 0.033,0.583 ± 0.060,0.891 ± 0.016,0.962 ± 0.008
"SMOTE(k=3, samples=10)",0.701 ± 0.020,0.875 ± 0.014,0.439 ± 0.032,0.579 ± 0.020,0.789 ± 0.058,0.955 ± 0.065,0.503 ± 0.016,0.523 ± 0.047,0.563 ± 0.027,0.695 ± 0.024,0.953 ± 0.021,0.986 ± 0.010,0.504 ± 0.021,0.620 ± 0.019,0.574 ± 0.022,0.794 ± 0.020,0.521 ± 0.025,0.603 ± 0.058,0.762 ± 0.019,0.902 ± 0.010
"SMOTE(k=3, samples=20)",0.622 ± 0.025,0.833 ± 0.018,0.373 ± 0.028,0.546 ± 0.016,0.726 ± 0.050,0.959 ± 0.062,0.501 ± 0.011,0.553 ± 0.049,0.508 ± 0.034,0.662 ± 0.027,0.761 ± 0.033,0.940 ± 0.017,0.462 ± 0.021,0.602 ± 0.017,0.457 ± 0.021,0.712 ± 0.018,0.494 ± 0.022,0.610 ± 0.060,0.556 ± 0.023,0.767 ± 0.016
"SMOTE(k=5, samples=1)",0.906 ± 0.010,0.926 ± 0.012,0.690 ± 0.027,0.718 ± 0.026,0.769 ± 0.111,0.716 ± 0.107,0.501 ± 0.020,0.501 ± 0.011,0.705 ± 0.025,0.753 ± 0.031,0.996 ± 0.004,0.992 ± 0.008,0.655 ± 0.026,0.679 ± 0.029,0.834 ± 0.022,0.885 ± 0.026,0.551 ± 0.049,0.544 ± 0.043,0.976 ± 0.006,0.986 ± 0.007
"SMOTE(k=5, samples=5)",0.788 ± 0.015,0.912 ± 0.012,0.527 ± 0.038,0.628 ± 0.027,0.828 ± 0.080,0.929 ± 0.078,0.505 ± 0.018,0.516 ± 0.038,0.617 ± 0.027,0.730 ± 0.025,0.990 ± 0.011,0.991 ± 0.009,0.561 ± 0.024,0.651 ± 0.024,0.672 ± 0.022,0.846 ± 0.019,0.546 ± 0.035,0.598 ± 0.059,0.890 ± 0.015,0.962 ± 0.007
"SMOTE(k=5, samples=10)",0.701 ± 0.017,0.875 ± 0.012,0.430 ± 0.035,0.575 ± 0.022,0.790 ± 0.060,0.964 ± 0.062,0.507 ± 0.017,0.539 ± 0.053,0.553 ± 0.022,0.691 ± 0.020,0.953 ± 0.020,0.986 ± 0.010,0.495 ± 0.022,0.617 ± 0.020,0.569 ± 0.020,0.790 ± 0.020,0.525 ± 0.026,0.615 ± 0.060,0.760 ± 0.019,0.901 ± 0.010
"SMOTE(k=5, samples=20)",0.615 ± 0.020,0.828 ± 0.014,0.361 ± 0.028,0.541 ± 0.017,0.724 ± 0.053,0.970 ± 0.043,0.503 ± 0.014,0.574 ± 0.064,0.492 ± 0.035,0.654 ± 0.026,0.761 ± 0.034,0.939 ± 0.017,0.445 ± 0.023,0.597 ± 0.017,0.447 ± 0.021,0.705 ± 0.018,0.491 ± 0.021,0.614 ± 0.063,0.555 ± 0.023,0.766 ± 0.017
"SMOTE(k=7, samples=1)",0.908 ± 0.011,0.928 ± 0.011,0.690 ± 0.034,0.718 ± 0.034,0.791 ± 0.122,0.737 ± 0.122,0.505 ± 0.027,0.503 ± 0.016,0.705 ± 0.020,0.755 ± 0.023,0.996 ± 0.004,0.992 ± 0.008,0.661 ± 0.027,0.685 ± 0.029,0.834 ± 0.021,0.887 ± 0.024,0.557 ± 0.068,0.550 ± 0.058,0.976 ± 0.005,0.987 ± 0.005
"SMOTE(k=7, samples=5)",0.786 ± 0.015,0.911 ± 0.011,0.515 ± 0.034,0.620 ± 0.025,0.828 ± 0.083,0.921 ± 0.095,0.511 ± 0.020,0.523 ± 0.035,0.615 ± 0.023,0.729 ± 0.022,0.990 ± 0.011,0.991 ± 0.009,0.556 ± 0.027,0.649 ± 0.026,0.670 ± 0.020,0.845 ± 0.017,0.544 ± 0.037,0.593 ± 0.061,0.891 ± 0.016,0.962 ± 0.007
"SMOTE(k=7, samples=10)",0.693 ± 0.020,0.872 ± 0.013,0.421 ± 0.033,0.570 ± 0.021,0.784 ± 0.069,0.967 ± 0.060,0.508 ± 0.017,0.539 ± 0.049,0.551 ± 0.026,0.690 ± 0.024,0.953 ± 0.021,0.986 ± 0.010,0.489 ± 0.020,0.616 ± 0.018,0.568 ± 0.021,0.790 ± 0.020,0.525 ± 0.023,0.618 ± 0.056,0.761 ± 0.018,0.902 ± 0.010
"SMOTE(k=7, samples=20)",0.605 ± 0.021,0.823 ± 0.015,0.355 ± 0.030,0.540 ± 0.017,0.713 ± 0.048,0.969 ± 0.054,0.508 ± 0.015,0.599 ± 0.065,0.481 ± 0.037,0.647 ± 0.027,0.759 ± 0.034,0.939 ± 0.017,0.436 ± 0.023,0.592 ± 0.017,0.441 ± 0.020,0.700 ± 0.018,0.494 ± 0.022,0.618 ± 0.064,0.553 ± 0.022,0.765 ± 0.016
"SMOTE(k=10, samples=1)",0.907 ± 0.011,0.927 ± 0.012,0.691 ± 0.031,0.719 ± 0.032,0.811 ± 0.113,0.758 ± 0.125,0.500 ± 0.012,0.501 ± 0.011,0.709 ± 0.023,0.758 ± 0.027,0.996 ± 0.004,0.992 ± 0.008,0.661 ± 0.024,0.685 ± 0.024,0.835 ± 0.022,0.886 ± 0.024,0.547 ± 0.045,0.541 ± 0.039,0.977 ± 0.005,0.987 ± 0.006
"SMOTE(k=10, samples=5)",0.784 ± 0.015,0.911 ± 0.011,0.520 ± 0.039,0.625 ± 0.027,0.837 ± 0.071,0.925 ± 0.084,0.513 ± 0.028,0.526 ± 0.047,0.613 ± 0.026,0.729 ± 0.022,0.990 ± 0.011,0.991 ± 0.009,0.553 ± 0.024,0.650 ± 0.023,0.670 ± 0.018,0.845 ± 0.019,0.545 ± 0.034,0.598 ± 0.060,0.892 ± 0.016,0.963 ± 0.008
"SMOTE(k=10, samples=10)",0.688 ± 0.019,0.870 ± 0.013,0.420 ± 0.033,0.571 ± 0.022,0.788 ± 0.068,0.963 ± 0.062,0.507 ± 0.019,0.541 ± 0.059,0.544 ± 0.026,0.687 ± 0.022,0.954 ± 0.021,0.986 ± 0.010,0.482 ± 0.022,0.614 ± 0.019,0.562 ± 0.021,0.785 ± 0.020,0.523 ± 0.027,0.609 ± 0.059,0.761 ± 0.019,0.902 ± 0.010
"SMOTE(k=10, samples=20)",0.590 ± 0.023,0.812 ± 0.017,0.351 ± 0.023,0.538 ± 0.012,0.705 ± 0.043,0.980 ± 0.023,0.506 ± 0.011,0.594 ± 0.058,0.475 ± 0.034,0.646 ± 0.023,0.760 ± 0.034,0.939 ± 0.017,0.428 ± 0.020,0.591 ± 0.015,0.438 ± 0.020,0.698 ± 0.017,0.494 ± 0.023,0.622 ± 0.060,0.553 ± 0.023,0.765 ± 0.016
Undersampling,0.866 ± 0.014,0.937 ± 0.009,0.698 ± 0.028,0.710 ± 0.028,0.249 ± 0.047,0.610 ± 0.094,0.381 ± 0.027,0.681 ± 0.084,0.681 ± 0.022,0.744 ± 0.028,0.995 ± 0.005,0.995 ± 0.007,0.668 ± 0.018,0.701 ± 0.019,0.794 ± 0.024,0.902 ± 0.018,0.477 ± 0.025,0.679 ± 0.057,0.914 ± 0.019,0.968 ± 0.007
