,Page_blocks0 F1 Score,Page_blocks0 G-Mean,Pima F1 Score,Pima G-Mean,Poker F1 Score,Poker G-Mean,Abalone19 F1 Score,Abalone19 G-Mean,Vehicle1 F1 Score,Vehicle1 G-Mean,Shuttle F1 Score,Shuttle G-Mean,Yeast1 F1 Score,Yeast1 G-Mean,Yeast3 F1 Score,Yeast3 G-Mean,Wine_Red F1 Score,Wine_Red G-Mean,Segment0 F1 Score,Segment0 G-Mean
Baseline,0.848 ± 0.014,0.810 ± 0.017,0.730 ± 0.026,0.721 ± 0.025,0.497 ± 0.000,0.500 ± 0.000,0.498 ± 0.000,0.500 ± 0.000,0.710 ± 0.032,0.692 ± 0.029,0.997 ± 0.004,0.995 ± 0.007,0.646 ± 0.024,0.633 ± 0.020,0.846 ± 0.021,0.826 ± 0.031,0.498 ± 0.020,0.503 ± 0.011,0.993 ± 0.005,0.991 ± 0.006
"SMOTE(k=3, samples=1)",0.855 ± 0.013,0.875 ± 0.014,0.721 ± 0.027,0.748 ± 0.025,0.504 ± 0.036,0.504 ± 0.022,0.498 ± 0.000,0.500 ± 0.000,0.742 ± 0.027,0.786 ± 0.027,0.997 ± 0.004,0.995 ± 0.007,0.686 ± 0.020,0.710 ± 0.020,0.836 ± 0.022,0.882 ± 0.023,0.519 ± 0.036,0.515 ± 0.022,0.983 ± 0.005,0.990 ± 0.004
"SMOTE(k=3, samples=5)",0.671 ± 0.014,0.861 ± 0.012,0.481 ± 0.029,0.611 ± 0.019,0.524 ± 0.068,0.517 ± 0.043,0.502 ± 0.020,0.502 ± 0.016,0.590 ± 0.024,0.719 ± 0.018,0.985 ± 0.008,0.993 ± 0.008,0.461 ± 0.023,0.619 ± 0.013,0.666 ± 0.022,0.863 ± 0.015,0.577 ± 0.040,0.611 ± 0.050,0.644 ± 0.020,0.829 ± 0.014
"SMOTE(k=3, samples=10)",0.410 ± 0.022,0.685 ± 0.015,0.356 ± 0.025,0.543 ± 0.013,0.534 ± 0.075,0.525 ± 0.050,0.521 ± 0.031,0.530 ± 0.042,0.481 ± 0.023,0.649 ± 0.015,0.780 ± 0.021,0.949 ± 0.008,0.316 ± 0.018,0.541 ± 0.008,0.526 ± 0.018,0.770 ± 0.013,0.538 ± 0.028,0.673 ± 0.058,0.492 ± 0.016,0.720 ± 0.012
"SMOTE(k=3, samples=20)",0.154 ± 0.025,0.528 ± 0.012,0.293 ± 0.013,0.514 ± 0.006,0.521 ± 0.051,0.524 ± 0.052,0.512 ± 0.018,0.565 ± 0.060,0.397 ± 0.022,0.600 ± 0.013,0.515 ± 0.013,0.802 ± 0.011,0.255 ± 0.012,0.514 ± 0.005,0.377 ± 0.018,0.661 ± 0.012,0.453 ± 0.019,0.684 ± 0.054,0.431 ± 0.015,0.677 ± 0.010
"SMOTE(k=5, samples=1)",0.855 ± 0.013,0.874 ± 0.014,0.718 ± 0.029,0.746 ± 0.027,0.504 ± 0.036,0.504 ± 0.022,0.498 ± 0.000,0.500 ± 0.000,0.745 ± 0.027,0.789 ± 0.029,0.997 ± 0.004,0.995 ± 0.007,0.686 ± 0.021,0.710 ± 0.021,0.836 ± 0.021,0.882 ± 0.022,0.526 ± 0.042,0.519 ± 0.026,0.983 ± 0.005,0.990 ± 0.004
"SMOTE(k=5, samples=5)",0.672 ± 0.015,0.862 ± 0.012,0.481 ± 0.028,0.611 ± 0.020,0.511 ± 0.050,0.508 ± 0.031,0.504 ± 0.022,0.504 ± 0.019,0.591 ± 0.024,0.721 ± 0.018,0.985 ± 0.009,0.993 ± 0.008,0.460 ± 0.023,0.618 ± 0.013,0.667 ± 0.022,0.863 ± 0.015,0.577 ± 0.037,0.615 ± 0.048,0.644 ± 0.020,0.829 ± 0.014
"SMOTE(k=5, samples=10)",0.411 ± 0.022,0.685 ± 0.015,0.350 ± 0.024,0.541 ± 0.013,0.542 ± 0.081,0.529 ± 0.053,0.517 ± 0.027,0.524 ± 0.036,0.481 ± 0.023,0.649 ± 0.015,0.781 ± 0.021,0.949 ± 0.008,0.317 ± 0.019,0.542 ± 0.009,0.527 ± 0.020,0.770 ± 0.015,0.535 ± 0.025,0.670 ± 0.056,0.492 ± 0.016,0.720 ± 0.011
"SMOTE(k=5, samples=20)",0.153 ± 0.027,0.527 ± 0.013,0.293 ± 0.013,0.514 ± 0.006,0.528 ± 0.060,0.525 ± 0.053,0.515 ± 0.019,0.571 ± 0.057,0.395 ± 0.023,0.599 ± 0.014,0.515 ± 0.015,0.801 ± 0.012,0.255 ± 0.012,0.514 ± 0.006,0.376 ± 0.017,0.660 ± 0.012,0.452 ± 0.018,0.683 ± 0.057,0.430 ± 0.015,0.676 ± 0.011
"SMOTE(k=7, samples=1)",0.855 ± 0.012,0.874 ± 0.014,0.719 ± 0.029,0.747 ± 0.026,0.504 ± 0.036,0.504 ± 0.022,0.498 ± 0.000,0.500 ± 0.000,0.746 ± 0.026,0.791 ± 0.027,0.997 ± 0.004,0.995 ± 0.007,0.686 ± 0.020,0.710 ± 0.020,0.837 ± 0.020,0.882 ± 0.022,0.521 ± 0.036,0.516 ± 0.022,0.982 ± 0.006,0.990 ± 0.004
"SMOTE(k=7, samples=5)",0.672 ± 0.014,0.861 ± 0.013,0.479 ± 0.028,0.610 ± 0.019,0.504 ± 0.036,0.504 ± 0.022,0.514 ± 0.034,0.511 ± 0.025,0.592 ± 0.024,0.721 ± 0.019,0.985 ± 0.009,0.993 ± 0.008,0.462 ± 0.023,0.619 ± 0.013,0.668 ± 0.021,0.864 ± 0.015,0.576 ± 0.038,0.612 ± 0.052,0.647 ± 0.020,0.831 ± 0.014
"SMOTE(k=7, samples=10)",0.409 ± 0.024,0.684 ± 0.016,0.349 ± 0.024,0.540 ± 0.013,0.511 ± 0.050,0.508 ± 0.031,0.517 ± 0.026,0.524 ± 0.036,0.479 ± 0.022,0.649 ± 0.014,0.782 ± 0.021,0.950 ± 0.008,0.318 ± 0.018,0.543 ± 0.008,0.527 ± 0.019,0.771 ± 0.014,0.536 ± 0.027,0.669 ± 0.059,0.492 ± 0.016,0.720 ± 0.011
"SMOTE(k=7, samples=20)",0.152 ± 0.030,0.527 ± 0.015,0.291 ± 0.013,0.514 ± 0.007,0.534 ± 0.062,0.534 ± 0.057,0.515 ± 0.019,0.570 ± 0.054,0.395 ± 0.023,0.599 ± 0.013,0.515 ± 0.014,0.801 ± 0.012,0.255 ± 0.012,0.514 ± 0.006,0.375 ± 0.018,0.659 ± 0.013,0.453 ± 0.019,0.684 ± 0.056,0.430 ± 0.015,0.676 ± 0.011
"SMOTE(k=10, samples=1)",0.856 ± 0.013,0.874 ± 0.014,0.722 ± 0.028,0.749 ± 0.026,0.497 ± 0.000,0.500 ± 0.000,0.498 ± 0.000,0.500 ± 0.000,0.746 ± 0.028,0.790 ± 0.030,0.997 ± 0.004,0.995 ± 0.007,0.685 ± 0.020,0.710 ± 0.020,0.836 ± 0.021,0.883 ± 0.022,0.516 ± 0.042,0.513 ± 0.026,0.983 ± 0.005,0.990 ± 0.004
"SMOTE(k=10, samples=5)",0.673 ± 0.014,0.862 ± 0.012,0.477 ± 0.028,0.608 ± 0.019,0.511 ± 0.050,0.508 ± 0.031,0.511 ± 0.030,0.508 ± 0.023,0.590 ± 0.024,0.720 ± 0.019,0.985 ± 0.009,0.993 ± 0.008,0.463 ± 0.023,0.620 ± 0.013,0.669 ± 0.022,0.864 ± 0.015,0.577 ± 0.039,0.613 ± 0.050,0.648 ± 0.021,0.832 ± 0.014
"SMOTE(k=10, samples=10)",0.407 ± 0.024,0.682 ± 0.016,0.348 ± 0.024,0.540 ± 0.013,0.509 ± 0.046,0.508 ± 0.031,0.518 ± 0.028,0.526 ± 0.039,0.479 ± 0.025,0.649 ± 0.015,0.783 ± 0.021,0.950 ± 0.008,0.319 ± 0.019,0.543 ± 0.009,0.531 ± 0.019,0.773 ± 0.014,0.539 ± 0.029,0.673 ± 0.063,0.493 ± 0.016,0.721 ± 0.012
"SMOTE(k=10, samples=20)",0.151 ± 0.027,0.526 ± 0.013,0.291 ± 0.012,0.514 ± 0.006,0.519 ± 0.049,0.521 ± 0.049,0.515 ± 0.018,0.572 ± 0.058,0.395 ± 0.022,0.599 ± 0.013,0.515 ± 0.013,0.802 ± 0.011,0.255 ± 0.012,0.514 ± 0.006,0.377 ± 0.018,0.661 ± 0.012,0.453 ± 0.019,0.686 ± 0.055,0.429 ± 0.016,0.676 ± 0.011
Undersampling,0.825 ± 0.014,0.905 ± 0.014,0.733 ± 0.025,0.744 ± 0.025,0.300 ± 0.026,0.489 ± 0.128,0.440 ± 0.022,0.773 ± 0.086,0.743 ± 0.027,0.787 ± 0.030,0.997 ± 0.004,0.995 ± 0.007,0.685 ± 0.020,0.713 ± 0.021,0.804 ± 0.025,0.901 ± 0.021,0.459 ± 0.020,0.660 ± 0.057,0.978 ± 0.014,0.987 ± 0.006
