,Shuttle F1 Score,Shuttle G-Mean,Yeast1 F1 Score,Yeast1 G-Mean,Yeast3 F1 Score,Yeast3 G-Mean,Wine_Red F1 Score,Wine_Red G-Mean
Baseline,1.000 ± 0.000,1.000 ± 0.000,0.647 ± 0.025,0.648 ± 0.026,0.816 ± 0.030,0.821 ± 0.042,0.538 ± 0.038,0.541 ± 0.042
"SMOTE(k=3, samples=1)",0.992 ± 0.010,0.999 ± 0.001,0.522 ± 0.043,0.585 ± 0.039,0.763 ± 0.038,0.839 ± 0.033,0.531 ± 0.035,0.547 ± 0.047
"SMOTE(k=3, samples=5)",0.876 ± 0.052,0.978 ± 0.012,0.487 ± 0.034,0.587 ± 0.024,0.648 ± 0.037,0.819 ± 0.029,0.518 ± 0.030,0.557 ± 0.057
"SMOTE(k=3, samples=10)",0.712 ± 0.034,0.927 ± 0.015,0.467 ± 0.031,0.586 ± 0.024,0.536 ± 0.039,0.749 ± 0.040,0.505 ± 0.032,0.555 ± 0.076
"SMOTE(k=3, samples=20)",0.593 ± 0.026,0.862 ± 0.017,0.443 ± 0.038,0.576 ± 0.025,0.423 ± 0.036,0.664 ± 0.033,0.491 ± 0.024,0.545 ± 0.064
"SMOTE(k=5, samples=1)",0.991 ± 0.009,0.999 ± 0.001,0.513 ± 0.051,0.584 ± 0.039,0.776 ± 0.040,0.846 ± 0.034,0.524 ± 0.029,0.543 ± 0.045
"SMOTE(k=5, samples=5)",0.866 ± 0.043,0.976 ± 0.010,0.462 ± 0.041,0.578 ± 0.031,0.637 ± 0.032,0.811 ± 0.026,0.512 ± 0.027,0.549 ± 0.046
"SMOTE(k=5, samples=10)",0.705 ± 0.033,0.924 ± 0.014,0.452 ± 0.031,0.579 ± 0.025,0.532 ± 0.036,0.743 ± 0.032,0.499 ± 0.023,0.554 ± 0.054
"SMOTE(k=5, samples=20)",0.589 ± 0.021,0.859 ± 0.014,0.419 ± 0.035,0.565 ± 0.024,0.416 ± 0.036,0.664 ± 0.035,0.485 ± 0.025,0.539 ± 0.063
"SMOTE(k=7, samples=1)",0.993 ± 0.009,0.999 ± 0.001,0.519 ± 0.049,0.589 ± 0.040,0.777 ± 0.048,0.843 ± 0.045,0.526 ± 0.039,0.542 ± 0.057
"SMOTE(k=7, samples=5)",0.863 ± 0.049,0.975 ± 0.011,0.476 ± 0.032,0.589 ± 0.024,0.629 ± 0.034,0.805 ± 0.031,0.519 ± 0.030,0.568 ± 0.066
"SMOTE(k=7, samples=10)",0.710 ± 0.032,0.926 ± 0.014,0.441 ± 0.037,0.574 ± 0.031,0.531 ± 0.039,0.744 ± 0.036,0.501 ± 0.022,0.552 ± 0.051
"SMOTE(k=7, samples=20)",0.590 ± 0.021,0.860 ± 0.014,0.410 ± 0.033,0.564 ± 0.024,0.409 ± 0.036,0.658 ± 0.034,0.482 ± 0.021,0.546 ± 0.058
"SMOTE(k=10, samples=1)",0.993 ± 0.008,0.999 ± 0.001,0.526 ± 0.044,0.588 ± 0.034,0.781 ± 0.032,0.848 ± 0.029,0.529 ± 0.036,0.545 ± 0.047
"SMOTE(k=10, samples=5)",0.858 ± 0.053,0.973 ± 0.012,0.467 ± 0.037,0.584 ± 0.026,0.640 ± 0.034,0.816 ± 0.033,0.512 ± 0.029,0.550 ± 0.054
"SMOTE(k=10, samples=10)",0.700 ± 0.035,0.921 ± 0.015,0.439 ± 0.041,0.575 ± 0.028,0.522 ± 0.045,0.737 ± 0.042,0.504 ± 0.024,0.570 ± 0.061
"SMOTE(k=10, samples=20)",0.594 ± 0.025,0.862 ± 0.016,0.407 ± 0.038,0.567 ± 0.027,0.413 ± 0.023,0.662 ± 0.025,0.484 ± 0.025,0.561 ± 0.070
Undersampling,0.999 ± 0.002,1.000 ± 0.000,0.621 ± 0.023,0.650 ± 0.026,0.789 ± 0.031,0.885 ± 0.026,0.433 ± 0.029,0.625 ± 0.071
