,Page_blocks0 F1 Score,Page_blocks0 G-Mean,Pima F1 Score,Pima G-Mean,Poker F1 Score,Poker G-Mean,Abalone19 F1 Score,Abalone19 G-Mean,Vehicle1 F1 Score,Vehicle1 G-Mean,Shuttle F1 Score,Shuttle G-Mean,Yeast1 F1 Score,Yeast1 G-Mean,Yeast3 F1 Score,Yeast3 G-Mean,Wine_Red F1 Score,Wine_Red G-Mean,Segment0 F1 Score,Segment0 G-Mean
Baseline,0.894 ± 0.013,0.860 ± 0.016,0.713 ± 0.032,0.704 ± 0.032,0.524 ± 0.068,0.517 ± 0.042,0.498 ± 0.000,0.500 ± 0.000,0.659 ± 0.033,0.640 ± 0.027,0.989 ± 0.007,0.982 ± 0.013,0.669 ± 0.026,0.653 ± 0.022,0.866 ± 0.023,0.847 ± 0.030,0.492 ± 0.000,0.500 ± 0.000,0.990 ± 0.006,0.986 ± 0.009
"SMOTE(k=3, samples=1)",0.909 ± 0.014,0.918 ± 0.013,0.718 ± 0.029,0.748 ± 0.028,0.653 ± 0.100,0.600 ± 0.068,0.498 ± 0.000,0.500 ± 0.000,0.755 ± 0.026,0.805 ± 0.030,0.990 ± 0.007,0.988 ± 0.014,0.694 ± 0.022,0.722 ± 0.020,0.874 ± 0.020,0.907 ± 0.024,0.492 ± 0.000,0.500 ± 0.000,0.991 ± 0.006,0.990 ± 0.007
"SMOTE(k=3, samples=3)",0.821 ± 0.016,0.933 ± 0.009,0.588 ± 0.034,0.670 ± 0.026,0.662 ± 0.109,0.608 ± 0.077,0.498 ± 0.000,0.500 ± 0.000,0.727 ± 0.024,0.818 ± 0.020,0.988 ± 0.008,0.991 ± 0.014,0.563 ± 0.022,0.669 ± 0.019,0.780 ± 0.025,0.903 ± 0.017,0.517 ± 0.034,0.515 ± 0.025,0.954 ± 0.014,0.984 ± 0.006
"SMOTE(k=3, samples=5)",0.713 ± 0.013,0.893 ± 0.007,0.512 ± 0.036,0.622 ± 0.028,0.761 ± 0.141,0.704 ± 0.139,0.498 ± 0.000,0.500 ± 0.000,0.690 ± 0.026,0.796 ± 0.019,0.982 ± 0.018,0.989 ± 0.029,0.495 ± 0.020,0.636 ± 0.015,0.697 ± 0.024,0.869 ± 0.019,0.569 ± 0.042,0.592 ± 0.055,0.858 ± 0.020,0.948 ± 0.010
"SMOTE(k=3, samples=10)",0.482 ± 0.025,0.743 ± 0.019,0.410 ± 0.032,0.565 ± 0.020,0.869 ± 0.114,0.817 ± 0.132,0.498 ± 0.000,0.500 ± 0.000,0.617 ± 0.025,0.745 ± 0.018,0.868 ± 0.040,0.960 ± 0.055,0.393 ± 0.022,0.577 ± 0.014,0.565 ± 0.020,0.787 ± 0.019,0.548 ± 0.037,0.660 ± 0.074,0.662 ± 0.022,0.840 ± 0.015
"SMOTE(k=3, samples=15)",0.369 ± 0.018,0.660 ± 0.013,0.370 ± 0.031,0.545 ± 0.018,0.908 ± 0.097,0.867 ± 0.129,0.504 ± 0.019,0.505 ± 0.021,0.580 ± 0.028,0.719 ± 0.020,0.711 ± 0.038,0.909 ± 0.065,0.357 ± 0.020,0.557 ± 0.012,0.490 ± 0.021,0.733 ± 0.019,0.523 ± 0.028,0.671 ± 0.075,0.553 ± 0.025,0.763 ± 0.018
"SMOTE(k=3, samples=20)",0.322 ± 0.019,0.628 ± 0.012,0.353 ± 0.029,0.538 ± 0.018,0.920 ± 0.088,0.883 ± 0.120,0.507 ± 0.017,0.532 ± 0.047,0.562 ± 0.030,0.706 ± 0.022,0.621 ± 0.035,0.857 ± 0.078,0.342 ± 0.017,0.549 ± 0.011,0.436 ± 0.021,0.693 ± 0.021,0.502 ± 0.024,0.666 ± 0.070,0.483 ± 0.024,0.713 ± 0.017
"SMOTE(k=3, samples=30)",0.268 ± 0.027,0.593 ± 0.016,0.334 ± 0.030,0.528 ± 0.017,0.938 ± 0.075,0.908 ± 0.107,0.507 ± 0.011,0.624 ± 0.068,0.539 ± 0.034,0.690 ± 0.024,0.506 ± 0.033,0.769 ± 0.098,0.329 ± 0.017,0.543 ± 0.011,0.360 ± 0.019,0.640 ± 0.018,0.469 ± 0.022,0.640 ± 0.073,0.417 ± 0.022,0.666 ± 0.015
"SMOTE(k=5, samples=1)",0.908 ± 0.013,0.916 ± 0.013,0.719 ± 0.029,0.748 ± 0.029,0.618 ± 0.098,0.575 ± 0.061,0.498 ± 0.000,0.500 ± 0.000,0.752 ± 0.027,0.799 ± 0.031,0.989 ± 0.007,0.987 ± 0.014,0.692 ± 0.023,0.720 ± 0.021,0.873 ± 0.021,0.904 ± 0.025,0.492 ± 0.000,0.500 ± 0.001,0.992 ± 0.006,0.991 ± 0.008
"SMOTE(k=5, samples=3)",0.821 ± 0.015,0.933 ± 0.009,0.587 ± 0.031,0.669 ± 0.024,0.669 ± 0.105,0.613 ± 0.075,0.498 ± 0.000,0.500 ± 0.000,0.726 ± 0.024,0.819 ± 0.021,0.987 ± 0.008,0.993 ± 0.013,0.564 ± 0.019,0.671 ± 0.016,0.779 ± 0.029,0.903 ± 0.019,0.528 ± 0.039,0.524 ± 0.031,0.954 ± 0.013,0.984 ± 0.006
"SMOTE(k=5, samples=5)",0.715 ± 0.012,0.894 ± 0.007,0.507 ± 0.037,0.620 ± 0.027,0.765 ± 0.127,0.704 ± 0.123,0.498 ± 0.000,0.500 ± 0.000,0.687 ± 0.023,0.795 ± 0.017,0.981 ± 0.018,0.988 ± 0.029,0.493 ± 0.019,0.635 ± 0.014,0.696 ± 0.024,0.868 ± 0.018,0.573 ± 0.043,0.596 ± 0.058,0.860 ± 0.017,0.949 ± 0.009
"SMOTE(k=5, samples=10)",0.475 ± 0.024,0.738 ± 0.018,0.403 ± 0.031,0.561 ± 0.020,0.899 ± 0.097,0.854 ± 0.129,0.498 ± 0.000,0.500 ± 0.000,0.615 ± 0.027,0.744 ± 0.020,0.866 ± 0.040,0.957 ± 0.057,0.389 ± 0.024,0.575 ± 0.015,0.566 ± 0.019,0.788 ± 0.018,0.551 ± 0.036,0.667 ± 0.074,0.662 ± 0.024,0.840 ± 0.016
"SMOTE(k=5, samples=15)",0.365 ± 0.019,0.658 ± 0.013,0.364 ± 0.029,0.543 ± 0.018,0.914 ± 0.088,0.875 ± 0.121,0.506 ± 0.022,0.507 ± 0.022,0.576 ± 0.029,0.715 ± 0.021,0.711 ± 0.032,0.912 ± 0.053,0.353 ± 0.020,0.555 ± 0.012,0.490 ± 0.019,0.734 ± 0.017,0.522 ± 0.028,0.672 ± 0.073,0.549 ± 0.025,0.760 ± 0.018
"SMOTE(k=5, samples=20)",0.314 ± 0.019,0.623 ± 0.012,0.345 ± 0.026,0.533 ± 0.015,0.935 ± 0.077,0.904 ± 0.110,0.514 ± 0.021,0.541 ± 0.051,0.556 ± 0.032,0.702 ± 0.023,0.621 ± 0.032,0.859 ± 0.071,0.339 ± 0.018,0.548 ± 0.011,0.433 ± 0.020,0.691 ± 0.020,0.500 ± 0.025,0.662 ± 0.071,0.481 ± 0.025,0.711 ± 0.018
"SMOTE(k=5, samples=30)",0.265 ± 0.025,0.592 ± 0.015,0.326 ± 0.024,0.524 ± 0.014,0.942 ± 0.072,0.912 ± 0.103,0.510 ± 0.014,0.648 ± 0.095,0.533 ± 0.036,0.686 ± 0.025,0.504 ± 0.033,0.768 ± 0.098,0.323 ± 0.017,0.540 ± 0.011,0.357 ± 0.018,0.638 ± 0.018,0.465 ± 0.021,0.631 ± 0.074,0.416 ± 0.020,0.665 ± 0.014
"SMOTE(k=7, samples=1)",0.908 ± 0.013,0.916 ± 0.014,0.720 ± 0.028,0.750 ± 0.026,0.638 ± 0.114,0.592 ± 0.079,0.498 ± 0.000,0.500 ± 0.000,0.758 ± 0.026,0.807 ± 0.030,0.990 ± 0.007,0.987 ± 0.014,0.690 ± 0.020,0.719 ± 0.019,0.873 ± 0.020,0.905 ± 0.025,0.492 ± 0.000,0.500 ± 0.001,0.992 ± 0.005,0.991 ± 0.007
"SMOTE(k=7, samples=3)",0.821 ± 0.015,0.933 ± 0.007,0.585 ± 0.037,0.668 ± 0.030,0.683 ± 0.110,0.625 ± 0.085,0.498 ± 0.000,0.500 ± 0.000,0.727 ± 0.024,0.820 ± 0.021,0.987 ± 0.009,0.992 ± 0.013,0.562 ± 0.021,0.669 ± 0.016,0.778 ± 0.029,0.901 ± 0.019,0.520 ± 0.038,0.518 ± 0.031,0.955 ± 0.012,0.984 ± 0.006
"SMOTE(k=7, samples=5)",0.713 ± 0.014,0.893 ± 0.009,0.506 ± 0.035,0.620 ± 0.027,0.789 ± 0.137,0.733 ± 0.140,0.498 ± 0.000,0.500 ± 0.000,0.684 ± 0.026,0.792 ± 0.020,0.981 ± 0.017,0.987 ± 0.028,0.493 ± 0.022,0.634 ± 0.015,0.695 ± 0.025,0.868 ± 0.019,0.576 ± 0.046,0.601 ± 0.063,0.861 ± 0.017,0.949 ± 0.009
"SMOTE(k=7, samples=10)",0.474 ± 0.027,0.737 ± 0.020,0.399 ± 0.032,0.560 ± 0.019,0.891 ± 0.094,0.842 ± 0.125,0.498 ± 0.000,0.500 ± 0.000,0.612 ± 0.028,0.742 ± 0.021,0.867 ± 0.036,0.961 ± 0.052,0.389 ± 0.020,0.574 ± 0.013,0.563 ± 0.020,0.785 ± 0.020,0.550 ± 0.034,0.658 ± 0.071,0.665 ± 0.023,0.842 ± 0.015
"SMOTE(k=7, samples=15)",0.362 ± 0.019,0.655 ± 0.013,0.360 ± 0.030,0.540 ± 0.017,0.924 ± 0.079,0.887 ± 0.113,0.504 ± 0.017,0.506 ± 0.022,0.575 ± 0.030,0.715 ± 0.022,0.709 ± 0.034,0.910 ± 0.056,0.350 ± 0.019,0.553 ± 0.012,0.487 ± 0.020,0.730 ± 0.019,0.524 ± 0.028,0.674 ± 0.068,0.550 ± 0.024,0.761 ± 0.018
"SMOTE(k=7, samples=20)",0.315 ± 0.024,0.623 ± 0.015,0.337 ± 0.025,0.529 ± 0.014,0.943 ± 0.073,0.912 ± 0.103,0.511 ± 0.020,0.537 ± 0.049,0.554 ± 0.032,0.700 ± 0.023,0.620 ± 0.031,0.859 ± 0.070,0.334 ± 0.018,0.545 ± 0.011,0.432 ± 0.020,0.690 ± 0.020,0.499 ± 0.024,0.660 ± 0.071,0.479 ± 0.025,0.709 ± 0.018
"SMOTE(k=7, samples=30)",0.258 ± 0.035,0.588 ± 0.020,0.322 ± 0.024,0.523 ± 0.015,0.950 ± 0.067,0.921 ± 0.094,0.510 ± 0.015,0.633 ± 0.081,0.531 ± 0.036,0.685 ± 0.025,0.502 ± 0.034,0.767 ± 0.098,0.319 ± 0.017,0.538 ± 0.011,0.353 ± 0.019,0.635 ± 0.019,0.464 ± 0.022,0.631 ± 0.075,0.418 ± 0.020,0.666 ± 0.014
"SMOTE(k=10, samples=1)",0.909 ± 0.012,0.916 ± 0.013,0.715 ± 0.028,0.745 ± 0.027,0.644 ± 0.089,0.592 ± 0.055,0.498 ± 0.000,0.500 ± 0.000,0.757 ± 0.026,0.804 ± 0.029,0.990 ± 0.007,0.987 ± 0.014,0.693 ± 0.021,0.722 ± 0.020,0.876 ± 0.021,0.908 ± 0.025,0.492 ± 0.000,0.500 ± 0.001,0.991 ± 0.005,0.990 ± 0.007
"SMOTE(k=10, samples=3)",0.821 ± 0.017,0.933 ± 0.009,0.583 ± 0.031,0.666 ± 0.024,0.685 ± 0.107,0.625 ± 0.079,0.498 ± 0.000,0.500 ± 0.000,0.725 ± 0.022,0.818 ± 0.019,0.988 ± 0.008,0.991 ± 0.014,0.563 ± 0.021,0.669 ± 0.017,0.779 ± 0.026,0.903 ± 0.019,0.525 ± 0.040,0.522 ± 0.033,0.955 ± 0.013,0.984 ± 0.006
"SMOTE(k=10, samples=5)",0.715 ± 0.013,0.894 ± 0.008,0.503 ± 0.037,0.617 ± 0.027,0.849 ± 0.101,0.787 ± 0.121,0.498 ± 0.000,0.500 ± 0.000,0.681 ± 0.027,0.790 ± 0.021,0.982 ± 0.017,0.989 ± 0.027,0.493 ± 0.022,0.635 ± 0.016,0.698 ± 0.027,0.869 ± 0.020,0.579 ± 0.046,0.606 ± 0.058,0.861 ± 0.017,0.949 ± 0.009
"SMOTE(k=10, samples=10)",0.472 ± 0.022,0.735 ± 0.017,0.397 ± 0.028,0.559 ± 0.018,0.912 ± 0.084,0.867 ± 0.111,0.498 ± 0.000,0.500 ± 0.000,0.609 ± 0.027,0.740 ± 0.021,0.866 ± 0.039,0.959 ± 0.055,0.385 ± 0.023,0.572 ± 0.013,0.565 ± 0.020,0.787 ± 0.018,0.550 ± 0.035,0.654 ± 0.073,0.664 ± 0.022,0.841 ± 0.015
"SMOTE(k=10, samples=15)",0.364 ± 0.020,0.657 ± 0.014,0.356 ± 0.027,0.539 ± 0.016,0.939 ± 0.072,0.904 ± 0.100,0.502 ± 0.017,0.504 ± 0.018,0.570 ± 0.030,0.712 ± 0.022,0.706 ± 0.037,0.904 ± 0.064,0.347 ± 0.020,0.552 ± 0.013,0.489 ± 0.020,0.732 ± 0.018,0.526 ± 0.028,0.681 ± 0.068,0.548 ± 0.025,0.759 ± 0.018
"SMOTE(k=10, samples=20)",0.315 ± 0.023,0.623 ± 0.014,0.337 ± 0.025,0.529 ± 0.014,0.942 ± 0.072,0.912 ± 0.103,0.515 ± 0.017,0.543 ± 0.040,0.548 ± 0.030,0.697 ± 0.022,0.619 ± 0.033,0.856 ± 0.076,0.330 ± 0.017,0.543 ± 0.011,0.430 ± 0.020,0.690 ± 0.019,0.498 ± 0.023,0.658 ± 0.065,0.479 ± 0.025,0.710 ± 0.017
"SMOTE(k=10, samples=30)",0.257 ± 0.040,0.588 ± 0.023,0.319 ± 0.023,0.521 ± 0.013,0.950 ± 0.067,0.925 ± 0.095,0.512 ± 0.016,0.648 ± 0.087,0.524 ± 0.034,0.680 ± 0.023,0.500 ± 0.032,0.765 ± 0.097,0.314 ± 0.018,0.535 ± 0.012,0.352 ± 0.020,0.634 ± 0.018,0.463 ± 0.022,0.629 ± 0.072,0.416 ± 0.020,0.665 ± 0.013
Undersampling,0.854 ± 0.015,0.916 ± 0.014,0.724 ± 0.028,0.738 ± 0.029,0.495 ± 0.063,0.777 ± 0.138,0.368 ± 0.046,0.678 ± 0.090,0.719 ± 0.020,0.782 ± 0.029,0.990 ± 0.008,0.998 ± 0.003,0.685 ± 0.025,0.720 ± 0.023,0.833 ± 0.024,0.912 ± 0.021,0.470 ± 0.023,0.677 ± 0.067,0.987 ± 0.006,0.987 ± 0.008
