,Page_blocks0 F1 Score,Page_blocks0 G-Mean,Poker F1 Score,Poker G-Mean,Vehicle1 F1 Score,Vehicle1 G-Mean,Yeast3 F1 Score,Yeast3 G-Mean,Wine_Red F1 Score,Wine_Red G-Mean,Segment0 F1 Score,Segment0 G-Mean
Baseline,0.909 ± 0.012,0.889 ± 0.016,0.598 ± 0.100,0.562 ± 0.062,0.694 ± 0.034,0.691 ± 0.036,0.855 ± 0.025,0.835 ± 0.032,0.507 ± 0.029,0.508 ± 0.016,0.984 ± 0.007,0.983 ± 0.009
"SMOTE(k=3, samples=1)",0.906 ± 0.012,0.926 ± 0.011,0.771 ± 0.108,0.716 ± 0.112,0.707 ± 0.021,0.755 ± 0.027,0.839 ± 0.023,0.887 ± 0.025,0.547 ± 0.050,0.539 ± 0.041,0.976 ± 0.006,0.986 ± 0.006
"SMOTE(k=3, samples=3)",0.842 ± 0.013,0.922 ± 0.011,0.839 ± 0.096,0.872 ± 0.107,0.658 ± 0.021,0.746 ± 0.022,0.737 ± 0.023,0.873 ± 0.020,0.552 ± 0.041,0.580 ± 0.058,0.945 ± 0.010,0.981 ± 0.005
"SMOTE(k=3, samples=5)",0.787 ± 0.013,0.909 ± 0.011,0.819 ± 0.080,0.908 ± 0.086,0.621 ± 0.023,0.732 ± 0.023,0.675 ± 0.021,0.848 ± 0.020,0.536 ± 0.033,0.581 ± 0.060,0.893 ± 0.016,0.963 ± 0.007
"SMOTE(k=3, samples=7)",0.748 ± 0.018,0.897 ± 0.012,0.810 ± 0.083,0.940 ± 0.084,0.593 ± 0.023,0.715 ± 0.023,0.627 ± 0.020,0.826 ± 0.020,0.533 ± 0.027,0.598 ± 0.053,0.841 ± 0.017,0.941 ± 0.008
"SMOTE(k=3, samples=10)",0.699 ± 0.018,0.874 ± 0.013,0.790 ± 0.074,0.951 ± 0.068,0.564 ± 0.025,0.695 ± 0.023,0.574 ± 0.022,0.793 ± 0.021,0.521 ± 0.025,0.607 ± 0.059,0.761 ± 0.020,0.902 ± 0.011
"SMOTE(k=3, samples=15)",0.654 ± 0.019,0.851 ± 0.014,0.759 ± 0.055,0.961 ± 0.062,0.531 ± 0.032,0.675 ± 0.027,0.506 ± 0.022,0.746 ± 0.021,0.507 ± 0.024,0.608 ± 0.064,0.653 ± 0.020,0.835 ± 0.013
"SMOTE(k=3, samples=20)",0.622 ± 0.021,0.833 ± 0.015,0.732 ± 0.055,0.959 ± 0.062,0.508 ± 0.037,0.662 ± 0.028,0.456 ± 0.023,0.710 ± 0.019,0.496 ± 0.024,0.613 ± 0.069,0.556 ± 0.023,0.767 ± 0.017
"SMOTE(k=3, samples=25)",0.594 ± 0.027,0.815 ± 0.020,0.716 ± 0.042,0.962 ± 0.059,0.492 ± 0.035,0.653 ± 0.026,0.412 ± 0.021,0.680 ± 0.017,0.485 ± 0.022,0.611 ± 0.061,0.481 ± 0.026,0.712 ± 0.019
"SMOTE(k=3, samples=30)",0.579 ± 0.027,0.805 ± 0.019,0.703 ± 0.041,0.972 ± 0.050,0.480 ± 0.037,0.646 ± 0.026,0.378 ± 0.021,0.660 ± 0.016,0.478 ± 0.023,0.617 ± 0.065,0.428 ± 0.026,0.675 ± 0.018
"SMOTE(k=5, samples=1)",0.908 ± 0.011,0.927 ± 0.010,0.818 ± 0.110,0.762 ± 0.113,0.709 ± 0.026,0.756 ± 0.031,0.834 ± 0.022,0.887 ± 0.023,0.548 ± 0.047,0.540 ± 0.041,0.977 ± 0.005,0.987 ± 0.006
"SMOTE(k=5, samples=3)",0.845 ± 0.014,0.925 ± 0.012,0.835 ± 0.078,0.864 ± 0.096,0.659 ± 0.026,0.752 ± 0.024,0.736 ± 0.023,0.872 ± 0.022,0.554 ± 0.038,0.581 ± 0.055,0.944 ± 0.012,0.981 ± 0.006
"SMOTE(k=5, samples=5)",0.787 ± 0.012,0.911 ± 0.010,0.846 ± 0.075,0.942 ± 0.077,0.618 ± 0.027,0.731 ± 0.024,0.671 ± 0.018,0.846 ± 0.016,0.543 ± 0.031,0.597 ± 0.056,0.893 ± 0.014,0.963 ± 0.007
"SMOTE(k=5, samples=7)",0.747 ± 0.018,0.897 ± 0.012,0.815 ± 0.072,0.944 ± 0.076,0.587 ± 0.024,0.712 ± 0.024,0.623 ± 0.020,0.823 ± 0.018,0.538 ± 0.028,0.611 ± 0.057,0.840 ± 0.017,0.941 ± 0.009
"SMOTE(k=5, samples=10)",0.699 ± 0.019,0.875 ± 0.014,0.787 ± 0.066,0.963 ± 0.062,0.556 ± 0.022,0.692 ± 0.020,0.569 ± 0.021,0.790 ± 0.020,0.523 ± 0.026,0.613 ± 0.058,0.761 ± 0.019,0.902 ± 0.010
"SMOTE(k=5, samples=15)",0.649 ± 0.018,0.847 ± 0.013,0.761 ± 0.066,0.977 ± 0.038,0.518 ± 0.030,0.669 ± 0.025,0.496 ± 0.020,0.740 ± 0.018,0.505 ± 0.021,0.612 ± 0.053,0.651 ± 0.020,0.834 ± 0.013
"SMOTE(k=5, samples=20)",0.615 ± 0.025,0.828 ± 0.018,0.726 ± 0.056,0.974 ± 0.038,0.489 ± 0.034,0.650 ± 0.026,0.445 ± 0.022,0.703 ± 0.019,0.492 ± 0.019,0.616 ± 0.059,0.555 ± 0.022,0.766 ± 0.016
"SMOTE(k=5, samples=25)",0.590 ± 0.022,0.812 ± 0.016,0.698 ± 0.043,0.972 ± 0.038,0.475 ± 0.035,0.643 ± 0.025,0.402 ± 0.020,0.673 ± 0.016,0.481 ± 0.021,0.615 ± 0.065,0.478 ± 0.027,0.711 ± 0.019
"SMOTE(k=5, samples=30)",0.565 ± 0.024,0.796 ± 0.017,0.677 ± 0.033,0.969 ± 0.037,0.460 ± 0.037,0.635 ± 0.024,0.368 ± 0.023,0.653 ± 0.018,0.470 ± 0.023,0.607 ± 0.070,0.426 ± 0.027,0.674 ± 0.019
"SMOTE(k=7, samples=1)",0.907 ± 0.011,0.927 ± 0.011,0.806 ± 0.108,0.754 ± 0.114,0.703 ± 0.027,0.751 ± 0.031,0.831 ± 0.023,0.884 ± 0.025,0.533 ± 0.040,0.528 ± 0.034,0.978 ± 0.006,0.988 ± 0.006
"SMOTE(k=7, samples=3)",0.845 ± 0.012,0.926 ± 0.010,0.853 ± 0.075,0.881 ± 0.091,0.660 ± 0.021,0.753 ± 0.022,0.740 ± 0.022,0.876 ± 0.020,0.553 ± 0.039,0.580 ± 0.052,0.945 ± 0.012,0.981 ± 0.006
"SMOTE(k=7, samples=5)",0.785 ± 0.013,0.910 ± 0.008,0.848 ± 0.072,0.950 ± 0.061,0.614 ± 0.022,0.730 ± 0.019,0.672 ± 0.017,0.848 ± 0.016,0.550 ± 0.035,0.602 ± 0.056,0.890 ± 0.016,0.962 ± 0.008
"SMOTE(k=7, samples=7)",0.740 ± 0.018,0.894 ± 0.012,0.819 ± 0.070,0.949 ± 0.069,0.584 ± 0.025,0.711 ± 0.022,0.621 ± 0.021,0.821 ± 0.020,0.539 ± 0.027,0.609 ± 0.054,0.840 ± 0.018,0.941 ± 0.009
"SMOTE(k=7, samples=10)",0.695 ± 0.020,0.873 ± 0.014,0.785 ± 0.070,0.967 ± 0.060,0.550 ± 0.028,0.690 ± 0.024,0.567 ± 0.021,0.789 ± 0.020,0.526 ± 0.026,0.617 ± 0.062,0.760 ± 0.019,0.901 ± 0.011
"SMOTE(k=7, samples=15)",0.639 ± 0.022,0.843 ± 0.015,0.735 ± 0.061,0.967 ± 0.057,0.510 ± 0.031,0.664 ± 0.024,0.493 ± 0.020,0.737 ± 0.018,0.508 ± 0.022,0.621 ± 0.059,0.650 ± 0.019,0.834 ± 0.013
"SMOTE(k=7, samples=20)",0.603 ± 0.021,0.821 ± 0.015,0.718 ± 0.050,0.974 ± 0.052,0.486 ± 0.031,0.651 ± 0.023,0.441 ± 0.021,0.700 ± 0.019,0.492 ± 0.023,0.618 ± 0.064,0.553 ± 0.022,0.765 ± 0.016
"SMOTE(k=7, samples=25)",0.574 ± 0.025,0.802 ± 0.018,0.687 ± 0.041,0.974 ± 0.033,0.462 ± 0.036,0.636 ± 0.025,0.395 ± 0.021,0.668 ± 0.017,0.480 ± 0.022,0.616 ± 0.063,0.477 ± 0.026,0.710 ± 0.019
"SMOTE(k=7, samples=30)",0.550 ± 0.025,0.785 ± 0.019,0.671 ± 0.033,0.980 ± 0.005,0.450 ± 0.036,0.629 ± 0.024,0.364 ± 0.022,0.649 ± 0.017,0.468 ± 0.022,0.608 ± 0.065,0.425 ± 0.026,0.673 ± 0.018
"SMOTE(k=10, samples=1)",0.907 ± 0.010,0.927 ± 0.012,0.830 ± 0.101,0.771 ± 0.107,0.711 ± 0.024,0.760 ± 0.028,0.833 ± 0.025,0.883 ± 0.027,0.554 ± 0.047,0.547 ± 0.042,0.976 ± 0.007,0.986 ± 0.007
"SMOTE(k=10, samples=3)",0.842 ± 0.011,0.925 ± 0.011,0.870 ± 0.089,0.890 ± 0.111,0.658 ± 0.021,0.750 ± 0.023,0.739 ± 0.022,0.875 ± 0.021,0.552 ± 0.040,0.578 ± 0.052,0.944 ± 0.012,0.981 ± 0.006
"SMOTE(k=10, samples=5)",0.784 ± 0.014,0.912 ± 0.010,0.825 ± 0.079,0.921 ± 0.083,0.612 ± 0.023,0.728 ± 0.021,0.670 ± 0.020,0.847 ± 0.016,0.541 ± 0.030,0.592 ± 0.054,0.891 ± 0.016,0.962 ± 0.007
"SMOTE(k=10, samples=7)",0.738 ± 0.018,0.892 ± 0.012,0.812 ± 0.069,0.944 ± 0.069,0.580 ± 0.025,0.710 ± 0.022,0.620 ± 0.023,0.823 ± 0.022,0.537 ± 0.027,0.607 ± 0.053,0.840 ± 0.017,0.941 ± 0.009
"SMOTE(k=10, samples=10)",0.687 ± 0.021,0.870 ± 0.014,0.786 ± 0.060,0.967 ± 0.060,0.545 ± 0.023,0.686 ± 0.020,0.564 ± 0.020,0.788 ± 0.019,0.525 ± 0.023,0.615 ± 0.053,0.761 ± 0.019,0.902 ± 0.010
"SMOTE(k=10, samples=15)",0.630 ± 0.024,0.838 ± 0.017,0.748 ± 0.046,0.977 ± 0.037,0.505 ± 0.027,0.663 ± 0.020,0.490 ± 0.020,0.736 ± 0.018,0.509 ± 0.024,0.622 ± 0.060,0.650 ± 0.019,0.834 ± 0.013
"SMOTE(k=10, samples=20)",0.588 ± 0.024,0.811 ± 0.018,0.700 ± 0.040,0.968 ± 0.044,0.477 ± 0.034,0.646 ± 0.025,0.436 ± 0.022,0.697 ± 0.019,0.495 ± 0.023,0.623 ± 0.064,0.553 ± 0.022,0.765 ± 0.016
"SMOTE(k=10, samples=25)",0.553 ± 0.025,0.787 ± 0.018,0.683 ± 0.037,0.978 ± 0.024,0.455 ± 0.035,0.633 ± 0.023,0.391 ± 0.022,0.667 ± 0.018,0.480 ± 0.023,0.617 ± 0.068,0.476 ± 0.026,0.709 ± 0.019
"SMOTE(k=10, samples=30)",0.526 ± 0.028,0.768 ± 0.020,0.664 ± 0.039,0.979 ± 0.006,0.437 ± 0.039,0.622 ± 0.026,0.356 ± 0.020,0.645 ± 0.014,0.470 ± 0.024,0.613 ± 0.071,0.423 ± 0.026,0.672 ± 0.018
Undersampling,0.866 ± 0.014,0.937 ± 0.009,0.249 ± 0.047,0.610 ± 0.094,0.681 ± 0.022,0.744 ± 0.028,0.794 ± 0.024,0.902 ± 0.018,0.477 ± 0.025,0.679 ± 0.057,0.914 ± 0.019,0.968 ± 0.007
