,Page_blocks0 F1 Score,Page_blocks0 G-Mean,Pima F1 Score,Pima G-Mean,Poker F1 Score,Poker G-Mean,Abalone19 F1 Score,Abalone19 G-Mean,Vehicle1 F1 Score,Vehicle1 G-Mean,Shuttle F1 Score,Shuttle G-Mean,Yeast1 F1 Score,Yeast1 G-Mean,Yeast3 F1 Score,Yeast3 G-Mean,Wine_Red F1 Score,Wine_Red G-Mean,Segment0 F1 Score,Segment0 G-Mean
Baseline,0.866 ± 0.012,0.815 ± 0.015,0.660 ± 0.036,0.653 ± 0.030,0.504 ± 0.036,0.504 ± 0.022,0.498 ± 0.000,0.500 ± 0.000,0.620 ± 0.034,0.609 ± 0.025,0.997 ± 0.005,0.997 ± 0.007,0.529 ± 0.019,0.553 ± 0.012,0.795 ± 0.033,0.752 ± 0.039,0.496 ± 0.016,0.502 ± 0.009,0.915 ± 0.013,0.872 ± 0.018
"SMOTE(k=3, samples=1)",0.878 ± 0.012,0.854 ± 0.013,0.702 ± 0.029,0.713 ± 0.025,0.551 ± 0.089,0.533 ± 0.055,0.498 ± 0.000,0.500 ± 0.000,0.700 ± 0.035,0.699 ± 0.035,0.996 ± 0.006,0.995 ± 0.008,0.674 ± 0.031,0.706 ± 0.026,0.846 ± 0.020,0.845 ± 0.026,0.491 ± 0.001,0.498 ± 0.002,0.947 ± 0.012,0.927 ± 0.016
"SMOTE(k=3, samples=5)",0.788 ± 0.020,0.891 ± 0.015,0.426 ± 0.036,0.570 ± 0.025,0.551 ± 0.089,0.533 ± 0.055,0.498 ± 0.000,0.500 ± 0.000,0.458 ± 0.027,0.635 ± 0.019,0.980 ± 0.010,0.993 ± 0.008,0.428 ± 0.022,0.597 ± 0.014,0.679 ± 0.022,0.865 ± 0.017,0.548 ± 0.044,0.548 ± 0.043,0.638 ± 0.017,0.825 ± 0.012
"SMOTE(k=3, samples=10)",0.715 ± 0.015,0.876 ± 0.013,0.374 ± 0.031,0.544 ± 0.021,0.570 ± 0.091,0.549 ± 0.061,0.498 ± 0.000,0.500 ± 0.000,0.360 ± 0.034,0.578 ± 0.020,0.916 ± 0.027,0.985 ± 0.008,0.354 ± 0.023,0.556 ± 0.013,0.424 ± 0.022,0.690 ± 0.018,0.579 ± 0.046,0.641 ± 0.063,0.448 ± 0.021,0.689 ± 0.015
"SMOTE(k=3, samples=20)",0.360 ± 0.032,0.645 ± 0.024,0.335 ± 0.023,0.525 ± 0.015,0.513 ± 0.043,0.516 ± 0.046,0.497 ± 0.001,0.498 ± 0.002,0.295 ± 0.029,0.544 ± 0.016,0.109 ± 0.014,0.520 ± 0.009,0.309 ± 0.020,0.534 ± 0.011,0.326 ± 0.019,0.626 ± 0.013,0.485 ± 0.018,0.671 ± 0.055,0.351 ± 0.016,0.624 ± 0.010
"SMOTE(k=5, samples=1)",0.878 ± 0.011,0.855 ± 0.012,0.703 ± 0.027,0.712 ± 0.027,0.531 ± 0.075,0.521 ± 0.047,0.498 ± 0.000,0.500 ± 0.000,0.704 ± 0.029,0.703 ± 0.030,0.996 ± 0.006,0.995 ± 0.008,0.671 ± 0.028,0.707 ± 0.026,0.848 ± 0.021,0.846 ± 0.026,0.493 ± 0.009,0.499 ± 0.006,0.947 ± 0.012,0.927 ± 0.015
"SMOTE(k=5, samples=5)",0.789 ± 0.018,0.890 ± 0.015,0.427 ± 0.036,0.571 ± 0.026,0.557 ± 0.092,0.537 ± 0.057,0.498 ± 0.000,0.500 ± 0.000,0.454 ± 0.027,0.633 ± 0.019,0.981 ± 0.009,0.993 ± 0.007,0.427 ± 0.023,0.596 ± 0.016,0.676 ± 0.021,0.863 ± 0.015,0.564 ± 0.048,0.565 ± 0.047,0.638 ± 0.017,0.825 ± 0.012
"SMOTE(k=5, samples=10)",0.716 ± 0.015,0.878 ± 0.013,0.370 ± 0.029,0.543 ± 0.020,0.559 ± 0.089,0.541 ± 0.059,0.498 ± 0.000,0.500 ± 0.000,0.358 ± 0.030,0.577 ± 0.017,0.920 ± 0.028,0.984 ± 0.010,0.353 ± 0.022,0.557 ± 0.011,0.423 ± 0.022,0.690 ± 0.018,0.587 ± 0.043,0.657 ± 0.061,0.446 ± 0.020,0.688 ± 0.014
"SMOTE(k=5, samples=20)",0.356 ± 0.034,0.642 ± 0.025,0.336 ± 0.027,0.526 ± 0.016,0.520 ± 0.056,0.518 ± 0.047,0.497 ± 0.001,0.499 ± 0.002,0.290 ± 0.028,0.541 ± 0.014,0.109 ± 0.015,0.520 ± 0.009,0.304 ± 0.019,0.532 ± 0.011,0.325 ± 0.018,0.625 ± 0.012,0.490 ± 0.023,0.679 ± 0.061,0.350 ± 0.016,0.623 ± 0.010
"SMOTE(k=7, samples=1)",0.880 ± 0.011,0.856 ± 0.012,0.704 ± 0.029,0.715 ± 0.027,0.544 ± 0.085,0.529 ± 0.053,0.498 ± 0.000,0.500 ± 0.000,0.705 ± 0.030,0.706 ± 0.032,0.996 ± 0.006,0.995 ± 0.008,0.667 ± 0.029,0.707 ± 0.023,0.849 ± 0.021,0.847 ± 0.026,0.493 ± 0.009,0.500 ± 0.006,0.947 ± 0.013,0.927 ± 0.017
"SMOTE(k=7, samples=5)",0.789 ± 0.019,0.890 ± 0.014,0.422 ± 0.036,0.569 ± 0.024,0.557 ± 0.092,0.537 ± 0.057,0.498 ± 0.000,0.500 ± 0.000,0.454 ± 0.026,0.633 ± 0.018,0.981 ± 0.010,0.993 ± 0.008,0.429 ± 0.022,0.598 ± 0.015,0.675 ± 0.022,0.865 ± 0.017,0.562 ± 0.042,0.563 ± 0.040,0.638 ± 0.016,0.825 ± 0.011
"SMOTE(k=7, samples=10)",0.715 ± 0.016,0.877 ± 0.014,0.365 ± 0.025,0.540 ± 0.018,0.547 ± 0.084,0.533 ± 0.055,0.498 ± 0.000,0.500 ± 0.000,0.359 ± 0.030,0.578 ± 0.018,0.918 ± 0.028,0.983 ± 0.010,0.353 ± 0.022,0.557 ± 0.012,0.423 ± 0.021,0.690 ± 0.017,0.585 ± 0.047,0.650 ± 0.065,0.446 ± 0.020,0.687 ± 0.014
"SMOTE(k=7, samples=20)",0.349 ± 0.033,0.637 ± 0.024,0.331 ± 0.026,0.524 ± 0.016,0.524 ± 0.059,0.522 ± 0.050,0.497 ± 0.001,0.499 ± 0.001,0.289 ± 0.026,0.541 ± 0.013,0.109 ± 0.014,0.520 ± 0.009,0.305 ± 0.019,0.534 ± 0.011,0.323 ± 0.019,0.624 ± 0.012,0.491 ± 0.022,0.678 ± 0.055,0.350 ± 0.016,0.623 ± 0.010
"SMOTE(k=10, samples=1)",0.878 ± 0.012,0.854 ± 0.012,0.704 ± 0.033,0.715 ± 0.031,0.551 ± 0.089,0.533 ± 0.055,0.498 ± 0.000,0.500 ± 0.000,0.702 ± 0.034,0.702 ± 0.035,0.996 ± 0.006,0.995 ± 0.008,0.666 ± 0.031,0.706 ± 0.025,0.850 ± 0.019,0.847 ± 0.025,0.491 ± 0.001,0.498 ± 0.002,0.946 ± 0.013,0.927 ± 0.017
"SMOTE(k=10, samples=5)",0.790 ± 0.019,0.890 ± 0.015,0.419 ± 0.032,0.567 ± 0.022,0.578 ± 0.098,0.550 ± 0.061,0.498 ± 0.000,0.500 ± 0.000,0.453 ± 0.028,0.632 ± 0.020,0.981 ± 0.010,0.993 ± 0.008,0.425 ± 0.023,0.596 ± 0.015,0.674 ± 0.021,0.862 ± 0.015,0.558 ± 0.040,0.558 ± 0.038,0.638 ± 0.017,0.825 ± 0.011
"SMOTE(k=10, samples=10)",0.716 ± 0.015,0.877 ± 0.012,0.362 ± 0.028,0.539 ± 0.018,0.554 ± 0.087,0.537 ± 0.057,0.498 ± 0.000,0.500 ± 0.000,0.355 ± 0.029,0.576 ± 0.017,0.919 ± 0.027,0.985 ± 0.009,0.355 ± 0.023,0.558 ± 0.013,0.423 ± 0.019,0.689 ± 0.016,0.579 ± 0.042,0.645 ± 0.059,0.445 ± 0.020,0.687 ± 0.014
"SMOTE(k=10, samples=20)",0.339 ± 0.027,0.631 ± 0.019,0.327 ± 0.024,0.522 ± 0.015,0.528 ± 0.068,0.522 ± 0.050,0.498 ± 0.001,0.499 ± 0.001,0.288 ± 0.027,0.541 ± 0.014,0.109 ± 0.015,0.520 ± 0.009,0.301 ± 0.019,0.532 ± 0.011,0.324 ± 0.019,0.625 ± 0.012,0.492 ± 0.020,0.683 ± 0.054,0.350 ± 0.016,0.623 ± 0.010
Undersampling,0.824 ± 0.014,0.773 ± 0.016,0.708 ± 0.029,0.700 ± 0.028,0.155 ± 0.103,0.469 ± 0.094,0.425 ± 0.093,0.591 ± 0.090,0.695 ± 0.030,0.702 ± 0.036,0.994 ± 0.008,0.994 ± 0.008,0.612 ± 0.038,0.690 ± 0.022,0.816 ± 0.024,0.848 ± 0.028,0.529 ± 0.046,0.663 ± 0.061,0.952 ± 0.017,0.972 ± 0.012
