,Page_blocks0 F1 Score,Page_blocks0 G-Mean,Poker F1 Score,Poker G-Mean,Vehicle1 F1 Score,Vehicle1 G-Mean,Yeast3 F1 Score,Yeast3 G-Mean,Wine_Red F1 Score,Wine_Red G-Mean,Segment0 F1 Score,Segment0 G-Mean
Baseline,0.719 ± 0.020,0.704 ± 0.020,0.497 ± 0.000,0.500 ± 0.000,0.642 ± 0.028,0.671 ± 0.032,0.245 ± 0.079,0.571 ± 0.048,0.545 ± 0.045,0.555 ± 0.053,0.753 ± 0.027,0.890 ± 0.019
"SMOTE(k=3, samples=1)",0.762 ± 0.015,0.790 ± 0.018,0.497 ± 0.000,0.500 ± 0.000,0.616 ± 0.027,0.666 ± 0.030,0.471 ± 0.000,0.500 ± 0.000,0.550 ± 0.049,0.605 ± 0.072,0.710 ± 0.068,0.852 ± 0.095
"SMOTE(k=3, samples=3)",0.768 ± 0.013,0.836 ± 0.014,0.504 ± 0.036,0.504 ± 0.022,0.556 ± 0.031,0.636 ± 0.032,0.471 ± 0.000,0.500 ± 0.000,0.526 ± 0.051,0.625 ± 0.060,0.672 ± 0.059,0.831 ± 0.089
"SMOTE(k=3, samples=5)",0.751 ± 0.012,0.844 ± 0.013,0.504 ± 0.036,0.504 ± 0.023,0.499 ± 0.037,0.602 ± 0.036,0.471 ± 0.000,0.500 ± 0.000,0.493 ± 0.041,0.632 ± 0.061,0.640 ± 0.051,0.811 ± 0.084
"SMOTE(k=3, samples=7)",0.734 ± 0.015,0.847 ± 0.014,0.505 ± 0.033,0.507 ± 0.030,0.463 ± 0.032,0.581 ± 0.032,0.471 ± 0.000,0.500 ± 0.000,0.470 ± 0.038,0.634 ± 0.059,0.616 ± 0.043,0.794 ± 0.079
"SMOTE(k=3, samples=10)",0.710 ± 0.013,0.848 ± 0.013,0.514 ± 0.044,0.517 ± 0.046,0.434 ± 0.032,0.567 ± 0.031,0.471 ± 0.000,0.500 ± 0.000,0.444 ± 0.035,0.631 ± 0.055,0.570 ± 0.031,0.761 ± 0.070
"SMOTE(k=3, samples=15)",0.683 ± 0.013,0.844 ± 0.013,0.519 ± 0.046,0.535 ± 0.066,0.404 ± 0.030,0.556 ± 0.027,0.471 ± 0.000,0.500 ± 0.000,0.415 ± 0.034,0.620 ± 0.060,0.510 ± 0.020,0.718 ± 0.060
"SMOTE(k=3, samples=20)",0.668 ± 0.012,0.842 ± 0.011,0.533 ± 0.054,0.569 ± 0.073,0.386 ± 0.027,0.553 ± 0.024,0.471 ± 0.000,0.500 ± 0.000,0.393 ± 0.034,0.614 ± 0.064,0.414 ± 0.017,0.650 ± 0.041
"SMOTE(k=3, samples=25)",0.658 ± 0.013,0.840 ± 0.010,0.525 ± 0.046,0.599 ± 0.101,0.373 ± 0.027,0.551 ± 0.022,0.471 ± 0.000,0.500 ± 0.000,0.373 ± 0.032,0.599 ± 0.065,0.383 ± 0.024,0.629 ± 0.035
"SMOTE(k=3, samples=30)",0.647 ± 0.013,0.836 ± 0.009,0.505 ± 0.029,0.596 ± 0.106,0.360 ± 0.029,0.548 ± 0.020,0.471 ± 0.000,0.500 ± 0.000,0.355 ± 0.030,0.590 ± 0.065,0.373 ± 0.026,0.623 ± 0.034
"SMOTE(k=5, samples=1)",0.760 ± 0.014,0.788 ± 0.017,0.497 ± 0.000,0.500 ± 0.000,0.615 ± 0.028,0.666 ± 0.032,0.471 ± 0.000,0.500 ± 0.000,0.551 ± 0.044,0.604 ± 0.065,0.711 ± 0.068,0.853 ± 0.095
"SMOTE(k=5, samples=3)",0.770 ± 0.012,0.836 ± 0.013,0.497 ± 0.000,0.500 ± 0.000,0.555 ± 0.034,0.636 ± 0.035,0.471 ± 0.000,0.500 ± 0.000,0.526 ± 0.051,0.627 ± 0.060,0.673 ± 0.059,0.832 ± 0.090
"SMOTE(k=5, samples=5)",0.752 ± 0.011,0.844 ± 0.012,0.502 ± 0.026,0.504 ± 0.022,0.496 ± 0.035,0.599 ± 0.034,0.471 ± 0.000,0.500 ± 0.000,0.497 ± 0.043,0.639 ± 0.053,0.641 ± 0.051,0.811 ± 0.084
"SMOTE(k=5, samples=7)",0.736 ± 0.014,0.848 ± 0.015,0.501 ± 0.026,0.503 ± 0.022,0.461 ± 0.033,0.579 ± 0.033,0.471 ± 0.000,0.500 ± 0.000,0.473 ± 0.038,0.635 ± 0.058,0.617 ± 0.043,0.794 ± 0.079
"SMOTE(k=5, samples=10)",0.713 ± 0.014,0.849 ± 0.013,0.520 ± 0.054,0.520 ± 0.050,0.432 ± 0.032,0.566 ± 0.031,0.471 ± 0.000,0.500 ± 0.000,0.448 ± 0.035,0.636 ± 0.057,0.571 ± 0.032,0.762 ± 0.071
"SMOTE(k=5, samples=15)",0.684 ± 0.013,0.844 ± 0.013,0.530 ± 0.055,0.550 ± 0.070,0.403 ± 0.028,0.557 ± 0.025,0.471 ± 0.000,0.500 ± 0.000,0.416 ± 0.034,0.621 ± 0.060,0.512 ± 0.020,0.719 ± 0.060
"SMOTE(k=5, samples=20)",0.669 ± 0.012,0.841 ± 0.012,0.522 ± 0.043,0.567 ± 0.080,0.384 ± 0.026,0.552 ± 0.024,0.471 ± 0.000,0.500 ± 0.000,0.394 ± 0.033,0.615 ± 0.063,0.416 ± 0.018,0.651 ± 0.042
"SMOTE(k=5, samples=25)",0.658 ± 0.013,0.839 ± 0.011,0.510 ± 0.031,0.579 ± 0.080,0.371 ± 0.027,0.550 ± 0.021,0.471 ± 0.000,0.500 ± 0.000,0.374 ± 0.033,0.604 ± 0.067,0.384 ± 0.023,0.630 ± 0.035
"SMOTE(k=5, samples=30)",0.649 ± 0.013,0.836 ± 0.009,0.499 ± 0.028,0.590 ± 0.087,0.360 ± 0.028,0.548 ± 0.019,0.471 ± 0.000,0.500 ± 0.000,0.357 ± 0.032,0.596 ± 0.064,0.374 ± 0.026,0.624 ± 0.034
"SMOTE(k=7, samples=1)",0.761 ± 0.014,0.789 ± 0.017,0.497 ± 0.000,0.500 ± 0.000,0.617 ± 0.027,0.666 ± 0.031,0.471 ± 0.000,0.500 ± 0.000,0.554 ± 0.049,0.608 ± 0.070,0.711 ± 0.069,0.853 ± 0.095
"SMOTE(k=7, samples=3)",0.771 ± 0.012,0.838 ± 0.013,0.497 ± 0.000,0.500 ± 0.000,0.552 ± 0.033,0.633 ± 0.034,0.471 ± 0.000,0.500 ± 0.000,0.520 ± 0.046,0.628 ± 0.062,0.673 ± 0.059,0.832 ± 0.090
"SMOTE(k=7, samples=5)",0.754 ± 0.011,0.845 ± 0.012,0.506 ± 0.034,0.508 ± 0.030,0.495 ± 0.035,0.599 ± 0.033,0.471 ± 0.000,0.500 ± 0.000,0.492 ± 0.040,0.631 ± 0.056,0.641 ± 0.051,0.811 ± 0.084
"SMOTE(k=7, samples=7)",0.739 ± 0.014,0.850 ± 0.014,0.520 ± 0.054,0.518 ± 0.046,0.460 ± 0.032,0.578 ± 0.032,0.471 ± 0.000,0.500 ± 0.000,0.471 ± 0.038,0.637 ± 0.055,0.617 ± 0.043,0.794 ± 0.079
"SMOTE(k=7, samples=10)",0.714 ± 0.015,0.850 ± 0.013,0.526 ± 0.067,0.519 ± 0.052,0.430 ± 0.031,0.565 ± 0.031,0.471 ± 0.000,0.500 ± 0.000,0.445 ± 0.033,0.629 ± 0.059,0.571 ± 0.032,0.762 ± 0.071
"SMOTE(k=7, samples=15)",0.684 ± 0.014,0.843 ± 0.013,0.521 ± 0.048,0.538 ± 0.071,0.402 ± 0.028,0.556 ± 0.025,0.471 ± 0.000,0.500 ± 0.000,0.416 ± 0.035,0.622 ± 0.060,0.515 ± 0.021,0.721 ± 0.060
"SMOTE(k=7, samples=20)",0.669 ± 0.013,0.842 ± 0.012,0.512 ± 0.033,0.562 ± 0.085,0.383 ± 0.026,0.551 ± 0.024,0.471 ± 0.000,0.500 ± 0.000,0.393 ± 0.031,0.617 ± 0.065,0.418 ± 0.017,0.652 ± 0.042
"SMOTE(k=7, samples=25)",0.658 ± 0.013,0.840 ± 0.010,0.500 ± 0.025,0.569 ± 0.087,0.369 ± 0.027,0.549 ± 0.020,0.471 ± 0.000,0.500 ± 0.000,0.375 ± 0.032,0.606 ± 0.063,0.384 ± 0.024,0.630 ± 0.036
"SMOTE(k=7, samples=30)",0.649 ± 0.013,0.837 ± 0.009,0.495 ± 0.022,0.611 ± 0.099,0.360 ± 0.029,0.548 ± 0.020,0.471 ± 0.000,0.500 ± 0.000,0.355 ± 0.030,0.591 ± 0.064,0.374 ± 0.026,0.624 ± 0.034
"SMOTE(k=10, samples=1)",0.763 ± 0.014,0.791 ± 0.017,0.497 ± 0.000,0.500 ± 0.000,0.617 ± 0.027,0.667 ± 0.031,0.471 ± 0.000,0.500 ± 0.000,0.551 ± 0.047,0.611 ± 0.076,0.711 ± 0.068,0.853 ± 0.095
"SMOTE(k=10, samples=3)",0.772 ± 0.012,0.839 ± 0.014,0.497 ± 0.000,0.500 ± 0.001,0.552 ± 0.033,0.633 ± 0.033,0.471 ± 0.000,0.500 ± 0.000,0.526 ± 0.051,0.630 ± 0.057,0.674 ± 0.059,0.832 ± 0.090
"SMOTE(k=10, samples=5)",0.756 ± 0.012,0.846 ± 0.014,0.497 ± 0.001,0.499 ± 0.002,0.493 ± 0.036,0.598 ± 0.035,0.471 ± 0.000,0.500 ± 0.000,0.493 ± 0.038,0.635 ± 0.061,0.642 ± 0.051,0.811 ± 0.084
"SMOTE(k=10, samples=7)",0.742 ± 0.014,0.852 ± 0.013,0.512 ± 0.048,0.510 ± 0.038,0.459 ± 0.030,0.578 ± 0.031,0.471 ± 0.000,0.500 ± 0.000,0.475 ± 0.040,0.641 ± 0.057,0.618 ± 0.043,0.795 ± 0.079
"SMOTE(k=10, samples=10)",0.715 ± 0.015,0.851 ± 0.013,0.522 ± 0.054,0.528 ± 0.066,0.430 ± 0.033,0.564 ± 0.031,0.471 ± 0.000,0.500 ± 0.000,0.449 ± 0.036,0.635 ± 0.059,0.572 ± 0.032,0.763 ± 0.071
"SMOTE(k=10, samples=15)",0.683 ± 0.013,0.844 ± 0.012,0.520 ± 0.040,0.558 ± 0.083,0.403 ± 0.028,0.558 ± 0.027,0.471 ± 0.000,0.500 ± 0.000,0.419 ± 0.034,0.623 ± 0.059,0.517 ± 0.021,0.722 ± 0.061
"SMOTE(k=10, samples=20)",0.669 ± 0.013,0.842 ± 0.011,0.506 ± 0.025,0.564 ± 0.076,0.383 ± 0.026,0.551 ± 0.024,0.471 ± 0.000,0.500 ± 0.000,0.396 ± 0.034,0.620 ± 0.067,0.420 ± 0.017,0.655 ± 0.043
"SMOTE(k=10, samples=25)",0.658 ± 0.013,0.840 ± 0.010,0.494 ± 0.021,0.577 ± 0.098,0.369 ± 0.027,0.549 ± 0.020,0.471 ± 0.000,0.500 ± 0.000,0.377 ± 0.034,0.606 ± 0.066,0.385 ± 0.023,0.631 ± 0.036
"SMOTE(k=10, samples=30)",0.648 ± 0.014,0.837 ± 0.010,0.487 ± 0.018,0.607 ± 0.091,0.360 ± 0.029,0.549 ± 0.020,0.471 ± 0.000,0.500 ± 0.000,0.359 ± 0.032,0.595 ± 0.065,0.374 ± 0.026,0.624 ± 0.034
Undersampling,0.737 ± 0.026,0.744 ± 0.035,0.313 ± 0.042,0.485 ± 0.103,0.627 ± 0.030,0.671 ± 0.033,0.373 ± 0.265,0.648 ± 0.156,0.462 ± 0.057,0.646 ± 0.068,0.742 ± 0.031,0.884 ± 0.020
