%YAML 1.1
%TAG !u! tag:unity3d.com,2011:
--- !u!114 &11400000
MonoBehaviour:
  m_ObjectHideFlags: 0
  m_PrefabParentObject: {fileID: 0}
  m_PrefabInternal: {fileID: 0}
  m_GameObject: {fileID: 0}
  m_Enabled: 1
  m_EditorHideFlags: 0
  m_Script: {fileID: 11500000, guid: 65c0c6b048e0aac44957c04501c87e05, type: 3}
  m_Name: aTown
  m_EditorClassIdentifier: 
  text:
  - The night is dark and full of terrors, but {hero} seems to have spotted a town.
  location: {fileID: 11400000, guid: 4e44d18878d53d7438680a6c03221852, type: 2}
  choices:
  - text: That place looks abondoned, we should avoid it
    stat: 3
    value: 6
    successResult:
      text:
      - No, I doubt that
      - A place with so many lights must have people
      - Look an Inn, I will spend the night
      healthChange: 50
      strengthChange: 1
      dexterityChange: 1
      constitutionChange: 1
      intelligenceChange: 1
      wisdomChange: 1
      charismaChange: 1
      trustChange: -25
      scenarioIndex: 0
    failResult:
      text:
      - You might be right
      - I will avoid it at all costs
      - I do not have the energy for a fight
      healthChange: 0
      strengthChange: 0
      dexterityChange: 0
      constitutionChange: -1
      intelligenceChange: 0
      wisdomChange: 0
      charismaChange: 0
      trustChange: 5
      scenarioIndex: 0
  - text: This looks like a trap, can you scout it out first?
    stat: 1
    value: 7
    successResult:
      text:
      - I think I can take a quick look
      - There doesn't seem to be much
      - I think no one is here, I should turn around
      healthChange: 0
      strengthChange: 0
      dexterityChange: 1
      constitutionChange: 0
      intelligenceChange: 1
      wisdomChange: 0
      charismaChange: 0
      trustChange: 5
      scenarioIndex: 0
    failResult:
      text:
      - There is no need to scout it
      - There must be people here
      - Look, I found an inn
      healthChange: 50
      strengthChange: 1
      dexterityChange: 1
      constitutionChange: 1
      intelligenceChange: 1
      wisdomChange: 1
      charismaChange: 1
      trustChange: -10
      scenarioIndex: 0
  - text: This must be a pack of goblins, evil must to removed from the land!
    stat: 0
    value: 4
    successResult:
      text:
      - Evil must be vanquished!
      - ARGHHH!!!
      - Wait a minute....
      - These bodies look like villagers....
      healthChange: -5
      strengthChange: 3
      dexterityChange: 0
      constitutionChange: -1
      intelligenceChange: 0
      wisdomChange: 2
      charismaChange: 0
      trustChange: -15
      scenarioIndex: 0
    failResult:
      text:
      - I have already brought peace to this land
      - I will just go see what they are doing
      - Look, it is just an inn!
      healthChange: 50
      strengthChange: 1
      dexterityChange: 1
      constitutionChange: 1
      intelligenceChange: 1
      wisdomChange: 1
      charismaChange: 1
      trustChange: -10
      scenarioIndex: 0
