﻿Name,Year,Month,Day,hUTC,mUTC,sUTC,hRA,mRA,sRA,dDec,amDec,asDec,redZ,degRA,degDec,Zen,Azi,degLMST,hLMST,mLMST,sLMST,FoV
GRB180720B,2018,07,20,14,21,39.004,00,02,21.6,-2,57,00,0.654,,,,,,,,,
GRB180718B,2018,07,18,18,18,24.002,02,57,55.2,-30,19,48,-999,,,,,,,,,
GRB180703B,2018,07,03,22,46,51.001,06,27,40.8,-29,52,48,-999,,,,,,,,,
GRB180703A,2018,07,03,21,01,39.999,00,26,14.4,-67,06,00,0.6678,,,,,,,,,
GRB180526A,2018,05,26,11,04,09.002,07,13,55.2,3,38,24,-999,,,,,,,,,
GRB180305A,2018,03,05,09,26,07.996,03,18,40.8,32,06,00,-999,,,,,,,,,
GRB180210A,2018,02,10,12,24,38.002,00,07,19.2,18,29,24,-999,,,,,,,,,
GRB180113C,2018,01,13,10,02,04.998,11,38,31.2,-64,44,24,-999,,,,,,,,,
GRB171212B,2017,12,12,10,24,18.003,02,37,40.8,-70,37,48,-999,,,,,,,,,
GRB171210A,2017,12,10,11,49,14.998,22,21,09.6,24,26,24,-999,,,,,,,,,
GRB171124A,2017,11,24,05,37,55.998,22,22,04.8,35,14,24,-999,,,,,,,,,
GRB171120A,2017,11,20,13,20,02.000,10,55,16.8,22,24,36,-999,,,,,,,,,
GRB171102A,2017,11,02,02,33,35.001,12,30,52.8,54,00,36,-999,,,,,,,,,
GRB171011C,2017,10,11,19,26,26.998,11,13,55.2,10,01,48,-999,,,,,,,,,
GRB171010A,2017,10,10,19,00,50.003,04,26,09.6,-10,26,24,0.3293,,,,,,,,,
GRB170921B,2017,09,21,04,02,11.003,08,15,43.2,52,40,12,-999,,,,,,,,,
GRB170906A,2017,09,06,00,43,08.000,13,35,45.6,-47,07,12,-999,,,,,,,,,
GRB170825B,2017,08,25,07,22,00.998,19,02,33.6,-32,33,00,-999,,,,,,,,,
GRB170813A,2017,08,13,01,13,07.997,13,21,48.0,-5,29,24,-999,,,,,,,,,
GRB170808B,2017,08,08,22,27,43.004,09,42,52.8,1,36,36,-999,,,,,,,,,
GRB170728B,2017,07,28,23,03,19.002,15,49,43.2,70,51,00,-999,,,,,,,,,
GRB170522A,2017,05,22,15,45,35.001,09,17,24.0,25,40,12,-999,,,,,,,,,
GRB170510A,2017,05,10,05,12,24.998,10,40,50.4,-39,16,48,-999,,,,,,,,,
GRB170424A,2017,04,24,10,12,29.998,22,54,48.0,-45,07,12,-999,,,,,,,,,
GRB170409A,2017,04,09,02,42,00.000,23,10,07.2,-7,10,12,-999,,,,,,,,,
GRB170405A,2017,04,05,18,39,22.003,14,38,21.6,-25,12,36,3.51,,,,,,,,,
GRB170329A,2017,03,29,09,17,06.000,23,46,43.2,9,46,12,-999,,,,,,,,,
GRB170306B,2017,03,06,14,07,22.002,10,18,09.6,51,33,00,-999,,,,,,,,,
GRB170228A,2017,02,28,19,03,00.000,15,58,38.4,-6,29,24,-999,,,,,,,,,
GRB170214A,2017,02,14,15,34,25.997,17,05,16.8,-1,52,48,2.53,,,,,,,,,
GRB170127C,2017,01,27,01,35,47.000,22,35,55.2,-63,58,12,-999,,,,,,,,,
GRB170115B,2017,01,15,17,49,13.996,12,37,16.8,-46,37,48,-999,,,,,,,,,
GRB161109A,2016,11,09,06,18,44.997,10,31,24.0,61,49,48,-999,,,,,,,,,
GRB161015A,2016,10,15,17,03,07.001,17,56,31.2,30,09,36,-999,,,,,,,,,
GRB160917A,2016,09,17,11,30,19.002,19,42,40.3,46,24,11,-999,,,,,,,,,
GRB160917B,2016,09,17,10,56,11.003,13,25,26.4,20,55,48,-999,,,,,,,,,
GRB160910A,2016,09,10,17,19,39.003,14,45,14.4,38,48,36,-999,,,,,,,,,
GRB160905A,2016,09,05,11,18,54.999,10,48,02.4,-50,52,48,-999,,,,,,,,,
GRB160829A,2016,08,29,08,01,36.998,13,26,52.8,-56,46,48,-999,,,,,,,,,
GRB160821A,2016,08,21,20,34,30.003,11,25,09.6,42,17,24,-999,,,,,,,,,
GRB160816A,2016,08,16,17,30,57.001,21,29,16.8,37,08,24,-999,,,,,,,,,
GRB160709A,2016,07,09,19,49,03.003,15,44,26.4,-28,30,36,-999,,,,,,,,,
GRB160702A,2016,07,02,12,22,24.004,15,24,21.6,9,04,12,-999,,,,,,,,,
GRB160625B,2016,06,25,22,40,15.997,20,34,16.8,6,55,48,1.406,,,,,,,,,
GRB160623A,2016,06,23,05,00,34.004,21,01,00.0,42,13,12,0.367,,,,,,,,,
GRB160521B,2016,05,21,09,13,58.002,09,52,09.6,79,01,12,-999,,,,,,,,,
GRB160509A,2016,05,09,08,58,45.998,20,41,33.6,76,02,24,1.17,,,,,,,,,
GRB160503A,2016,05,03,13,36,31.997,23,55,57.6,-1,14,24,-999,,,,,,,,,
GRB160422A,2016,04,22,11,59,00.004,02,48,12.0,-57,54,00,-999,,,,,,,,,
GRB160325A,2016,03,25,06,59,21.002,01,04,50.4,-72,39,36,-999,,,,,,,,,
GRB160314B,2016,03,14,22,17,52.996,11,11,07.2,45,42,36,-999,,,,,,,,,
GRB160310A,2016,03,10,00,22,58.002,06,35,07.2,-7,07,12,-999,,,,,,,,,
GRB160101B,2016,01,01,05,10,12.003,00,05,26.4,55,13,48,-999,,,,,,,,,
GRB151006A,2015,10,06,09,54,56.998,09,49,42.2,70,30,14,-999,,,,,,,,,
GRB150902A,2015,09,02,17,35,39.002,14,19,48.0,-69,22,48,-999,,,,,,,,,
GRB150820A,2015,08,20,21,07,14.998,17,14,36.0,-48,19,48,-999,,,,,,,,,
GRB150702A,2015,07,02,23,56,37.997,03,30,21.6,-56,52,48,-999,,,,,,,,,
GRB150627A,2015,06,27,04,23,23.001,07,50,00.0,-51,33,00,-999,,,,,,,,,
GRB150523A,2015,05,23,09,29,47.996,07,41,21.6,-45,25,48,-999,,,,,,,,,
GRB150514A,2015,05,14,18,35,04.998,04,59,40.8,-60,51,36,0.807,,,,,,,,,
GRB150513A,2015,05,13,20,33,14.999,03,16,14.4,-22,54,36,-999,,,,,,,,,
GRB150510A,2015,05,10,03,19,53.003,01,05,40.8,4,54,36,-999,,,,,,,,,
GRB150416A,2015,04,16,18,33,24.998,03,55,00.0,52,57,36,-999,,,,,,,,,
GRB150403A,2015,04,03,21,54,09.996,20,47,00.0,-62,27,36,2.06,,,,,,,,,