{
  "items": [
    {
      "latitude": 19.093,
      "longitude": 72.880,
      "title": "MUMBAI",
      "spippet": "The capital of maharastra",
      "image_url": "http://s3.india.com/travel/wp-content/uploads/2016/01/marine-drive.jpg"
    },
    {
      "latitude": 13.026,
      "longitude": 77.594,
      "title": "BANGLORE",
      "spippet": "The capital of India's southern Karnataka state",
      "image_url": "https://www.lendbox.in/static/images/blog/personal-loans-in-bangalore.jpg"
    },
    {
      "latitude": 28.758,
      "longitude": 77.081,
      "title": "DELHI",
      "spippet": "capital of India",
      "image_url": "http://a1.images.thrillophilia.com/image/upload/s--ZjzPXyc3--/c_fill,f_auto,fl_strip_profile,h_660,q_jpegmini,w_1920/v1/images/photos/000/038/465/original/shutterstock_161305583-copy-31.jpg.jpg"
    },
    {
      "latitude": 13.108,
      "longitude": 80.273,
      "title": "CHENNAI",
      "spippet": "The capital of the state of Tamil Nadu",
      "image_url": "http://media2.intoday.in/indiatoday/images/stories//2014November/ovrallchen_112114095529.jpg"
    }
  ]
}
