added initial .gitlab-ci.yml

4 jobs for gitlab-ci in 12 minutes and 8 seconds (queued for 3 seconds)
Status Job ID Name Coverage
  Test
failed #43339374
ubuntu-14.04

00:07:18

failed #43339375
ubuntu-16.04

00:09:24

failed #43339376
ubuntu-17.10

00:12:07

failed #43339378
ubuntu-18.04

00:11:08

 
Name Stage Failure
failed
ubuntu-17.10 Test There is an unknown failure, please try again
> Could not call NativeCompileTask.compile() on task ':fxpackager:compileLinuxLibrary'

* Try:
Run with --stacktrace option to get the stack trace. Run with --info or --debug option to get more log output.

BUILD FAILED

Total time: 5 mins 48.495 secs
ERROR: Job failed: exit code 1
failed
ubuntu-14.04 Test There is an unknown failure, please try again


* Try:
Run with --stacktrace option to get the stack trace. Run with --info or --debug option to get more log output.

BUILD FAILED

Total time: 3 mins 35.896 secs
ERROR: Job failed: exit code 1
failed
ubuntu-16.04 Test There is an unknown failure, please try again


* Try:
Run with --stacktrace option to get the stack trace. Run with --info or --debug option to get more log output.

BUILD FAILED

Total time: 5 mins 0.967 secs
ERROR: Job failed: exit code 1
failed
ubuntu-18.04 Test There is an unknown failure, please try again

BUILD FAILED

Total time: 5 mins 1.939 secs
> Could not call NativeCompileTask.compile() on task ':fxpackager:compileLinuxLibrary'

* Try:
Run with --stacktrace option to get the stack trace. Run with --info or --debug option to get more log output.
ERROR: Job failed: exit code 1