%YAML 1.1
%TAG !u! tag:unity3d.com,2011:
--- !u!1 &2535275587086313972
GameObject:
  m_ObjectHideFlags: 0
  m_CorrespondingSourceObject: {fileID: 0}
  m_PrefabInstance: {fileID: 0}
  m_PrefabAsset: {fileID: 0}
  serializedVersion: 6
  m_Component:
  - component: {fileID: 2535275587086313978}
  - component: {fileID: 2535275587086313973}
  m_Layer: 0
  m_Name: enemyproj
  m_TagString: Untagged
  m_Icon: {fileID: 0}
  m_NavMeshLayer: 0
  m_StaticEditorFlags: 0
  m_IsActive: 1
--- !u!4 &2535275587086313978
Transform:
  m_ObjectHideFlags: 0
  m_CorrespondingSourceObject: {fileID: 0}
  m_PrefabInstance: {fileID: 0}
  m_PrefabAsset: {fileID: 0}
  m_GameObject: {fileID: 2535275587086313972}
  m_LocalRotation: {x: 0, y: 0, z: 0, w: 1}
  m_LocalPosition: {x: 0, y: 0, z: 0}
  m_LocalScale: {x: 1, y: 1, z: 1}
  m_Children: []
  m_Father: {fileID: 0}
  m_RootOrder: 0
  m_LocalEulerAnglesHint: {x: 0, y: 0, z: 0}
--- !u!114 &2535275587086313973
MonoBehaviour:
  m_ObjectHideFlags: 0
  m_CorrespondingSourceObject: {fileID: 0}
  m_PrefabInstance: {fileID: 0}
  m_PrefabAsset: {fileID: 0}
  m_GameObject: {fileID: 2535275587086313972}
  m_Enabled: 1
  m_EditorHideFlags: 0
  m_Script: {fileID: 11500000, guid: 933800d3c1636d1409a26a5a78e977cb, type: 3}
  m_Name: 
  m_EditorClassIdentifier: 
  abilityName: 
  abilityDescription: 
  automaticFire: 0
  cooldown: 1
  firingPoint: {fileID: 0}
  projectilePrefab:
  - {fileID: 2932757678940145417, guid: 4a0b2a45fc59d1c44b243d2b0436b4b5, type: 3}
  angle:
  - -30
  - 0
  - 30
  maxProjectilesOnScreen: 10
  speed: 400
  range: 10
  maximumAmmo: 10
  ammo: 0
  shootAudioClip: {fileID: 8300000, guid: 780106a653976df42bdb227b4ddef7b5, type: 3}
  shootVolume: 0.9
  replenishTime: 0
  replenishRate: 0
