{
    /* "coc.preferences.hoverTarget": "echo", */
    /* "coc.preferences.enableFloatHighlight": false, */
    "coc.preferences.formatOnType": true,
    "coc.preferences.formatOnSaveFiletypes": [
        "go",
        "javascript",
        "typescript",
        "json",
        "jsonc",
        "tex"
    ],
    "prettier.printWidth": 160,
    "prettier.singleQuote": true,
    "codeLens.enable": true,
    "diagnostic.virtualText": true,
    "diagnostic.checkCurrentLine": true,
    "git.addGBlameToVirtualText": true,
    "signature.target": "echo",
    "snippets.extends": {
        "javascriptreact": [
            "javascript"
        ],
        "typescript": [
            "javascript"
        ]
    },
    "list.normalMappings": {
        "<C-c>": "do:exit"
    },
    "list.insertMappings": {
        "<C-c>": "do:exit"
    },
    "eslint.autoFixOnSave": true,
    "eslint.filetypes": [
        "javascript",
        "typescript",
        "javascriptreact"
    ],
    "languageserver": {
        "gopls": {
            "command": "gopls",
            "filetypes": [
                "go"
            ],
            "rootPatterns": [
                "go.mod",
                ".git/"
            ],
            "initializationOptions": {
                "usePlaceholders": true,
                "completeUnimported": true
            }
        },
        "dart": {
            "command": "dart",
            "args": [
                "/usr/local/opt/dart/libexec/bin/snapshots/analysis_server.dart.snapshot",
                "--lsp"
            ],
            "filetypes": [
                "dart"
            ]
        },
        "ccls": {
            "command": "ccls",
            "filetypes": [
                "c",
                "cpp",
                "cuda",
                "objc",
                "objcpp"
            ],
            "rootPatterns": [
                "compile_commands.json",
                ".ccls",
                ".root",
                ".git/"
            ],
            "initializationOptions": {
                "cacheDirectory": "/tmp/ccls"
            }
        },
        "bash": {
            "command": "bash-language-server",
            "filetypes": [
                "sh"
            ],
            "args": [
                "start"
            ],
            "ignoredRootPaths": [
                "~"
            ]
        },
        "texlab": {
            "command": "texlab",
            "filetypes": [
                "tex"
            ],
            "rootPatterns": [
                ".git/"
            ]
        }
    }
}
