Timestamp,kWh,kVAh,kW,kVA,current
2019-12-01 21:00:00,46.228215767638176,49.759336099588836,183.66897265625,200.53249609375,281.58292388916016
2019-12-01 21:15:00,45.76348547717498,50.2282157676309,183.46255208333332,200.56794270833333,281.617431640625
2019-12-01 21:30:00,45.76348547718226,50.49377593360987,184.88955078125,201.79479687499997,283.0400848388672
2019-12-01 21:45:00,46.552716320351465,50.48294589788566,184.3258984375,201.42360937499998,282.44676971435547
2019-12-01 22:00:00,46.00458310000249,50.13828877951164,182.37034895833335,199.271421875,279.42852783203125
2019-12-01 22:15:00,46.110687022897764,50.63358778625843,184.18944140625,201.03991015625,281.9737777709961
2019-12-01 22:30:00,46.47655815858161,50.83407914363488,186.40050520833333,203.86802604166667,285.9699300130208
2019-12-01 22:45:00,46.296574167587096,50.86875390756177,185.91884374999998,203.10286718749998,285.10118103027344
2019-12-01 23:00:00,46.59622562891309,51.31205402872001,185.94254687499998,203.36761458333334,285.23462931315106
2019-12-01 23:15:00,46.76348547718226,50.514522821576975,185.391484375,202.44480468749998,283.9910583496094
2019-12-01 23:30:00,46.79126230238762,50.96601625458425,185.49711328125,202.89337500000002,284.59358978271484
2019-12-01 23:45:00,46.860881542699644,51.14325068870676,186.97123046874998,204.76214453125,287.18102264404297
2019-12-02 00:00:00,46.68810511756601,51.330567081604386,187.23356770833334,204.58045833333335,286.94118245442706
2019-12-02 00:15:00,46.73200507527508,51.18733925448032,186.04565625,202.81394531249998,284.3181686401367
2019-12-02 00:30:00,46.794965879082156,51.26079352560191,186.83317968749998,204.31099609375,286.5990676879883
2019-12-02 00:45:00,46.85892116183095,51.12863070539606,187.13991015624998,204.2709375,286.5819320678711
2019-12-02 01:00:00,47.148946489192895,51.88054822079721,186.956234375,204.2602708333333,286.5058186848958
2019-12-02 01:15:00,47.485908282586024,51.360115679613955,186.92925,204.00685546875,286.2642593383789
2019-12-02 01:30:00,47.09100852445408,50.81574332887976,187.3521875,204.5727890625,287.00037384033203
2019-12-02 01:45:00,46.83015330127091,50.63238945120247,186.04683984375,203.10113671874998,285.0034713745117
2019-12-02 02:00:00,45.72398065910238,51.17797743561823,184.33893750000001,201.26849479166665,282.404541015625
2019-12-02 02:15:00,46.35537190082687,50.29752066115907,184.6342421875,201.80709374999998,283.0306930541992
2019-12-02 02:30:00,46.2479338842968,50.97933884297527,184.67886328125,201.52563671875,282.8201370239258
2019-12-02 02:45:00,46.768149240422645,50.4995199067198,184.23258854166667,201.26947916666666,282.31020100911456
2019-12-02 03:00:00,45.7717842323691,50.50207468879671,183.580625,200.73824609374998,281.36597442626953
2019-12-02 03:15:00,46.70848452229984,50.43419156582968,184.78631249999998,201.87394921875,282.92462158203125
2019-12-02 03:30:00,46.00105904616066,50.7359329155006,185.7652890625,203.56818749999996,285.0090560913086
2019-12-02 03:45:00,46.585233702549885,51.229107369428675,184.7759895833333,202.2692083333333,283.25816853841144
2019-12-02 04:00:00,46.45626007338433,50.27711669696146,185.03529687499997,202.33852343750002,283.62728118896484
2019-12-02 04:15:00,46.1161825726158,50.22406639003748,184.88819921875,201.94419921875,282.9040069580078
2019-12-02 04:30:00,46.76348547717498,51.1161825726158,184.9109375,202.34140625,283.5337219238281
2019-12-02 04:45:00,45.77150989335496,50.50246905113454,184.70928125,201.82741666666666,283.0511067708333
2019-12-02 05:00:00,46.805253592123336,51.11163883268455,184.69312890625002,201.98883203124998,282.99090576171875
2019-12-02 05:15:00,46.06639004149474,50.224066390044754,186.56831640625,204.03750390625,286.0867614746094
2019-12-02 05:30:00,46.44140733056702,51.13850276624726,184.70787499999997,201.859609375,283.17926025390625
2019-12-02 05:45:00,46.78265905947774,50.54614453665272,184.23065104166668,201.26240104166666,282.21189371744794
2019-12-02 06:00:00,46.28445526559517,50.52096978842019,184.795265625,202.12910546875,283.34412384033203
2019-12-02 06:15:00,46.292308219883125,50.7487397551522,185.764703125,202.69810937499997,283.8277053833008
2019-12-02 06:30:00,45.76348547717498,50.26556016597169,184.82598958333335,202.16389583333333,282.5324300130208
2019-12-02 06:45:00,46.76348547717498,51.18257261411054,184.8970625,202.06564453124997,282.39105224609375
2019-12-02 07:00:00,46.792291073696106,50.83618531600223,184.58024609375,201.33182421875,281.4895248413086
2019-12-02 07:15:00,46.24214876033511,50.92899449035758,185.79767968750002,203.41115625,284.3646240234375
2019-12-02 07:30:00,46.65020746887603,50.541874135546095,185.5356614583333,203.317953125,284.4575500488281
2019-12-02 07:45:00,46.516734679884394,51.09111484517052,186.19337109375,203.36250781249998,284.3076477050781
2019-12-02 08:00:00,46.52475909604982,51.2574328726696,186.362890625,203.60231249999998,284.83404541015625
2019-12-02 08:15:00,46.49377593360987,51.224066390044754,185.97648046875003,203.18339453124997,284.1766662597656
2019-12-02 08:30:00,47.49377593360987,51.224066390044754,186.41824479166667,203.81109375000003,285.1260070800781
2019-12-02 08:45:00,46.52074688796711,51.25311203319143,186.31510156250002,203.7405,284.8326873779297
2019-12-02 09:00:00,46.43723849372327,50.93723849372327,186.20499609375,203.43516406249998,283.9491729736328
2019-12-02 09:15:00,46.614628726194496,50.577284327853704,185.29565104166667,203.01706770833334,283.3728841145833
2019-12-02 09:30:00,46.76348547717498,51.18672199170396,186.13035937499998,203.704640625,284.86619567871094
2019-12-02 09:45:00,46.217705154143914,50.831813037955726,185.59989453125,202.96120703124998,284.37113189697266
2019-12-02 10:00:00,46.516734679884394,50.674411028434406,185.32848437500002,202.95350390625,284.0480422973633
2019-12-02 10:15:00,46.605809128632245,51.22406639003748,186.31759375000001,203.92410937500003,285.1775410970052
2019-12-02 10:30:00,46.76348547717498,51.224066390044754,186.93483984374998,204.34356250000002,285.4858169555664
2019-12-02 10:45:00,47.122897595894756,51.21081055398827,186.298171875,203.92544140625,284.90809631347656
2019-12-02 11:00:00,46.465678102424135,50.83473721154587,185.98849479166665,203.70659375,284.5499674479167
2019-12-02 11:15:00,46.78572559450549,51.22447040942643,186.06241015625,203.361046875,284.16703033447266
2019-12-02 11:30:00,46.79167381091247,50.95819759267033,186.867609375,204.14308203125,285.2875518798828
2019-12-02 11:45:00,46.76348547717498,51.49377593360987,185.82606640625,203.34972265624998,283.8757019042969
2019-12-02 12:00:00,46.49507368133345,50.4660280381795,187.069390625,204.68996875000002,285.6078287760417
2019-12-02 12:15:00,47.081689804144844,51.06924167136458,186.51784375,203.98360546875,284.4987106323242
2019-12-02 12:30:00,46.76348547718226,51.224066390044754,186.9434921875,204.01519921875,284.58068084716797
2019-12-02 12:45:00,46.72029422858759,51.226706903056765,183.99882812500002,201.53830208333332,281.3934834798177
2019-12-02 13:00:00,45.85646925688343,50.27951716333337,183.12537109375,200.09683203125,279.46742248535156
2019-12-02 13:15:00,45.76348547718226,50.22406639003748,182.4745546875,199.52174609375,278.45211029052734
2019-12-02 13:30:00,45.91286307053815,50.224066390044754,183.88319921875,200.67809375000002,280.0551986694336
2019-12-02 13:45:00,46.45315301469964,50.30377542133647,183.32968229166667,200.42623958333334,279.4595031738281
2019-12-02 14:00:00,45.97423287741549,50.588340761234576,184.0671640625,201.40877734375,280.7499008178711
2019-12-02 14:15:00,46.107883817428956,50.49377593360987,184.11314062499997,201.49597265625,280.74903869628906
2019-12-02 14:30:00,46.41908713692828,50.49377593360987,183.95376562500002,200.68902734375,279.82909393310547
2019-12-02 14:45:00,45.7731559274398,50.31003737869469,183.145734375,200.33492708333333,280.46544392903644
2019-12-02 15:00:00,46.343026645175996,50.731456397239526,185.74748828125,203.04482421875002,284.3976135253906
2019-12-02 15:15:00,46.49377593360987,50.76348547717498,186.309734375,203.51410546875,284.8322296142578
2019-12-02 15:30:00,46.4441891567476,51.166215150376956,185.95896354166666,203.9565,285.7725524902344
2019-12-02 15:45:00,46.826446280996606,50.5661157024806,186.4073828125,203.57679296875,285.24249267578125
2019-12-02 16:00:00,46.925619834706595,51.14462809917313,185.6820234375,202.6229375,284.26739501953125
2019-12-02 16:15:00,46.787147217175516,51.25167175336537,186.038703125,203.18090625,284.9558639526367
2019-12-02 16:30:00,46.704588320018956,51.227667089609895,184.86341666666667,202.07789583333332,283.23484293619794
2019-12-02 16:45:00,46.544374335586326,50.606357806660526,186.24544531249998,204.0464453125,285.91526794433594
2019-12-02 17:00:00,46.49377593360987,50.896265560164466,185.40373828124999,202.4774921875,283.8940963745117
2019-12-02 17:15:00,46.399434017948806,50.99694439139421,185.77394140624997,203.20297265624998,284.71580505371094
2019-12-02 17:30:00,46.72504730984656,50.58811784927093,185.012734375,201.87972916666664,283.0105387369792
2019-12-02 17:45:00,46.37869071705791,51.1106614999444,185.47741015625002,202.881328125,284.38634490966797
2019-12-02 18:00:00,46.5258735982934,50.25863310586283,185.20860546875002,202.2409453125,283.3320617675781
2019-12-02 18:15:00,46.435684647309245,51.16597510372958,185.459015625,202.14523046875001,283.3671875
2019-12-02 18:30:00,46.56323514282849,50.29440005487413,184.82915104166668,202.09330729166666,283.2255350748698
2019-12-02 18:45:00,45.987603305780794,50.71900826445926,184.39455078125002,201.15467187500002,281.9291687011719
2019-12-02 19:00:00,46.71440921193425,50.687471904282575,185.46109374999997,202.85015625,284.17213439941406
2019-12-02 19:15:00,45.83848677928472,50.32816541953798,184.31598958333333,201.36305208333332,282.21966552734375
2019-12-02 19:30:00,46.59999657076696,50.61659408114065,184.44642578124999,201.67296484375,282.61204528808594
2019-12-02 19:45:00,46.07635197695345,50.9892150474916,182.8969296875,199.87789062499996,280.1493377685547
2019-12-02 20:00:00,45.95020746887894,50.03734439834079,182.440359375,199.39240234375,279.73744201660156
2019-12-02 20:15:00,46.498233942598745,50.41558931449981,184.44230729166668,201.8952552083333,283.39756266276044
2019-12-02 20:30:00,45.89180755117559,50.27735674359428,183.25395312499998,200.42523828125,281.13245391845703
2019-12-02 20:45:00,41.18257261411054,44.87966804979078,183.2521640625,200.4773046875,281.26131439208984
