"ID","PARAMS","PRICE","TITLE","TITLEEXTENDED","URL"
"ID6FiVBw","Alfa Romeo|2017 |141 256 km|1 995 cm3|Benzyna","86000","Alfa Romeo Giulia 2.0 Turbo","Salon Polska, Klimatyzacja dwustrefowa, Czujniki parkowania","https://www.otomoto.pl/oferta/alfa-romeo-giulia-salon-polska-klimatyzacja-dwustrefowa-czujniki-parkowania-ID6FiVBw.html"
"ID6FiPEZ","Alfa Romeo|2017 |105 459 km|1 995 cm3|Benzyna","77000","Alfa Romeo Giulia 2.0 Turbo Business","Polski Salon","https://www.otomoto.pl/oferta/alfa-romeo-giulia-polski-salon-ID6FiPEZ.html"
"ID6F2JEr","Alfa Romeo|2019 |57 000 km|1 995 cm3|Benzyna","99999","Alfa Romeo Giulia 2.0 Turbo Business","SALON POLSKA/ FV23%/ Gwarancja Serwisowa/ NETTO 81300 zł","https://www.otomoto.pl/oferta/alfa-romeo-giulia-salon-polska-fv23-gwarancja-serwisowa-netto-81300-zl-ID6F2JEr.html"
"ID6FfSMc","Alfa Romeo|2016 |90 132 km|1 995 cm3|Benzyna","89900","Alfa Romeo Giulia","Comfort, 2016r.","https://www.otomoto.pl/oferta/alfa-romeo-giulia-comfort-2016r-ID6FfSMc.html"
"ID6FipEf","Alfa Romeo|2017 |85 700 km|1 995 cm3|Benzyna","93990","Alfa Romeo Giulia 2.0 Turbo Super","2,0 200 KM AT8 RWD Super z Polski","https://www.otomoto.pl/oferta/alfa-romeo-giulia-2-0-200-km-at8-rwd-super-z-polski-ID6FipEf.html"
"ID6FexGb","Alfa Romeo|2017 |43 114 km|1 998 cm3|Benzyna","98900","Alfa Romeo Giulia","2.0T RWD AT8, 2017r.","https://www.otomoto.pl/oferta/alfa-romeo-giulia-2-0t-rwd-at8-2017r-ID6FexGb.html"
"ID6FevbX","Alfa Romeo|2019 |42 000 km|1 995 cm3|Benzyna","87900","Alfa Romeo Giulia 2.0 Turbo Veloce Q4","2.0 Turbo 16v Veloce 280km A/t Awd, Salon PL, FV23","https://www.otomoto.pl/oferta/alfa-romeo-giulia-2-0-turbo-16v-veloce-280km-a-t-awd-salon-pl-fv23-ID6FevbX.html"
"ID6F5SD7","Alfa Romeo|2018 |126 000 km|1 995 cm3|Benzyna","89899","Alfa Romeo Giulia 2.0 Turbo Business","SALON/FV23%/ Gwarancja Serwisowa/ BUSSINES / 73 089 NETTO","https://www.otomoto.pl/oferta/alfa-romeo-giulia-salon-fv23-gwarancja-serwisowa-bussines-73-089-netto-ID6F5SD7.html"
