<svg xmlns="http://www.w3.org/2000/svg" width="38" height="38" viewBox="0 0 38 38">
  <path id="typescriptlang-icon" d="M0,18.5V37H37V0H0Zm29.817-1.474a4.608,4.608,0,0,1,2.314,1.333,6.079,6.079,0,0,1,.887,1.186c.012.046-1.6,1.127-2.573,1.733-.035.023-.176-.129-.335-.364a2.1,2.1,0,0,0-1.738-1.045c-1.122-.076-1.85.511-1.838,1.492a1.357,1.357,0,0,0,.158.694c.247.511.705.816,2.144,1.439,2.649,1.139,3.782,1.89,4.486,2.96a5.372,5.372,0,0,1,.429,4.51,4.96,4.96,0,0,1-4.093,2.931,11.351,11.351,0,0,1-2.819-.029A6.8,6.8,0,0,1,23.074,31.9a6.5,6.5,0,0,1-.963-1.428,2.809,2.809,0,0,1,.341-.217l1.374-.792,1.064-.617.223.33a4.964,4.964,0,0,0,1.4,1.345,3.435,3.435,0,0,0,3.6-.182,1.608,1.608,0,0,0,.206-2.049c-.288-.41-.875-.757-2.544-1.48A9.15,9.15,0,0,1,24.3,24.668a4.882,4.882,0,0,1-1.016-1.85,7.406,7.406,0,0,1-.065-2.361,4.5,4.5,0,0,1,3.794-3.512,9.383,9.383,0,0,1,2.807.082Zm-8.686,1.544.012,1.515H16.327V33.766H12.921V20.083H8.105V18.6l.04-1.526c.017-.023,2.948-.035,6.5-.029l6.466.017Z" transform="translate(0.5 0.502)" fill="none" stroke="#141414" stroke-width="1" opacity="0.5"/>
</svg>
