// Jest Snapshot v1, https://goo.gl/fbAQLP

exports[`FooterSection renders 1`] = `
<footer>
  <div
    className="footer"
  >
    <div
      className="footer-left"
    >
      <SectionTitle
        title="Contact"
        zIndex={100}
      />
      <div
        className="footer-left_form"
      >
        <label
          className="footer-left_form-label"
          htmlFor="contact-email"
        >
          E-Mail
        </label>
        <input
          className="footer-left_form-input"
          id="contact-email"
          type="email"
        />
        <label
          className="footer-left_form-label"
          htmlFor="contact-subject"
        >
          footer-subject
        </label>
        <input
          className="footer-left_form-input"
          id="contact-subject"
          type="text"
        />
        <label
          className="footer-left_form-label"
          htmlFor="contact-textarea"
        >
          footer-message
        </label>
        <textarea
          className="footer-left_form-input footer-left_form-input_textarea"
          id="contact-textarea"
        />
      </div>
    </div>
    <h4
      className="footer-divider"
    >
      footer-divider
    </h4>
    <div
      className="footer-right"
    >
      <h3
        className="footer-right_title"
      >
        footer-title
      </h3>
      <p
        className="footer-right_desc"
      >
        footer-description
      </p>
      <div
        className="footer-right_socialmedia"
      >
        <SocialMediaTile
          icon={<test-file-stub />}
          link="/alicja-kozik"
        />
        <SocialMediaTile
          icon={<test-file-stub />}
          link="koziiczkaa#2502"
        />
        <SocialMediaTile
          icon={<test-file-stub />}
          link="/alicja.kozik.19"
        />
        <SocialMediaTile
          icon={<test-file-stub />}
          link="alicja.kozik00@gmail.com"
        />
      </div>
    </div>
  </div>
  <div
    className="footer-copyright"
  >
    <p
      className="footer-copyright_text"
    >
      Designed and coded by Alicja Kozik © 2022 All rights reserved
    </p>
  </div>
</footer>
`;
