{
    "/dashboard/js/app.js": "/dashboard/js/app.js",
    "/dashboard/css/styles.css": "/dashboard/css/styles.css",
    "/templates/default/css/styles.css": "/templates/default/css/styles.css",
    "/templates/ancient-vanilla/css/styles.css": "/templates/ancient-vanilla/css/styles.css",
    "/templates/dark-soul/css/styles.css": "/templates/dark-soul/css/styles.css",
    "/templates/default/js/app.js": "/templates/default/js/app.js",
    "/templates/dark-soul/js/app.js": "/templates/dark-soul/js/app.js",
    "/templates/ancient-vanilla/js/app.js": "/templates/ancient-vanilla/js/app.js"
}
