{
	"info": {
		"_postman_id": "5d71697d-fae5-4556-8955-7c3820346ad6",
		"name": "Picts Manager",
		"schema": "https://schema.getpostman.com/json/collection/v2.1.0/collection.json"
	},
	"item": [
		{
			"name": "Auth",
			"item": [
				{
					"name": "Login User",
					"event": [
						{
							"listen": "prerequest",
							"script": {
								"id": "bc1c1aff-4016-418d-9835-83902d247016",
								"exec": [
									""
								],
								"type": "text/javascript"
							}
						},
						{
							"listen": "test",
							"script": {
								"id": "f17850bc-9faa-4b77-929b-50b9c4fdca1f",
								"exec": [
									"pm.test(\"Set JWT variable\", function () {",
									"    pm.environment.set(\"jwt\", pm.response.json().accessToken);",
									"});"
								],
								"type": "text/javascript"
							}
						}
					],
					"request": {
						"method": "POST",
						"header": [],
						"body": {
							"mode": "raw",
							"raw": "{\n    \"username\": \"user\",\n    \"password\": \"user\"\n}",
							"options": {
								"raw": {
									"language": "json"
								}
							}
						},
						"url": {
							"raw": "http://localhost:8080/api/auth/login",
							"protocol": "http",
							"host": [
								"localhost"
							],
							"port": "8080",
							"path": [
								"api",
								"auth",
								"login"
							]
						}
					},
					"response": []
				},
				{
					"name": "Login Admin",
					"event": [
						{
							"listen": "prerequest",
							"script": {
								"id": "6a05697c-e940-4e00-8034-69b85585e02d",
								"exec": [
									""
								],
								"type": "text/javascript"
							}
						},
						{
							"listen": "test",
							"script": {
								"id": "e96f6c56-0bf7-43b0-99bf-39a9ae38859c",
								"exec": [
									"pm.test(\"Set JWT variable\", function () {",
									"    pm.environment.set(\"jwt\", pm.response.json().accessToken);",
									"});"
								],
								"type": "text/javascript"
							}
						}
					],
					"request": {
						"method": "POST",
						"header": [],
						"body": {
							"mode": "raw",
							"raw": "{\n    \"username\": \"admin\",\n    \"password\": \"admin\"\n}",
							"options": {
								"raw": {
									"language": "json"
								}
							}
						},
						"url": {
							"raw": "http://localhost:8080/api/auth/login",
							"protocol": "http",
							"host": [
								"localhost"
							],
							"port": "8080",
							"path": [
								"api",
								"auth",
								"login"
							]
						}
					},
					"response": []
				}
			],
			"protocolProfileBehavior": {}
		},
		{
			"name": "Users",
			"item": [
				{
					"name": "Create user",
					"request": {
						"auth": {
							"type": "bearer",
							"bearer": [
								{
									"key": "token",
									"value": "{{jwt}}",
									"type": "string"
								}
							]
						},
						"method": "POST",
						"header": [],
						"body": {
							"mode": "raw",
							"raw": "{\n\t\"username\": \"user\",\n\t\"password\": \"user\"\n}",
							"options": {
								"raw": {
									"language": "json"
								}
							}
						},
						"url": {
							"raw": "http://localhost:8080/api/users",
							"protocol": "http",
							"host": [
								"localhost"
							],
							"port": "8080",
							"path": [
								"api",
								"users"
							]
						}
					},
					"response": []
				},
				{
					"name": "Get All Users",
					"request": {
						"auth": {
							"type": "bearer",
							"bearer": [
								{
									"key": "token",
									"value": "{{jwt}}",
									"type": "string"
								}
							]
						},
						"method": "GET",
						"header": [],
						"url": {
							"raw": "http://localhost:8080/api/users",
							"protocol": "http",
							"host": [
								"localhost"
							],
							"port": "8080",
							"path": [
								"api",
								"users"
							]
						}
					},
					"response": []
				},
				{
					"name": "Get User By Id",
					"event": [
						{
							"listen": "test",
							"script": {
								"id": "316fed05-b62d-4cae-8a26-36f87e767f89",
								"exec": [
									"pm.test(\"Set UserId variable\", function () {",
									"    pm.environment.set(\"userId\", pm.response.json().id);",
									"});"
								],
								"type": "text/javascript"
							}
						}
					],
					"request": {
						"auth": {
							"type": "bearer",
							"bearer": [
								{
									"key": "token",
									"value": "{{jwt}}",
									"type": "string"
								}
							]
						},
						"method": "GET",
						"header": [],
						"url": {
							"raw": "http://localhost:8080/api/users/{{userId}}",
							"protocol": "http",
							"host": [
								"localhost"
							],
							"port": "8080",
							"path": [
								"api",
								"users",
								"{{userId}}"
							]
						}
					},
					"response": []
				},
				{
					"name": "Update User By Id",
					"request": {
						"auth": {
							"type": "bearer",
							"bearer": [
								{
									"key": "token",
									"value": "{{jwt}}",
									"type": "string"
								}
							]
						},
						"method": "PUT",
						"header": [],
						"body": {
							"mode": "raw",
							"raw": "{\n\t\"username\": \"Fred\"\n}\n",
							"options": {
								"raw": {
									"language": "json"
								}
							}
						},
						"url": {
							"raw": "http://localhost:8080/api/users/{{userId}}",
							"protocol": "http",
							"host": [
								"localhost"
							],
							"port": "8080",
							"path": [
								"api",
								"users",
								"{{userId}}"
							]
						}
					},
					"response": []
				},
				{
					"name": "Delete User By Id",
					"request": {
						"auth": {
							"type": "bearer",
							"bearer": [
								{
									"key": "token",
									"value": "{{jwt}}",
									"type": "string"
								}
							]
						},
						"method": "DELETE",
						"header": [],
						"url": {
							"raw": "http://localhost:8080/api/users/{{userId}}",
							"protocol": "http",
							"host": [
								"localhost"
							],
							"port": "8080",
							"path": [
								"api",
								"users",
								"{{userId}}"
							]
						}
					},
					"response": []
				}
			],
			"protocolProfileBehavior": {}
		},
		{
			"name": "Photos",
			"item": [
				{
					"name": "Get All Photo Ids",
					"event": [
						{
							"listen": "test",
							"script": {
								"id": "6b1e58bc-4320-46a7-8580-c41fab3b3887",
								"exec": [
									"pm.environment.set(\"photoIdsList\", JSON.stringify(pm.response.json()));",
									""
								],
								"type": "text/javascript"
							}
						}
					],
					"request": {
						"auth": {
							"type": "bearer",
							"bearer": [
								{
									"key": "token",
									"value": "{{jwt}}",
									"type": "string"
								}
							]
						},
						"method": "GET",
						"header": [],
						"url": {
							"raw": "http://localhost:8080/api/photos/getAllIds",
							"protocol": "http",
							"host": [
								"localhost"
							],
							"port": "8080",
							"path": [
								"api",
								"photos",
								"getAllIds"
							]
						}
					},
					"response": []
				},
				{
					"name": "Get Photo Data By Id",
					"request": {
						"auth": {
							"type": "bearer",
							"bearer": [
								{
									"key": "token",
									"value": "{{jwt}}",
									"type": "string"
								}
							]
						},
						"method": "GET",
						"header": [],
						"url": {
							"raw": "http://localhost:8080/api/photos/{{photoId}}/data",
							"protocol": "http",
							"host": [
								"localhost"
							],
							"port": "8080",
							"path": [
								"api",
								"photos",
								"{{photoId}}",
								"data"
							]
						}
					},
					"response": []
				},
				{
					"name": "Get Photo Metadata By Id",
					"request": {
						"auth": {
							"type": "bearer",
							"bearer": [
								{
									"key": "token",
									"value": "{{jwt}}",
									"type": "string"
								}
							]
						},
						"method": "GET",
						"header": [],
						"url": {
							"raw": "http://localhost:8080/api/photos/{{photoId}}/metadata",
							"protocol": "http",
							"host": [
								"localhost"
							],
							"port": "8080",
							"path": [
								"api",
								"photos",
								"{{photoId}}",
								"metadata"
							]
						}
					},
					"response": []
				},
				{
					"name": "Add Photo Data",
					"event": [
						{
							"listen": "test",
							"script": {
								"id": "55627796-80cd-4135-bc83-6bd249e0fb37",
								"exec": [
									"pm.test(\"Set PhotoId variable\", function () {",
									"    pm.environment.set(\"photoId\", pm.response.json().id);",
									"});"
								],
								"type": "text/javascript"
							}
						}
					],
					"protocolProfileBehavior": {
						"disabledSystemHeaders": {}
					},
					"request": {
						"auth": {
							"type": "bearer",
							"bearer": [
								{
									"key": "token",
									"value": "{{jwt}}",
									"type": "string"
								}
							]
						},
						"method": "POST",
						"header": [],
						"body": {
							"mode": "file",
							"file": {
								"src": "/Users/kevinoustry/GoogleDrive/00_Epitech/MSC_1/T-DEV-800/pictsManager_2021_05/api/src/test/resources/testpic.jpg"
							},
							"options": {
								"file": {}
							}
						},
						"url": {
							"raw": "http://localhost:8080/api/photos/data",
							"protocol": "http",
							"host": [
								"localhost"
							],
							"port": "8080",
							"path": [
								"api",
								"photos",
								"data"
							]
						}
					},
					"response": []
				},
				{
					"name": "Add Photo Metadata",
					"request": {
						"auth": {
							"type": "bearer",
							"bearer": [
								{
									"key": "token",
									"value": "{{jwt}}",
									"type": "string"
								}
							]
						},
						"method": "POST",
						"header": [],
						"body": {
							"mode": "raw",
							"raw": "{\n\t\"title\": \"\",\n\t\"description\": \"\",\n\t\"tags\": [\n\t\t\"toulouse\",\n\t\t\"garonne\",\n\t\t\"skyline\"\n\t]\n}",
							"options": {
								"raw": {
									"language": "json"
								}
							}
						},
						"url": {
							"raw": "http://localhost:8080/api/photos/{{photoId}}/metadata",
							"protocol": "http",
							"host": [
								"localhost"
							],
							"port": "8080",
							"path": [
								"api",
								"photos",
								"{{photoId}}",
								"metadata"
							]
						}
					},
					"response": []
				},
				{
					"name": "Update Photo Metadata By Id",
					"request": {
						"auth": {
							"type": "bearer",
							"bearer": [
								{
									"key": "token",
									"value": "{{jwt}}",
									"type": "string"
								}
							]
						},
						"method": "PUT",
						"header": [],
						"body": {
							"mode": "raw",
							"raw": "{\n\t\"title\": \"appartement\",\n\t\"description\": \"Vue du balcon\",\n\t\"tags\": [\n\t\t\"toulouse\",\n\t\t\"garonne\",\n\t\t\"skyline\",\n\t\t\"planes\"\n\t]\n}",
							"options": {
								"raw": {
									"language": "json"
								}
							}
						},
						"url": {
							"raw": "http://localhost:8080/api/photos/{{photoId}}/metadata",
							"protocol": "http",
							"host": [
								"localhost"
							],
							"port": "8080",
							"path": [
								"api",
								"photos",
								"{{photoId}}",
								"metadata"
							]
						}
					},
					"response": []
				},
				{
					"name": "Delete Photo",
					"request": {
						"auth": {
							"type": "bearer",
							"bearer": [
								{
									"key": "token",
									"value": "{{jwt}}",
									"type": "string"
								}
							]
						},
						"method": "DELETE",
						"header": [],
						"url": {
							"raw": "http://localhost:8080/api/photos/{{photoId}}",
							"protocol": "http",
							"host": [
								"localhost"
							],
							"port": "8080",
							"path": [
								"api",
								"photos",
								"{{photoId}}"
							]
						}
					},
					"response": []
				}
			],
			"protocolProfileBehavior": {}
		},
		{
			"name": "Albums",
			"item": [
				{
					"name": "Get All Albums",
					"request": {
						"auth": {
							"type": "bearer",
							"bearer": [
								{
									"key": "token",
									"value": "{{jwt}}",
									"type": "string"
								}
							]
						},
						"method": "GET",
						"header": [],
						"url": {
							"raw": "http://localhost:8080/api/albums",
							"protocol": "http",
							"host": [
								"localhost"
							],
							"port": "8080",
							"path": [
								"api",
								"albums"
							]
						}
					},
					"response": []
				},
				{
					"name": "Get Album By Id",
					"request": {
						"auth": {
							"type": "bearer",
							"bearer": [
								{
									"key": "token",
									"value": "{{jwt}}",
									"type": "string"
								}
							]
						},
						"method": "GET",
						"header": [],
						"url": {
							"raw": "http://localhost:8080/api/albums/{{albumId}}",
							"protocol": "http",
							"host": [
								"localhost"
							],
							"port": "8080",
							"path": [
								"api",
								"albums",
								"{{albumId}}"
							]
						}
					},
					"response": []
				},
				{
					"name": "Create Album",
					"event": [
						{
							"listen": "test",
							"script": {
								"id": "54d0cd48-46f3-4b9e-9843-44f35e0da600",
								"exec": [
									"pm.test(\"Set AlbumId variable\", function () {",
									"    pm.environment.set(\"albumId\", pm.response.json().id);",
									"});"
								],
								"type": "text/javascript"
							}
						},
						{
							"listen": "prerequest",
							"script": {
								"id": "45429c9f-2604-4995-b242-0df5e1b0d388",
								"exec": [
									""
								],
								"type": "text/javascript"
							}
						}
					],
					"request": {
						"auth": {
							"type": "bearer",
							"bearer": [
								{
									"key": "token",
									"value": "{{jwt}}",
									"type": "string"
								}
							]
						},
						"method": "POST",
						"header": [],
						"body": {
							"mode": "raw",
							"raw": "{\n\t\"metadata\": {\n\t\t\"title\": \"Album test\",\n\t\t\"description\": \"This is a test album\",\n\t\t\"tags\": [\n\t\t\t\"tag1\",\n\t\t\t\"tag2\"\n\t\t]\n\t},\n\t\"photoIdsList\": {{photoIdsList}}\n}",
							"options": {
								"raw": {
									"language": "json"
								}
							}
						},
						"url": {
							"raw": "http://localhost:8080/api/albums/create",
							"protocol": "http",
							"host": [
								"localhost"
							],
							"port": "8080",
							"path": [
								"api",
								"albums",
								"create"
							]
						}
					},
					"response": []
				},
				{
					"name": "Delete Album",
					"request": {
						"auth": {
							"type": "bearer",
							"bearer": [
								{
									"key": "token",
									"value": "{{jwt}}",
									"type": "string"
								}
							]
						},
						"method": "DELETE",
						"header": [],
						"url": {
							"raw": "http://localhost:8080/api/albums/{{albumId}}",
							"protocol": "http",
							"host": [
								"localhost"
							],
							"port": "8080",
							"path": [
								"api",
								"albums",
								"{{albumId}}"
							]
						}
					},
					"response": []
				},
				{
					"name": "Update Album Metadata",
					"request": {
						"auth": {
							"type": "bearer",
							"bearer": [
								{
									"key": "token",
									"value": "{{jwt}}",
									"type": "string"
								}
							]
						},
						"method": "PUT",
						"header": [],
						"body": {
							"mode": "raw",
							"raw": "{\n\t\"title\": \"Album Toulouse\",\n\t\"description\": \"This is a test album\",\n\t\"tags\": [\n\t\t\"tag1\",\n\t\t\"tag2\",\n\t\t\"tag3\"\n\t]\n}",
							"options": {
								"raw": {
									"language": "json"
								}
							}
						},
						"url": {
							"raw": "http://localhost:8080/api/albums/{{albumId}}/metadata",
							"protocol": "http",
							"host": [
								"localhost"
							],
							"port": "8080",
							"path": [
								"api",
								"albums",
								"{{albumId}}",
								"metadata"
							]
						}
					},
					"response": []
				},
				{
					"name": "Add Photos to Album",
					"request": {
						"auth": {
							"type": "bearer",
							"bearer": [
								{
									"key": "token",
									"value": "{{jwt}}",
									"type": "string"
								}
							]
						},
						"method": "POST",
						"header": [],
						"body": {
							"mode": "raw",
							"raw": "{{photoIdsList}}",
							"options": {
								"raw": {
									"language": "json"
								}
							}
						},
						"url": {
							"raw": "http://localhost:8080/api/albums/{{albumId}}/photos",
							"protocol": "http",
							"host": [
								"localhost"
							],
							"port": "8080",
							"path": [
								"api",
								"albums",
								"{{albumId}}",
								"photos"
							]
						}
					},
					"response": []
				},
				{
					"name": "Remove Photos From Album",
					"request": {
						"auth": {
							"type": "bearer",
							"bearer": [
								{
									"key": "token",
									"value": "{{jwt}}",
									"type": "string"
								}
							]
						},
						"method": "DELETE",
						"header": [],
						"body": {
							"mode": "raw",
							"raw": "{{photoIdsList}}",
							"options": {
								"raw": {
									"language": "json"
								}
							}
						},
						"url": {
							"raw": "http://localhost:8080/api/albums/{{albumId}}/photos",
							"protocol": "http",
							"host": [
								"localhost"
							],
							"port": "8080",
							"path": [
								"api",
								"albums",
								"{{albumId}}",
								"photos"
							]
						}
					},
					"response": []
				}
			],
			"protocolProfileBehavior": {}
		},
		{
			"name": "Access",
			"item": [
				{
					"name": "Get User Access",
					"request": {
						"auth": {
							"type": "bearer",
							"bearer": [
								{
									"key": "token",
									"value": "{{jwt}}",
									"type": "string"
								}
							]
						},
						"method": "GET",
						"header": [],
						"url": {
							"raw": "http://localhost:8080/api/access/users/{{userId}}",
							"protocol": "http",
							"host": [
								"localhost"
							],
							"port": "8080",
							"path": [
								"api",
								"access",
								"users",
								"{{userId}}"
							]
						}
					},
					"response": []
				},
				{
					"name": "Get Resource Access",
					"request": {
						"auth": {
							"type": "bearer",
							"bearer": [
								{
									"key": "token",
									"value": "{{jwt}}",
									"type": "string"
								}
							]
						},
						"method": "GET",
						"header": [],
						"url": {
							"raw": "http://localhost:8080/api/access/resources/{{albumId}}",
							"protocol": "http",
							"host": [
								"localhost"
							],
							"port": "8080",
							"path": [
								"api",
								"access",
								"resources",
								"{{albumId}}"
							]
						}
					},
					"response": []
				},
				{
					"name": "Add Readers To Album",
					"request": {
						"auth": {
							"type": "bearer",
							"bearer": [
								{
									"key": "token",
									"value": "{{jwt}}",
									"type": "string"
								}
							]
						},
						"method": "POST",
						"header": [],
						"body": {
							"mode": "raw",
							"raw": "[\n\t\"admin\"\n]",
							"options": {
								"raw": {
									"language": "json"
								}
							}
						},
						"url": {
							"raw": "http://localhost:8080/api/access/albums/{{albumId}}",
							"protocol": "http",
							"host": [
								"localhost"
							],
							"port": "8080",
							"path": [
								"api",
								"access",
								"albums",
								"{{albumId}}"
							]
						}
					},
					"response": []
				},
				{
					"name": "Remove Readers From Album",
					"request": {
						"auth": {
							"type": "bearer",
							"bearer": [
								{
									"key": "token",
									"value": "{{jwt}}",
									"type": "string"
								}
							]
						},
						"method": "DELETE",
						"header": [],
						"body": {
							"mode": "raw",
							"raw": "[\n\t\"admin\"\n]",
							"options": {
								"raw": {
									"language": "json"
								}
							}
						},
						"url": {
							"raw": "http://localhost:8080/api/access/albums/{{albumId}}",
							"protocol": "http",
							"host": [
								"localhost"
							],
							"port": "8080",
							"path": [
								"api",
								"access",
								"albums",
								"{{albumId}}"
							]
						}
					},
					"response": []
				},
				{
					"name": "Add Readers To Photo",
					"request": {
						"auth": {
							"type": "bearer",
							"bearer": [
								{
									"key": "token",
									"value": "{{jwt}}",
									"type": "string"
								}
							]
						},
						"method": "POST",
						"header": [],
						"body": {
							"mode": "raw",
							"raw": "[\n\t\"admin\"\n]",
							"options": {
								"raw": {
									"language": "json"
								}
							}
						},
						"url": {
							"raw": "http://localhost:8080/api/access/photos/{{photoId}}",
							"protocol": "http",
							"host": [
								"localhost"
							],
							"port": "8080",
							"path": [
								"api",
								"access",
								"photos",
								"{{photoId}}"
							]
						}
					},
					"response": []
				},
				{
					"name": "Remove Readers From Photo",
					"request": {
						"auth": {
							"type": "bearer",
							"bearer": [
								{
									"key": "token",
									"value": "{{jwt}}",
									"type": "string"
								}
							]
						},
						"method": "DELETE",
						"header": [],
						"body": {
							"mode": "raw",
							"raw": "[\n\t\"admin\"\n]",
							"options": {
								"raw": {
									"language": "json"
								}
							}
						},
						"url": {
							"raw": "http://localhost:8080/api/access/photos/{{photoId}}",
							"protocol": "http",
							"host": [
								"localhost"
							],
							"port": "8080",
							"path": [
								"api",
								"access",
								"photos",
								"{{photoId}}"
							]
						}
					},
					"response": []
				}
			],
			"protocolProfileBehavior": {}
		},
		{
			"name": "Search",
			"item": [
				{
					"name": "Search photo",
					"request": {
						"auth": {
							"type": "bearer",
							"bearer": [
								{
									"key": "token",
									"value": "{{jwt}}",
									"type": "string"
								}
							]
						},
						"method": "GET",
						"header": [],
						"url": {
							"raw": "http://localhost:8080/api/search/toulouse",
							"protocol": "http",
							"host": [
								"localhost"
							],
							"port": "8080",
							"path": [
								"api",
								"search",
								"toulouse"
							]
						}
					},
					"response": []
				}
			],
			"protocolProfileBehavior": {}
		}
	],
	"protocolProfileBehavior": {}
}