<svg width="17" height="17" viewBox="0 0 17 17" fill="none" xmlns="http://www.w3.org/2000/svg">
<path d="M8.5 8.5L16 16" stroke="white" stroke-width="2" stroke-linecap="round"/>
<path d="M8.5 8.5L1 1" stroke="white" stroke-width="2" stroke-linecap="round"/>
<path d="M8.5 8.5L1 16" stroke="white" stroke-width="2" stroke-linecap="round"/>
<path d="M8.49976 8.5L15.9998 1" stroke="white" stroke-width="2" stroke-linecap="round"/>
</svg>
