<svg width="20" height="14" viewBox="0 0 20 14" fill="none" xmlns="http://www.w3.org/2000/svg">
<path d="M17.0875 4.88691C16.5373 3.02613 14.8154 1.66826 12.7763 1.66826C12.4514 1.66826 12.1347 1.70307 11.8294 1.76846C11.0069 0.712189 9.72311 0.0327148 8.28063 0.0327148C5.79789 0.0327148 3.78512 2.04545 3.78512 4.52828C3.78512 4.5592 3.78567 4.59002 3.78629 4.62077C1.62682 5.054 0 6.96089 0 9.24787C0 11.8545 2.1131 13.9675 4.71972 13.9675H15.2804C17.887 13.9675 20 11.8545 20 9.24787C19.9999 7.28151 18.7974 5.59625 17.0875 4.88691ZM12.1541 7.51866C12.011 7.66186 11.8233 7.7335 11.6356 7.7335C11.4478 7.7335 11.2602 7.6619 11.117 7.51873L10.7335 7.1353V10.5697C10.7335 10.9748 10.4052 11.3031 10.0001 11.3031C9.595 11.3031 9.2666 10.9748 9.2666 10.5697V7.13527L8.88314 7.51873C8.5967 7.8051 8.13242 7.8051 7.84592 7.51866C7.55948 7.23223 7.55955 6.76788 7.84592 6.48145L9.48144 4.84606C9.76791 4.55969 10.2322 4.55972 10.5187 4.84606L12.1541 6.48145C12.4405 6.76785 12.4406 7.23226 12.1541 7.51866Z" fill="#2F55B4"/>
</svg>
