<svg width="16" height="16" viewBox="0 0 16 16" fill="none" xmlns="http://www.w3.org/2000/svg">
<path d="M-9.53674e-07 7.9994C-9.53674e-07 7.76087 0.0967522 7.53211 0.268971 7.36344C0.441191 7.19477 0.67477 7.10001 0.918326 7.10001L11.6774 7.10001L7.65272 3.57322C7.56203 3.4947 7.48809 3.39939 7.43515 3.29279C7.3822 3.18618 7.35129 3.07037 7.34421 2.95203C7.33713 2.83368 7.354 2.71513 7.39386 2.6032C7.43373 2.49126 7.49579 2.38815 7.57649 2.29979C7.65719 2.21143 7.75493 2.13956 7.86409 2.08833C7.97325 2.03709 8.09167 2.0075 8.21254 2.00125C8.33342 1.995 8.45437 2.01222 8.56843 2.05191C8.68249 2.0916 8.78741 2.15298 8.87716 2.23253L14.6932 7.32906C14.7897 7.41342 14.8669 7.51681 14.9198 7.63243C14.9727 7.74805 15 7.87331 15 8C15 8.12669 14.9727 8.25195 14.9198 8.36757C14.8669 8.48319 14.7897 8.58658 14.6932 8.67094L8.87716 13.7675C8.78741 13.847 8.68249 13.9084 8.56843 13.9481C8.45437 13.9878 8.33342 14.005 8.21254 13.9987C8.09167 13.9925 7.97325 13.9629 7.86409 13.9117C7.75493 13.8604 7.65719 13.7886 7.57649 13.7002C7.49579 13.6119 7.43373 13.5087 7.39386 13.3968C7.354 13.2849 7.33713 13.1663 7.34421 13.048C7.35129 12.9296 7.3822 12.8138 7.43515 12.7072C7.48809 12.6006 7.56203 12.5053 7.65272 12.4268L11.6774 8.89879L0.918326 8.89879C0.67477 8.89879 0.441191 8.80403 0.268971 8.63536C0.0967522 8.4667 -9.53674e-07 8.23793 -9.53674e-07 7.9994Z" fill="#767676"/>
</svg>
