<svg width="18" height="18" viewBox="0 0 18 18" fill="none" xmlns="http://www.w3.org/2000/svg">
<circle cx="9" cy="9" r="9" fill="white"/>
<path fill-rule="evenodd" clip-rule="evenodd" d="M7.34998 6.30005C7.34998 5.88584 7.68576 5.55005 8.09998 5.55005H10.2V12.6C10.2 13.0143 9.86419 13.35 9.44998 13.35C9.03576 13.35 8.69998 13.0143 8.69998 12.6V7.05005H8.09998C7.68576 7.05005 7.34998 6.71426 7.34998 6.30005Z" fill="#2F55B4"/>
<path fill-rule="evenodd" clip-rule="evenodd" d="M6.44995 12.6001C6.44995 12.1859 6.78574 11.8501 7.19995 11.8501H10.8C11.2142 11.8501 11.55 12.1859 11.55 12.6001C11.55 13.0143 11.2142 13.3501 10.8 13.3501H7.19995C6.78574 13.3501 6.44995 13.0143 6.44995 12.6001Z" fill="#2F55B4"/>
<ellipse cx="9.54" cy="4.1401" rx="0.54" ry="0.54" fill="#2F55B4"/>
</svg>
