<svg width="16" height="17" viewBox="0 0 16 17" fill="none" xmlns="http://www.w3.org/2000/svg">
<g clip-path="url(#clip0_2303_209)">
<path d="M13.5176 2.77224C11.558 0.795612 8.52786 0.500012 7.62064 0.5C6.71342 0.499988 5.60208 0.764705 4.7629 1.4486C3.92373 2.13249 3.24331 2.97078 2.74434 5.11065C2.24537 7.25052 2.33609 9.76543 2.42681 10.9346C2.51753 12.1038 2.22269 12.876 1.83712 13.4495C1.52866 13.9084 0.48385 14.479 0 14.707C0.211684 14.8467 0.821033 15.1703 1.56495 15.3467C2.49485 15.5674 4.33197 15.8762 6.30517 15.1923C8.27837 14.5084 8.32373 13.4054 8.21033 12.5009C8.09693 11.5965 7.64332 11.442 7.37115 11.2876C7.09899 11.1332 5.5794 11.3538 5.14847 11.2876C4.71754 11.2214 4.71754 10.9346 4.7629 10.5375C4.80826 10.1405 4.71754 10.1625 4.58146 10.0302C4.44537 9.89779 4.53609 9.67719 4.58146 9.611C4.62682 9.54482 4.44537 9.45658 4.40001 9.34628C4.35465 9.23598 4.60414 8.99331 4.60414 8.86095C4.60414 8.72858 4.10517 8.50798 3.96908 8.28737C3.833 8.06677 4.69486 7.36083 4.83094 6.9858C4.96703 6.61077 4.74022 5.97101 4.7629 5.24301C4.78105 4.66062 5.05775 3.83849 5.19383 3.50023C5.6928 4.265 6.89487 6.04161 7.71136 7.02992C8.73199 8.26531 10.4103 9.45658 11.7031 10.692C12.7374 11.6803 13.4798 13.2951 13.7217 13.979C14.3492 13.0892 15.6631 10.9788 15.899 9.65513C16.1939 8.00058 15.9671 5.24302 13.5176 2.77224Z" fill="#151E2F"/>
<circle cx="12.5" cy="12.5" r="3.5" fill="#2F55B4"/>
<path fill-rule="evenodd" clip-rule="evenodd" d="M12 14L12 11L13 11L13 14L12 14Z" fill="white"/>
<path fill-rule="evenodd" clip-rule="evenodd" d="M11 12H14V13H11V12Z" fill="white"/>
</g>
<defs>
<clipPath id="clip0_2303_209">
<rect width="16" height="16" fill="white" transform="translate(0 0.5)"/>
</clipPath>
</defs>
</svg>
