<svg width="16" height="17" viewBox="0 0 16 17" fill="none" xmlns="http://www.w3.org/2000/svg">
<path d="M8.49968 1C4.3581 1 1 4.3581 1 8.49968C1 12.6413 4.3581 16 8.49968 16C12.6413 16 16 12.6413 16 8.49968C16 4.3581 12.6413 1 8.49968 1ZM10.061 12.6235C9.67492 12.7759 9.36762 12.8914 9.13714 12.9714C8.9073 13.0514 8.64 13.0914 8.33587 13.0914C7.86857 13.0914 7.50476 12.9771 7.24571 12.7492C6.98667 12.5213 6.85778 12.2324 6.85778 11.8813C6.85778 11.7448 6.8673 11.6051 6.88635 11.4629C6.90603 11.3206 6.93714 11.1606 6.97968 10.981L7.46286 9.27429C7.5054 9.11048 7.54222 8.95492 7.57143 8.81016C7.60064 8.66413 7.6146 8.53016 7.6146 8.40825C7.6146 8.19111 7.56952 8.03873 7.48 7.95302C7.38921 7.8673 7.21841 7.8254 6.96381 7.8254C6.83937 7.8254 6.71111 7.84381 6.57968 7.88254C6.44952 7.92254 6.33651 7.95873 6.24381 7.99429L6.37143 7.46857C6.68762 7.33968 6.99048 7.22921 7.27937 7.13778C7.56825 7.04508 7.84127 6.99937 8.09841 6.99937C8.56254 6.99937 8.92064 7.11238 9.1727 7.33587C9.42349 7.56 9.54984 7.85143 9.54984 8.20952C9.54984 8.28381 9.54095 8.4146 9.52381 8.60127C9.50667 8.78857 9.47429 8.95937 9.4273 9.11619L8.94667 10.8178C8.9073 10.9543 8.87238 11.1105 8.84064 11.2851C8.80952 11.4597 8.79429 11.593 8.79429 11.6825C8.79429 11.9086 8.84444 12.0629 8.94603 12.1448C9.04635 12.2267 9.22222 12.2679 9.47111 12.2679C9.58857 12.2679 9.72 12.247 9.86857 12.2063C10.0159 12.1657 10.1225 12.1295 10.1898 12.0984L10.061 12.6235ZM9.97587 5.71683C9.75175 5.92508 9.4819 6.02921 9.16635 6.02921C8.85143 6.02921 8.57968 5.92508 8.35365 5.71683C8.12889 5.50857 8.01524 5.25524 8.01524 4.95937C8.01524 4.66413 8.12952 4.41016 8.35365 4.2C8.57968 3.98921 8.85143 3.88444 9.16635 3.88444C9.4819 3.88444 9.75238 3.98921 9.97587 4.2C10.2 4.41016 10.3124 4.66413 10.3124 4.95937C10.3124 5.25587 10.2 5.50857 9.97587 5.71683Z" fill="#151E2F"/>
</svg>
