<svg width="20" height="20" viewBox="0 0 20 20" fill="none" xmlns="http://www.w3.org/2000/svg">
<path d="M17.5124 2.27231L17.5134 2.27303C18.4921 2.9468 19.0546 3.76565 19.317 4.65627C19.5817 5.55498 19.5506 6.5616 19.2793 7.61314C18.7342 9.72595 17.2417 11.928 15.4992 13.559L15.4983 13.5598C14.0563 14.9158 12.5997 16.2315 11.503 17.2087C10.9548 17.6972 10.4969 18.1008 10.1761 18.3821C10.1118 18.4386 10.0529 18.4901 10 18.5364C9.94707 18.4901 9.88825 18.4386 9.82389 18.3821C9.50314 18.1008 9.04523 17.6972 8.49703 17.2087C7.40034 16.2315 5.94371 14.9158 4.50167 13.5598L4.50082 13.559C2.7583 11.928 1.26581 9.72595 0.720692 7.61314C0.449389 6.5616 0.418259 5.55498 0.683018 4.65627C0.945368 3.76574 1.50782 2.94697 2.48626 2.27324C3.57975 1.52273 4.54843 1.28331 5.37895 1.3137C6.21542 1.3443 6.95619 1.65044 7.58325 2.06263C8.2117 2.47574 8.71171 2.98637 9.05677 3.3991C9.22838 3.60436 9.35932 3.78259 9.44643 3.90799C9.48993 3.97062 9.52235 4.01986 9.54329 4.05244C9.55376 4.06873 9.56135 4.08084 9.56602 4.08835L9.5708 4.09613L9.57115 4.0967L9.57135 4.09703L9.57148 4.09725L9.57154 4.09734L10.0011 4.81396L10.4291 4.09633L10.4291 4.09625L10.4292 4.09604L10.4294 4.0957L10.4298 4.09511L10.4346 4.08728C10.4393 4.07971 10.4469 4.06753 10.4573 4.05114C10.4783 4.01836 10.5107 3.96885 10.5543 3.90588C10.6414 3.77978 10.7724 3.60062 10.944 3.39431C11.2891 2.97946 11.7891 2.46646 12.4175 2.05184C13.0444 1.63816 13.7847 1.33158 14.6204 1.30213C15.4501 1.2729 16.4186 1.51511 17.5124 2.27231Z" stroke="#2F55B4"/>
</svg>
