<svg width="16" height="17" viewBox="0 0 16 17" fill="none" xmlns="http://www.w3.org/2000/svg">
<path fill-rule="evenodd" clip-rule="evenodd" d="M0.505991 5.25796L7.50599 1.28069C7.81233 1.10663 8.18767 1.10663 8.49401 1.28069L15.494 5.25796C15.8068 5.43567 16 5.76769 16 6.12742V15C16 15.5523 15.5523 16 15 16H1C0.447715 16 0 15.5523 0 15V6.12742C0 5.76768 0.193218 5.43567 0.505991 5.25796ZM3.38108 5.00004L8 5.00015L12.6189 5.00004C13.0866 5.00003 13.2983 5.58476 12.939 5.88415L8.32009 9.73326C8.13467 9.88778 7.86533 9.88778 7.67991 9.73326L3.06097 5.88415C2.70171 5.58476 2.91342 5.00003 3.38108 5.00004Z" fill="#151E2F"/>
</svg>
