<svg width="15" height="10" viewBox="0 0 15 10" fill="none" xmlns="http://www.w3.org/2000/svg">
<path fill-rule="evenodd" clip-rule="evenodd" d="M10.1821 1.13626C10.2402 1.07628 10.3092 1.02868 10.3851 0.99621C10.461 0.963736 10.5424 0.947021 10.6246 0.947021C10.7068 0.947021 10.7882 0.963736 10.8641 0.99621C10.9401 1.02868 11.009 1.07628 11.0671 1.13626L14.8168 5.00116C14.875 5.06099 14.9212 5.13207 14.9527 5.21033C14.9842 5.28859 15.0004 5.37249 15.0004 5.45721C15.0004 5.54194 14.9842 5.62584 14.9527 5.70409C14.9212 5.78235 14.875 5.85343 14.8168 5.91327L11.0671 9.77816C10.9497 9.89912 10.7906 9.96707 10.6246 9.96707C10.4587 9.96707 10.2995 9.89912 10.1821 9.77816C10.0648 9.65721 9.99886 9.49316 9.99886 9.32211C9.99886 9.15105 10.0648 8.987 10.1821 8.86605L13.4907 5.45721L10.1821 2.04838C10.1239 1.98854 10.0778 1.91746 10.0463 1.8392C10.0148 1.76094 9.99854 1.67705 9.99854 1.59232C9.99854 1.50759 10.0148 1.4237 10.0463 1.34544C10.0778 1.26718 10.1239 1.1961 10.1821 1.13626Z" fill="#2F55B4"/>
<path fill-rule="evenodd" clip-rule="evenodd" d="M0 5.45763C0 5.28679 0.0658437 5.12294 0.183046 5.00214C0.300248 4.88134 0.459209 4.81348 0.624958 4.81348H13.7491C13.9148 4.81348 14.0738 4.88134 14.191 5.00214C14.3082 5.12294 14.374 5.28679 14.374 5.45763C14.374 5.62846 14.3082 5.79231 14.191 5.91311C14.0738 6.03391 13.9148 6.10177 13.7491 6.10177H0.624958C0.459209 6.10177 0.300248 6.03391 0.183046 5.91311C0.0658437 5.79231 0 5.62846 0 5.45763Z" fill="#2F55B4"/>
</svg>
