{
  "id": "lang-de",
  "title": "German [Core]",
  "description": "German language support for Foundry VTT",
  "version": "11.0",
  "authors": [
    {
      "name": "Hydroxi"
    },
    {
      "name": "lutece"
    },
    {
      "name": "henry4k"
    },
    {
      "name": "ElCamino"
    },
    {
      "name": "SirGawain"
    },
    {
      "name": "kosmos.ac",
      "discord": "@kosmos.ac"
    }
  ],
  "languages": [
    {
      "lang": "de",
      "name": "Deutsch (German)",
      "path": "lang/de.json"
    },
    {
      "lang": "de",
      "name": "Tour: Spielflächen-Bedienelemente",
      "path": "tours/canvas-controls.json"
    },
    {
      "lang": "de",
      "name": "Tour: Eine Welt erstellen",
      "path": "tours/creating-a-world.json"
    },
    {
      "lang": "de",
      "name": "Tour: Ein System installieren",
      "path": "tours/installing-a-system.json"
    },
    {
      "lang": "de",
      "name": "Tour: Die Seitenleiste",
      "path": "tours/sidebar.json"
    },
    {
      "lang": "de",
      "name": "Tour: UI Übersicht",
      "path": "tours/ui-overview.json"
    },
    {
      "lang": "de",
      "name": "Tour: Willkommen zu Foundry Virtual Tabletop",
      "path": "tours/welcome.json"
    }
  ],
  "styles": [
    "css/style.css"
  ],
  "coreTranslation": true,
  "url": "https://gitlab.com/henry4k/foundryvtt-lang-de",
  "manifest": "https://gitlab.com/henry4k/foundryvtt-lang-de/-/raw/master/module.json",
  "download": "https://gitlab.com/henry4k/foundryvtt-lang-de/-/jobs/artifacts/v11.0/download?job=build",
  "bugs": "https://gitlab.com/henry4k/foundryvtt-lang-de/-/issues",
  "readme": "https://gitlab.com/henry4k/foundryvtt-lang-de/-/raw/master/README.md",
  "compatibility": {
    "minimum": "10",
    "verified": "10",
    "maximum": "11"
  }
}
