﻿0,nil,,,,,
1,_label,str,,,,
2,mov,reg,reg,,,
3,mov,reg,str,,,
4,mov,reg,num,,,
5,add,reg,num,num,,
6,sub,reg,num,num,,
7,mul,reg,num,num,,
8,div,reg,num,num,,
9,echo,str,reg,*,,
10,echo,str,,,,
11,comp,num,num,,,
12,jmp,adr,,,,
13,jzer,adr,,,,
14,jmin,adr,,,,
15,jplu,adr,,,,
16,push,reg,,,,
17,push,num,,,,
18,push,str,,,,
19,pop,reg,,,,
20,async,,,,,
21,await,,,,,
22,call,adr,,,,
23,return,,,,,
24,exit,,,,,
25,assert,,,,,
26,mset,num,num,,,
27,mset,num,str,,,
28,mget,reg,num,,,
29,_name,str,,,,
30,_text,str,,,,
31,_newpage,,,,,
32,_voice,str,,,,
33,wait,num,,,,
64,new,str,str,reg,,
65,delete,reg,,,,
66,show,reg,num,num,num,num
67,show,reg,num,,,
68,hide,reg,num,,,
69,scale,reg,num,num,num,
70,move,reg,num,num,num,
71,rotate,reg,num,num,,
72,fx_fade,str,num,,,
73,fx_clear,num,,,,
74,bgm,str,,,,
75,se,str,,,,
76,stopbgm,,,,,
77,win_open,,,,,
78,win_close,,,,,
