<?xml version="1.0" encoding="utf-8"?>
<svg xmlns="http://www.w3.org/2000/svg"
	xmlns:xlink="http://www.w3.org/1999/xlink"
	width="9px" height="16px" viewBox="0 0 9 16">
<path fillRule="evenodd" d="M 8.71 8.71C 8.69 8.73 8.67 8.74 8.65 8.76 8.65 8.76 1.69 15.71 1.69 15.71 1.3 16.1 0.67 16.1 0.29 15.71-0.1 15.33-0.1 14.7 0.29 14.31 0.29 14.31 6.6 8 6.6 8 6.6 8 0.29 1.69 0.29 1.69-0.1 1.3-0.1 0.67 0.29 0.29 0.67-0.1 1.3-0.1 1.69 0.29 1.69 0.29 8.65 7.24 8.65 7.24 8.67 7.26 8.69 7.27 8.71 7.29 8.91 7.48 9 7.74 9 8 9 8.26 8.91 8.52 8.71 8.71Z" fill="rgb(71,71,71)" opacity="0.50"/></svg>