<?xml version="1.0" encoding="utf-8"?>
<svg xmlns="http://www.w3.org/2000/svg"
	xmlns:xlink="http://www.w3.org/1999/xlink"
	width="26px" height="21px" viewBox="0 0 26 21">
<filter filterUnits="objectBoundingBox" x="0.00" y="0.00" width="100.00" height="100.00" id="filter0">
<feFlood flood-color="rgb(228,227,227)" result="coFloodOut1"/>
<feComposite in="coFloodOut1" in2="SourceAlpha" operator="in" result="coOverlay1"/>
<feBlend in="coOverlay1" in2="SourceGraphic" mode="normal" result="colorOverlay1"/>
</filter>
<path fillRule="evenodd" d="M 24.5 12C 24.5 12 1.5 12 1.5 12 0.67 12 0 11.33 0 10.5 0 9.67 0.67 9 1.5 9 1.5 9 24.5 9 24.5 9 25.33 9 26 9.67 26 10.5 26 11.33 25.33 12 24.5 12ZM 24.5 3C 24.5 3 7.5 3 7.5 3 6.67 3 6 2.33 6 1.5 6 0.67 6.67-0 7.5-0 7.5-0 24.5-0 24.5-0 25.33-0 26 0.67 26 1.5 26 2.33 25.33 3 24.5 3ZM 1.5 18C 1.5 18 24.5 18 24.5 18 25.33 18 26 18.67 26 19.5 26 20.33 25.33 21 24.5 21 24.5 21 1.5 21 1.5 21 0.67 21 0 20.33 0 19.5 0 18.67 0.67 18 1.5 18Z" fill="rgb(51,51,51)" filter="url(#filter0)"/></svg>