[block #00]
[message #00]
//[script val=0A][script val=81][person id=03]
//Viper's work,[pause t=06][nl]
//most likely.[clr]
//Boobytraps and[nl]
//explosives are[nl]
//his specialty……[clr]
//probably had a[nl]
//mic in the cuffs[nl]
//too,[scrl]
//was listening [nl]
//in.[clr]
//[script val=46][person id=01]
//[speed v=04]He deliberately[nl]
//blew the thing[nl]
//in front of[scrl]
//Snake……?[clr]
//[script val=49][person id=02]
//Oh God……[clr]
//[person id=00]
//[speed v=02]Viper……[speed v=03][clr]
//[script val=4B][person id=04]
//……Snake,[pause t=06]Bison[nl]
//said there were[nl]
//five of the [scrl]
//Black Chamber [nl]
//left.[clr]
//[person id=00]
//That's right.[clr]
//[script val=46][person id=01]
//Slasher Hawk,[clr]
//Marionette Owl,[clr]
//Pyro Bison,[clr]
//Black Art [nl]
//Viper……[clr]
//[script val=4A][person id=03]
//One unaccounted[nl]
//for.[clr]
//[script val=4B][person id=04]
//……Couldn't it[nl]
//be her?[fade val=88][sound id=08][pause t=C0][clr]
//[person id=00]
//[speed v=02]What![speed v=03][scrl]
[script val=0A][script val=81][person id=03]
Определённо,[pause t=06] работа[nl]
Вайпера.[clr]
Ловушки и мины - его[nl]
конёк...[clr]
Скорее всего,[pause t=06] засунул в[nl]
эти браслеты микрофон и[nl]
подслушивал.[clr]
[script val=46][person id=01]
[speed v=04]Он нарочно взорвал их[nl]
перед Снейком?..[clr]
[script val=49][person id=02]
Боже...[clr]
[person id=00]
[speed v=02]Вайпер...[speed v=03][clr]
[script val=4B][person id=04]
...Снейк,[pause t=06] Бизон сказал,[nl]
что выживших из «Тёмной[nl]
палаты»‎ было пятеро.[clr]
[person id=00]
Всё так.[clr]
[script val=46][person id=01]
Рубака-Ястреб,[clr]
Филин-Кукловод,[clr]
Огненный бизон,[clr]
Колдун Вайпер...[clr]
[script val=4A][person id=03]
Одного не хватает.[clr]
[script val=4B][person id=04]
...Может быть,[pause t=06] это[nl]
она?[fade val=88][sound id=08][pause t=C0][clr]
[person id=00]
[speed v=02]Что?![speed v=03][scrl]

[message #01]
//[script val=0B][script val=81][person id=04]
//Look,[pause t=06]if Chris[nl]
//is the fifth[nl]
//Black Chamber,[clr]
//everything makes[nl]
//sense.[clr]
//The leak,[pause t=06][nl]
//the ambush,[pause t=06][nl]
//what happened[scrl]
//to Harks -[clr]
//[person id=00]
//[speed v=01]What the hell[nl]
//are you saying?[speed v=03][clr]
//[person id=04]
//Snake,[pause t=06]calm down[nl]
//and think about[nl]
//this.[clr]
//[person id=00]
//[speed v=01]Shut up![clr]
//[speed v=02]Chris,[pause t=04]can you[nl]
//hear me?[speed v=03][scrl]
[script val=0B][script val=81][person id=04]
Послушай,[pause t=06] если Крис -[nl]
пятый наёмник из «Тёмной[nl]
Палаты»‎,[pause t=06] это всё[scrl]
объясняет.[clr]
Утечку,[pause t=06] засаду,[nl]
случившееся с[nl]
Харксом...[clr]
[person id=00]
[speed v=01]Хватит нести чушь.[speed v=03][clr]
[person id=04]
Снейк,[pause t=06] успокойся и[nl]
подумай.[clr]
[person id=00]
[speed v=01]Заткнись![clr]
[speed v=02]Крис,[pause t=06] как слышишь?[speed v=03][scrl]

[message #02]
//[script val=14][person id=13]
//…………[clr]
//[person id=00]
//[speed v=01]Chris,[pause t=03]come in,[pause t=06][nl]
//Chris![speed v=03][clr]
//[person id=13]
//…………[clr]
//[person id=00]
//[speed v=01]Chris![speed v=03][clr]
//[person id=13]
//…………[clr]
//[person id=00]
//[speed v=05]…………[speed v=03][scrl]
[script val=14][person id=13]
...[clr]
[person id=00]
[speed v=01]Крис,[pause t=06] ответь мне,[nl]
Крис![speed v=03][clr]
[person id=13]
...[clr]
[person id=00]
[speed v=01]Крис![speed v=03][clr]
[person id=13]
...[clr]
[person id=00]
[speed v=05]...[speed v=03][scrl]

[message #03]
//[script val=0B][person id=04]
//Looks like[nl]
//that's settled……[fade val=0F][pause t=E8][sound id=0E][clr]
//[script val=46][person id=01]
//Snake,[pause t=06]the F-22's[nl]
//have already [nl]
//left their base[scrl]
//and the attack [nl]
//will start any[nl]
//minute.[clr]
//[speed v=04]I know this is [nl]
//tough……[pause t=08][speed v=03] but get [nl]
//yourself to the[scrl]
//maintenance[nl]
//base.[clr]
//[person id=00]
//[speed v=04]…… Understood.[speed v=03][scrl]
[script val=0B][person id=04]
Кажется,[pause t=06] с этим[nl]
разобрались...[fade val=0F][pause t=E8][sound id=0E][clr]
[script val=46][person id=01]
Снейк,[pause t=06] F-22 уже покинули[nl]
свой аэродром,[pause t=06] атака[nl]
начнётся с минуты на[scrl]
минуту.[clr]
[speed v=04]Я знаю,[pause t=06] это[nl]
нелегко...[pause t=08][speed v=03][clr]
Но нужно добраться до[nl]
этой ремонтной базы.[clr]
[person id=00]
[speed v=04]...Понял.[speed v=03][scrl]

[message #04]
//[person id=01]
//Snake,[pause t=06]the F-22's[nl]
//have entered [nl]
//Gindran[scrl]
//air space.[scrl]
[person id=01]
Снейк,[pause t=06] F-22 вошли в[nl]
воздушное пространство[nl]
Гиндры.[scrl]

[message #05]
//[person id=01]
//Cruise missile[nl]
//launched……[pause t=0A]now.[scrl]
[person id=01]
Крылатые ракеты[nl]
[pause t=0A]пущены...[scrl]

[message #06]
//[person id=02]
//Satellite[nl]
//confirmation[nl]
//in.[clr]
//Target[nl]
//destroyed.[scrl]
[person id=02]
Подтверждение со[nl]
спутника.[clr]
Цели уничтожены.[scrl]

[message #07]
//[person id=01]
//Snake,[pause t=06]keep[nl]
//going north.[clr]
//Infiltrate the[nl]
//maintenance base[nl]
//and destroy[scrl]
//Metal Gear.[scrl]
[person id=01]
Снейк,[pause t=06] продолжай[nl]
двигаться на север.[clr]
Проникни на ремонтную[nl]
базу и уничтожь Metal[nl]
Gear.[scrl]

[message #08]
//[person id=00]
//[speed v=01]Chris?[speed v=03][scrl]
[person id=00]
[speed v=01]Крис?[speed v=03][scrl]

[message #09]
//[person id=00]
//Chris - [pause t=0C]no[nl]
//you're not……[scrl]
[person id=00]
Крис?[nl]
Нет...[nl]
Ты - не она...[scrl]

[message #10]
//[person id=0E]
//[voice id=0D]Sorry to[nl]
//disappoint you.[scrl]
[person id=0E]
[voice id=0D]Извини,[pause t=06] если[nl]
разочаровала.[scrl]

[message #11]
//[person id=00]
//You're the -[pause t=0A][nl]
//General's second[nl]
//in command?[clr]
//[person id=0E]
//[voice id=0D]Sophie N'dram[nl]
//at your service,[pause t=06][nl]
//Solid Snake.[clr]
//[speed v=02]Don't move.[speed v=03][clr]
//You'd like[nl]
//to live a bit[nl]
//longer,[scrl]
//wouldn't you?[clr]
//[person id=00]
//Put the gun[nl]
//down.[clr]
//[person id=0D]
//Can the `Legend'[nl]
//actually be[nl]
//pleading for[scrl]
//his life?[clr]
//[person id=00]
//No.[pause t=03] But I don't[nl]
//plan on being[nl]
//killed by you.[clr]
//[person id=0D]
//My,[pause t=06]you're[nl]
//pretty[nl]
//confident.[clr]
//[person id=00]
//You're all[nl]
//being used.[clr]
//[person id=0D]
//Are you talking[nl]
//about Black[nl]
//Chamber?[clr]
//No,[pause t=06]actually[nl]
//we're the one [nl]
//using them.[clr]
//[person id=00]
//Oh?[clr]
//[person id=0D]
//Revenge against[nl]
//Fox-Hound and[nl]
//the U.S.[clr]
//We know their [nl]
//real objective.[clr]
//[person id=00]
//You know and[nl]
//still -?[scrl]
[person id=00]
Ты - главная помощница[nl]
самого Генерала?[clr]
[person id=0E]
[voice id=0D]Софи н'Дрэм,[pause t=06] к твоим[nl]
услугам,[pause t=06] Солид Снейк.[clr]
[speed v=02]Не двигайся.[speed v=03][clr]
Ведь ты хочешь прожить[nl]
чуть дольше,[pause t=06] не так ли?[clr]
[person id=00]
Опусти пистолет.[clr]
[person id=0D]
А «Легенда»‎ может молить[nl]
о пощаде?[clr]
[person id=00]
Нет.[pause t=03] Но в мои планы не[nl]
входит смерть от твоей[nl]
руки.[clr]
[person id=0D]
Однако. Самоуверенности[nl]
тебе не занимать.[clr]
[person id=00]
Вас всех используют.[clr]
[person id=0D]
Ты имеешь в виду «Тёмную[nl]
палату»‎?[clr]
Нет,[pause t=06] вообще-то,[pause t=06] это мы[nl]
их используем.[clr]
[person id=00]
Что?[clr]
[person id=0D]
Месть «Фоксхаунду»‎ и[nl]
Соединённым Штатам.[clr]
Мы знаем их истинные[nl]
цели.[clr]
[person id=00]
Вы знаете и всё[nl]
равно?..[scrl]

[message #12]
//[person id=0D]
//Yes.[pause t=0A][nl]
//Exploitation[nl]
//in the name of[scrl]
//`justice' and[nl]
//ideals.[clr]
//We have all[nl]
//the aces now.[clr]
//They'll be mad [nl]
//if I kill you [nl]
//here won't they?[clr]
//[person id=00]
//`Justice'?[clr]
//[person id=0D]
//The `justice'[nl]
//and `order'[nl]
//being given lip[scrl]
//service in your[nl]
//society applies[nl]
//only to that[scrl]
//world.[clr]
//Free trade,[pause t=06][nl]
//world order -[clr]
//all the[nl]
//trappings of[nl]
//your private,[clr]
//exclusive ethics[nl]
//that keep[nl]
//bleeding Gindra[scrl]
//for the sake of[nl]
//first world[nl]
//prosperity.[clr]
//We finally said[nl]
//no more,[pause t=06]and[nl]
//troops were sent[scrl]
//in to bar our [nl]
//way.[clr]
//But this time,[pause t=06][nl]
//we will break[nl]
//free of first[scrl]
//world meddling.[clr]
//[person id=00]
//Is that your[nl]
//`ideal'? [pause t=0A]Or[nl]
//the General's?[clr]
//[person id=0D]
//Mine.[clr]
//[person id=00]
//That's a lie.[scrl]
[person id=0D]
Да.[pause t=0A][nl]
Эксплуатация во имя[nl]
«справедливости»‎ и[scrl]
высших целей.[clr]
Теперь у нас на руках[nl]
все козыри.[clr]
Они очень разозлятся,[nl]
если я убью тебя здесь и[nl]
сейчас,[pause t=06] не так ли?[clr]
[person id=00]
Во имя «справедливости»‎?[clr]
[person id=0D]
«Справедливость»‎ и[nl]
«право»‎,[pause t=06] пустые слова[nl]
для вашего общества,[scrl]
касаются только этого[nl]
мира.[clr]
Свободная торговля,[nl]
мировой порядок,[pause t=06] будто[nl]
ваши личные побрякушки,[scrl]
которые заставляют[nl]
Гиндру страдать ради[nl]
процветания «первого[scrl]
мира»‎.[clr]
Но на этот раз мы[nl]
прорвёмся,[pause t=06] избавимся от[nl]
гнёта стран «первого[scrl]
мира»‎.[clr]
[person id=00]
Это твоя «высшая цель»‎?[nl]
Или Генерала?[clr]
[person id=0D]
Моя.[clr]
[person id=00]
Лжёшь.[scrl]

[block #01]
[message #00]
//[person id=0D]
//The tables have[nl]
//turned,[pause t=06]I see.[clr]
//[person id=00]
//Will you plead[nl]
//for your life?[clr]
//[person id=0D]
//No. [pause t=06]I'm not[nl]
//afraid to die.[clr]
//[person id=00]
//For the `ideal'?[clr]
//[person id=0D]
//Yes.[clr]
//[person id=00]
//Why so fervent?[scrl]
[person id=0D]
Неожиданный поворот.[clr]
[person id=00]
Будешь молить о пощаде?[clr]
[person id=0D]
Нет. Я не боюсь смерти.[clr]
[person id=00]
Ради «высшей цели»‎?[clr]
[person id=0D]
Да.[clr]
[person id=00]
Откуда такая[nl]
самоотверженность?[scrl]

[message #01]
//[person id=0D]
//Have you ever[nl]
//been treated[nl]
//like a piece[scrl]
//of dirt?[clr]
//[person id=00]
//?[clr]
//[person id=0D]
//My father was[nl]
//French.[fade val=96][sound id=09][pause t=DA][pause t=DA][clr]
//He met my mother[nl]
//after his firm [nl]
//sent him to [scrl]
//Gindra,[pause t=06]and [nl]
//I was born.[clr]
//But she was[nl]
//nothing but a[nl]
//little local[scrl]
//color to him;[clr]
//when his term[nl]
//was over,[pause t=06]he[nl]
//went back to[scrl]
//France without[nl]
//giving us a[nl]
//second thought.[clr]
//I was still[nl]
//just a baby.[clr]
//I went to see[nl]
//him once I was[nl]
//grown,[clr]
//but all he did [nl]
//was give me some[nl]
//money and demand[scrl]
//that I never [nl]
//bother him [nl]
//again……[clr]
//I learned that[nl]
//day that neither[nl]
//I nor my[scrl]
//country could[nl]
//expect anything[nl]
//better than that[scrl]
//from your kind……[clr]
//[person id=00]
//…………[clr]
//[person id=0D]
//I used the money[nl]
//for university[nl]
//education in[scrl]
//Britain,[pause t=06]to take[nl]
//the knowledge[nl]
//and the skills[scrl]
//back to Gindra.[clr]
//While I was[nl]
//there,[pause t=06]the[nl]
//genocide policy[scrl]
//went into effect[nl]
//- my mother,[pause t=06][nl]
//an ethnic[scrl]
//minority,[pause t=06]died[nl]
//at the hands of[nl]
//government[scrl]
//soldiers.[clr]
//I flew back to[nl]
//Gindra and[nl]
//joined GLF.[clr]
//Deeds,[pause t=06][nl]
//not words,[pause t=06][nl]
//I thought.[scrl]
[person id=0D]
Ты когда-нибудь[nl]
чувствовал,[pause t=06] как тебя[nl]
смешивают с грязью?[clr]
[person id=00]
?[clr]
[person id=0D]
Мой отец был[nl]
французом.[fade val=96][sound id=09][pause t=DA][pause t=DA][clr]
Он познакомился с[nl]
матерью,[pause t=06] когда его фирма[nl]
отправила его в Гиндру.[clr]
В результате родилась[nl]
я.[clr]
Но моя мать для него[nl]
была не более чем[nl]
«местным колоритом»‎.[clr]
Когда пришло время,[pause t=06] он[nl]
вернулся во Францию,[nl]
бросив нас не[scrl]
раздумывая.[clr]
Я была совсем малюткой.[clr]
Уже взрослой я однажды[nl]
навестила его.[clr]
Он дал мне денег и[nl]
потребовал,[pause t=06] чтобы я[nl]
никогда не беспокоила[scrl]
его снова...[clr]
В тот день я поняла,[pause t=06] что[nl]
ни я,[pause t=06] ни мой народ не[nl]
можем рассчитывать на[scrl]
большее от людей твоего[nl]
мира...[clr]
[person id=00]
...[clr]
[person id=0D]
Я воспользовалась[nl]
деньгами,[pause t=06] чтобы получить[nl]
университетское[scrl]
образование в[nl]
Великобритании,[pause t=06][nl]
привезти в Гиндру знания[scrl]
и навыки.[clr]
Пока я училась,[pause t=06] достигла[nl]
своего пика политика[nl]
геноцида.[clr]
Моя мать,[pause t=06] из[nl]
национальных[nl]
меньшинств, погибла от[scrl]
рук правительственных[nl]
солдат.[clr]
Я вернулась в Гиндру и[nl]
присоединилась к GLF.[clr]
Меньше слов,[pause t=06] больше[nl]
дела,[pause t=06] решила я.[scrl]

[message #02]
//[person id=0D]
//[speed v=04]But the [nl]
//government was [nl]
//winning,[clr]
//and we were [nl]
//almost gone.[clr]
//[speed v=03]That's when [nl]
//he-[pause t=0A]the General-[nl]
//appeared,[clr]
//and suddenly [nl]
//turned things [nl]
//around.[clr]
//Plentiful funds,[pause t=04][nl]
//new weapons,[clr]
//and most of all,[pause t=06][nl]
//the ideals he[nl]
//brought us.[clr]
//A true[nl]
//independence for[nl]
//our people,[clr]
//a country for[nl]
//ourselves.[clr]
//[speed v=02]Everyone saw the[nl]
//future in him[speed v=03][clr]
//- I did too……[clr]
//[speed v=04]There was a time[nl]
//when he was[nl]
//everything to [scrl]
//me……[speed v=03][clr]
//[person id=00]
//Is he still?[scrl]
[person id=0D]
Но власти одерживали[nl]
одну победу за другой,[nl]
мы почти проиграли.[clr]
[speed v=03]Именно тогда появился[nl]
он,[pause t=06] Генерал,[pause t=06] и всё[nl]
неожиданно переменилось.[clr]
Он обеспечил нас[nl]
деньгами,[pause t=06] новым оружием[nl]
и,[pause t=06] что важнее всего,[scrl]
«высшими целями»‎,[nl]
«идеалами»‎.[clr]
Подлинная независимость[nl]
для нашего народа,[nl]
страна для нас.[clr]
[speed v=02]Каждый смотрел на него и[nl]
видел будущее.[speed v=03][clr]
И я тоже...[clr]
[speed v=04]Когда-то он был для меня[nl]
всем...[speed v=03][clr]
[person id=00]
А теперь?[scrl]

[message #03]
//[person id=0D]
//[speed v=05]…………[clr]
//……No.[clr]
//…………[fade val=16][pause t=D8][pause t=C8][sound id=0E][speed v=03][scrl]
[person id=0D]
[speed v=05]...[clr]
...Уже нет.[clr]
...[fade val=16][pause t=D8][pause t=C8][sound id=0E][speed v=03][scrl]

[message #04]
//[person id=0D]
//Let me ask you[nl]
//something.[clr]
//Why did you call[nl]
//me a liar?[clr]
//[person id=00]
//Your eyes[nl]
//don't have the[nl]
//hardness of[scrl]
//someone who[nl]
//lives for that[nl]
//single cause.[clr]
//[person id=0D]
//…………[clr]
//[person id=00]
//Instead,[pause t=06]you[nl]
//looked as though[nl]
//you were[scrl]
//struggling[nl]
//to hold on……[scrl]
[person id=0D]
Я могу спросить?[clr]
Почему ты сказал,[pause t=06] что я[nl]
лгу?[clr]
[person id=00]
В твоих глазах нет[nl]
решимости того,[pause t=06] кто[nl]
живёт ради идеала.[clr]
[person id=0D]
...[clr]
[person id=00]
Напротив,[pause t=06] ты выглядела[nl]
так,[pause t=06] как будто держишься[nl]
из последних сил...[scrl]

[message #05]
//[person id=0D]
//…………[clr]
//[speed v=04]……you are,[pause t=06][nl]
//perhaps,[pause t=06]right[nl]
//about that……[speed v=03][scrl]
[person id=0D]
...[clr]
[speed v=04]Возможно,[pause t=06] ты[nl]
прав...[speed v=03][scrl]

[message #06]
//[person id=0D]
//You won't kill[nl]
//me?[scrl]
[person id=0D]
Ты меня не убьёшь?[scrl]

[message #07]
//[person id=00]
//Out of ammo.[scrl]
[person id=00]
Патроны кончились.[scrl]

[message #08]
//[person id=0D]
//I know you're[nl]
//lying.[scrl]
[person id=0D]
Это ложь.[scrl]

[message #09]
//[person id=00]
//You're free[nl]
//to go.[scrl]
[person id=00]
Иди,[pause t=06] ты свободна.[scrl]

[message #10]
//[person id=0D]
//……Snake,[pause t=0C]your[nl]
//friend is still[nl]
//alive.[scrl]
[person id=0D]
...Снейк,[pause t=06] твоя подруга[nl]
всё ещё жива.[scrl]

[message #11]
//[person id=00]
//[speed v=02]Are you talking[nl]
//about Chris?[speed v=03][scrl]
[person id=00]
[speed v=02]Ты имеешь в виду[nl]
Крис?[speed v=03][scrl]

[message #12]
//[person id=0D]
//Yes.[pause t=06] Viper's[nl]
//taken her.[scrl]
[person id=0D]
Да. Вайпер забрал её.[scrl]

[message #13]
//[person id=0D]
//Go and help her.[clr]
//I know she's[nl]
//waiting for you.[scrl]
[person id=0D]
Спаси её.[clr]
Я знаю,[pause t=06] она ждёт тебя.[scrl]

[message #14]
//[person id=00]
//I would even if[nl]
//she weren't.[scrl]
[person id=00]
Я отправился бы спасать[nl]
её,[pause t=06] даже если бы она[nl]
меня не ждала.[scrl]

[message #15]
//[person id=0D]
//She's a lucky[nl]
//woman.[scrl]
[person id=0D]
Повезло ей с тобой.[scrl]

[message #16]
//[person id=00]
//She would have[nl]
//been luckier if[nl]
//she hadn't had[scrl]
//anything to do[nl]
//with me.[scrl]
[person id=00]
Ей повезло бы гораздо[nl]
больше,[pause t=06] если бы она[nl]
никогда со мной не[scrl]
связывалась.[scrl]

[message #17]
//[person id=0D]
//I doubt that.[scrl]
[person id=0D]
Сомневаюсь.[scrl]

[message #18]
//[person id=01]
//Snake,[pause t=06]we're[nl]
//almost out of[nl]
//time.[clr]
//Metal Gear[nl]
//should be [nl]
//further below.[clr]
//[speed v=02]Hurry![speed v=03][scrl]
[person id=01]
Снейк,[pause t=06] времени почти[nl]
нет.[clr]
Metal Gear должен[nl]
находиться ниже.[clr]
[speed v=02]Торопись![speed v=03][scrl]

[message #19]
//[person id=0A]
//Welcome,[pause t=06][nl]
//Solid Snake.[scrl]
[person id=0A]
Добро пожаловать,[pause t=06] Солид[nl]
Снейк.[scrl]

[message #20]
//[person id=00]
//[speed v=01]Viper![speed v=03][scrl]
[person id=00]
[speed v=01]Вайпер![speed v=03][scrl]

[block #02]
[message #00]
//[person id=0A]
//I made a promise[nl]
//to you,[clr]
//and now is the [nl]
//time for you to [nl]
//die.[clr]
//[person id=00]
//[speed v=02]Where's Chris?[speed v=03][clr]
//[person id=0A]
//Patience is a[nl]
//virtue,[pause t=06]Snake.[clr]
//You'll see her[nl]
//soon enough.[clr]
//[person id=00]
//Viper,[pause t=06]I know[nl]
//about Black[nl]
//Chamber being[scrl]
//Fox-Hound's[nl]
//shadow.[clr]
//But why revenge?[clr]
//What happened[nl]
//two years ago?[clr]
//[person id=0A]
//All right.[pause t=08] I'll[nl]
//tell you about[nl]
//it,[clr]
//and having[nl]
//learned what[nl]
//your crimes are,[clr]
//you'll rot in[nl]
//hell……[clr]
//Two years ago,[pause t=06][nl]
//we the Black[nl]
//Chamber were [scrl]
//given a top[nl]
//secret mission-[clr]
//The recovery of[nl]
//Metal Gear.[sound id=0F][pause t=B4][clr]
//[person id=00]
//[speed v=02]??[speed v=03][fade val=8F][sound id=02][pause t=DA][clr]
//[person id=0A]
//Metal Gear's[nl]
//development had[nl]
//been underway[scrl]
//for several[nl]
//years at that[nl]
//point,[scrl]
//under CIA[nl]
//supervision.[clr]
//A South American[nl]
//terrorist group[nl]
//seized it [scrl]
//two years ago,[clr]
//and Black [nl]
//Chamber[nl]
//was sent in.[clr]
//Just as you were[nl]
//this time.[clr]
//[person id=00]
//…………[scrl]
[person id=0A]
Я обещал тебе смерть,[nl]
пришло время исполнить[nl]
обещанное.[clr]
[person id=00]
[speed v=02]Где Крис?[speed v=03][clr]
[person id=0A]
Потерпи,[pause t=06] Снейк.[clr]
Вы скоро увидитесь.[clr]
[person id=00]
Вайпер,[pause t=06] я знаю,[pause t=06] что[nl]
«Тёмная Палата»‎ была[nl]
тенью «Фоксхаунда»‎.[clr]
Но за что вы мстите?[clr]
Что случилось два года[nl]
назад?[clr]
[person id=0A]
Что ж. Я расскажу тебе.[nl]
Ты узнаешь о своих[nl]
преступлениях и сгоришь[scrl]
в аду...[clr]
Два года назад нам,[nl]
«Тёмной палате»‎,[nl]
поручили сверхсекретную[scrl]
миссию... Найти Metal[nl]
Gear.[sound id=0F][pause t=B4][clr]
[person id=00]
[speed v=02]?![speed v=03][fade val=8F][sound id=02][pause t=DA][clr]
[person id=0A]
В то время создание[nl]
Metal Gear уже несколько[nl]
лет полным ходом велось[scrl]
под контролем ЦРУ.[clr]
Группа южноамериканских[nl]
террористов похитила его[nl]
два года назад,[pause t=06] и[scrl]
«Тёмной палате»‎ поручили[nl]
разобраться с[nl]
ситуацией.[clr]
Точно так же,[pause t=06] как тебе в[nl]
этот раз.[clr]
[person id=00]
...[scrl]

[message #01]
//[person id=0A]
//We took heavy[nl]
//damage - [pause t=06]but[nl]
//succeeded in[scrl]
//destroying Metal[nl]
//Gear.[clr]
//But some in the[nl]
//government were[nl]
//afraid.[clr]
//That the fact of[nl]
//Metal Gear's[nl]
//development,[clr]
//the existence of[nl]
//Black Chamber,[clr]
//and above all[nl]
//else,[pause t=06]the work[nl]
//we had been[scrl]
//doing,[pause t=06]would[nl]
//become public[nl]
//knowledge……[clr]
//When we came[nl]
//home,[pause t=06]many of[nl]
//the unit[scrl]
//missing,[pause t=06]the[nl]
//rest wounded,[clr]
//we were met by[nl]
//government-sent[nl]
//assassins -[scrl]
[person id=0A]
Мы понесли серьёзные[nl]
потери,[pause t=06] но справились с[nl]
миссией. Metal Gear был[scrl]
уничтожен.[clr]
Но кое-кто в[nl]
правительстве[nl]
испугался.[clr]
Испугался,[pause t=06] что о самом[nl]
создании Metal Gear,[pause t=06] о[nl]
существовании «Тёмной[scrl]
палаты»‎ и,[pause t=06] самое[nl]
главное,[pause t=06] о проделанной[nl]
нами работе узнает[scrl]
широкая[nl]
общественность...[clr]
Далеко не все из нас[nl]
уцелели,[pause t=06] а выжившие были[nl]
серьёзно ранены.[clr]
Когда мы вернулись[nl]
домой,[pause t=06] нас поджидал[nl]
посланный правительством[scrl]
отряд профессиональных[nl]
убийц...[scrl]

[message #02]
//[person id=0A]
//Fox-Hound![clr]
//[person id=00]
//[speed v=02]What!?[speed v=03][scrl]
[person id=0A]
«Фоксхаунд»‎![clr]
[person id=00]
[speed v=02]Что?![speed v=03][scrl]

[message #03]
//[person id=0A]
//My men were cut[nl]
//down unarmed,[pause t=06][nl]
//caught in the[scrl]
//trap.[clr]
//Without a [nl]
//chance,[pause t=06]without[nl]
//even knowing[scrl]
//why,[pause t=06]senseless[nl]
//and sudden death[nl]
//- crushed like[scrl]
//insects…… [scrl]
[person id=0A]
Моих людей,[pause t=06] безоружных,[nl]
поймали в ловушку и[nl]
перебили.[clr]
Не оставив ни малейшего[nl]
шанса,[pause t=06] без каких-либо[nl]
объяснений.[clr]
Их поубивали,[pause t=06] как[nl]
клопов...[scrl]

[message #04]
//[person id=0A]
//[speed v=02]I can never[nl]
//forget that [nl]
//night.[speed v=03][clr]
//I still don't[nl]
//know who ordered[nl]
//our deaths.[clr]
//The real name[nl]
//appears nowhere[nl]
//on classified[scrl]
//records.[clr]
//He is only [nl]
//referred to[nl]
//as -[clr]
//`Anonymous'.[clr]
//[person id=00]
//`Anonymous'?[clr]
//[person id=0A]
//Those of us who[nl]
//survived vowed[nl]
//vengeance - [pause t=06]and[scrl]
//I settled here.[clr]
//Outer Heaven,[pause t=06][nl]
//Metal Gear,[pause t=06][nl]
//Project Babel……[clr]
//it all began[nl]
//here……[clr]
//[speed v=02]I have waited [nl]
//two years for [nl]
//this moment!![speed v=03][scrl]
[person id=0A]
[speed v=02]Я никогда не забуду ту[nl]
ночь.[speed v=03][clr]
Я по-прежнему не знаю,[nl]
кто отдал приказ о нашей[scrl]
смерти.[clr]
Ни в одних засекреченных[nl]
документах не указано[nl]
его настоящее имя.[clr]
Мы знаем его только по[nl]
подписи «Аноним»‎.[clr]
[person id=00]
«Аноним»‎?[clr]
[person id=0A]
Те из нас,[pause t=06] кто выжил,[nl]
возжелали мести.[clr]
И я подготовил сцену для[nl]
будущего действия.[clr]
Аутер-Хевен,[pause t=06] Metal Gear,[nl]
проект «Вавилон»‎...[clr]
Всё начнётся здесь...[clr]
[speed v=02]Я два года ждал этого[nl]
момента!!![speed v=03][scrl]

[message #05]
//[person id=0A]
//Now for the[nl]
//happy reunion;[clr]
//I'm sure it was[nl]
//worth the wait.[scrl]
[person id=0A]
А теперь счастливое[nl]
воссоединение.[clr]
Уверен,[pause t=06] ожидание того[nl]
стоило.[scrl]

[message #06]
//[person id=00]
//[speed v=01]Chris![speed v=03][scrl]
[person id=00]
[speed v=01]Крис![speed v=03][scrl]

[message #07]
//[person id=05]
//[speed v=04]Snake…… [pause t=08][nl]
//[speed v=05]I'm sorry……[speed v=03][scrl]
[person id=05]
[speed v=04]Снейк...[pause t=08][nl]
[speed v=05]Прости меня...[speed v=03][scrl]

[message #08]
//[person id=0A]
//She's really[nl]
//something.[clr]
//Even let her [nl]
//Delta Force [nl]
//pals die while [scrl]
//she got busy [nl]
//destroying[nl]
//evidence of[scrl]
//Project Babel.[scrl]
[person id=0A]
Она та ещё штучка.[clr]
Позволила умереть своим[nl]
друзьям из отряда[nl]
«Дельта»‎,[pause t=06] пока сама[scrl]
занималась уничтожением[nl]
всех следов проекта[nl]
«Вавилон»‎.[scrl]

[message #09]
//[person id=0A]
//As a reward from[nl]
//Parker,[pause t=06]I will[nl]
//let her see the[scrl]
//show-[scrl]
[person id=0A]
Вместо награждения от[nl]
Паркера,[pause t=06] я позволю ей[nl]
насладиться[scrl]
представлением...[scrl]

[message #10]
//[person id=0A]
//[speed v=04]- of the end of[nl]
//the `Legend',[clr]
//the execution of[nl]
//Solid Snake![speed v=03][scrl]
[person id=0A]
[speed v=04]Смертью «Легенды»‎,[nl]
казнью Солида[nl]
Снейка![speed v=03][scrl]

[message #11]
//[person id=00]
//No,[pause t=06]Chris is[nl]
//coming with me-[clr]
//after I take[nl]
//you down.[scrl]
[person id=00]
Нет,[pause t=06] Крис пойдёт со[nl]
мной,[pause t=06] после того как я[nl]
убью тебя.[scrl]

[message #12]
//[person id=0A]
//I'm going to[nl]
//enjoy this![clr]
//[speed v=01]C'mon,[pause t=06]show me[nl]
//what you've got![speed v=03][scrl]
[person id=0A]
Вот уж что меня[nl]
повеселит![clr]
[speed v=01]Давай же,[pause t=06] покажи,[pause t=06] как ты[nl]
это сделаешь![speed v=03][scrl]

[message #13]
//[person id=0A]
//[speed v=01]Let's finish[nl]
//this![speed v=03][scrl]
[person id=0A]
[speed v=01]Покончим со всем раз и[nl]
навсегда![speed v=03][scrl]

[message #14]
//[person id=0A]
//[speed v=02]N-no way[nl]
//could……![clr]
//[speed v=01]But it isn't[nl]
//over yet![speed v=03][scrl]
[person id=0A]
[speed v=02]Да как же ты сумел!..[clr]
[speed v=01]Но это ещё не[nl]
конец![speed v=03][scrl]

[message #15]
//[person id=00]
//[speed v=01]Damn![speed v=03][scrl]
[person id=00]
[speed v=01]Чёрт![speed v=03][scrl]

[block #03]
[message #00]
//[person id=00]
//[speed v=02]Chris,[pause t=04]are you[nl]
//hurt anywhere?[speed v=03][clr]
//[person id=05]
//No.[pause t=08][speed v=05][nl]
//I'm……so sorry……[speed v=03][clr]
//[person id=00]
//Don't be.[clr]
//[person id=05]
//I have to be.[fade val=96][sound id=07][pause t=DA][pause t=DA][nl]
//[speed v=05]I've been lying[nl]
//to you……[speed v=03][clr]
//[person id=00]
//You mean because[nl]
//you weren't[nl]
//there when your[scrl]
//team was wiped[nl]
//out?[clr]
//[person id=05]
//You knew?[clr]
//[person id=00]
//Yes.[clr]
//[person id=05]
//[speed v=04]……I was given[nl]
//orders directly[nl]
//by Parker,[clr]
//the Army Chief [nl]
//of Staff.[speed v=03][clr]
//[person id=00]
//What kind of[nl]
//mission?[clr]
//[person id=05]
//[speed v=04]The destruction[nl]
//of all data on[nl]
//the Project[scrl]
//Babel and Outer[nl]
//Heaven and the……[nl]
//[pause t=0A]assassination[scrl]
//of the General.[speed v=03][clr]
//[person id=00]
//[speed v=02]What?[speed v=03][clr]
//[person id=05]
//I was told that[nl]
//the information[nl]
//had to be buried[scrl]
//for the good of[nl]
//the world.[clr]
//And that the [nl]
//General would [nl]
//have to be as [scrl]
//well before he [nl]
//was arrested[nl]
//and talked……[clr]
//[person id=00]
//[speed v=04]You believed[nl]
//that?[speed v=03][scrl]
[person id=00]
[speed v=02]Крис,[pause t=06] ты не ранена?[speed v=03][clr]
[person id=05]
Я цела...[pause t=08][speed v=05][nl]
Прости меня...[speed v=03][clr]
[person id=00]
Тебе незачем просить[nl]
прощения.[clr]
[person id=05]
Но я обязана.[fade val=96][sound id=07][pause t=DA][pause t=DA][nl]
[speed v=05]Я лгала тебе...[speed v=03][clr]
[person id=00]
Ты о том,[pause t=06] что тебя не[nl]
было с отрядом,[pause t=06] когда[nl]
его уничтожили?[clr]
[person id=05]
Ты знал?[clr]
[person id=00]
Да.[clr]
[person id=05]
[speed v=04]...Я исполняла приказы[nl]
Паркера,[pause t=06] начальника[nl]
штаба сухопутных войск.[speed v=03][clr]
[person id=00]
Что за миссию тебе[nl]
поручил Паркер?[clr]
[person id=05]
[speed v=04]Уничтожить все данные о[nl]
проекте «Вавилон»‎ и[nl]
сведения про[scrl]
Аутер-Хевен. И...[clr]
[pause t=0A]Устранить Генерала.[speed v=03][clr]
[person id=00]
[speed v=02]Что?[speed v=03][clr]
[person id=05]
Мне сказали,[pause t=06] что[nl]
существование этой[nl]
информации несёт угрозу[scrl]
всему миру.[clr]
И что Генерала[nl]
необходимо убить до[nl]
того,[pause t=06] как его арестуют и[scrl]
допросят...[clr]
[person id=00]
[speed v=04]И ты поверила в[nl]
это?[speed v=03][scrl]

[message #01]
//[person id=05]
//For my country,[pause t=08][nl]
//for the world……[clr]
//what else do I[nl]
//have to believe[nl]
//in?[clr]
//[person id=00]
//Chris……[clr]
//[person id=05]
//[speed v=04]And so I……[pause t=08] fell[nl]
//away from the[nl]
//rest of the team[speed v=03][scrl]
[person id=05]
Ради своей страны,[pause t=06] ради[nl]
мира...[clr]
А во что мне ещё верить?[clr]
[person id=00]
Крис...[clr]
[person id=05]
[speed v=04]Так я... Откололась от[nl]
своего отряда...[speed v=03][scrl]

[message #02]
//[person id=05]
//[speed v=05]……and they……[clr]
//[speed v=04]I thought [nl]
//I could find[nl]
//something to[scrl]
//cherish……[pause t=06][nl]
//something sure[nl]
//and concrete……[clr]
//But there wasn't[nl]
//anything like[nl]
//that……[clr]
//and instead [nl]
//I lost something[nl]
//that I cherished[scrl]
//even more……[clr]
//I was so afraid[nl]
//of losing it[nl]
//again……[clr]
//[speed v=05]that I……[pause t=06]just [nl]
//couldn't tell [nl]
//you……[speed v=03][scrl]
[person id=05]
[speed v=05]И их...[clr]
[speed v=04]Я думала,[pause t=06] я смогу найти[nl]
что-то ценное...[clr]
Что-то ясное,[pause t=06] в чём я[nl]
буду уверена...[clr]
Но всё оказалось не[nl]
таким...[clr]
Вместо этого я потеряла[nl]
тех,[pause t=06] кем дорожила...[clr]
Я так боялась потерять[nl]
снова...[clr]
[speed v=05]Что мне... Не хватало[nl]
сил сказать тебе.[speed v=03][scrl]

[message #03]
//[person id=05]
//[speed v=04]……Snake……[speed v=03][scrl]
[person id=05]
[speed v=04]Снейк...[speed v=03][scrl]

[message #04]
//[person id=00]
//Chris,[pause t=06]don't[nl]
//just stand [nl]
//there.[clr]
//Find us[nl]
//something fast[nl]
//to escape on.[scrl]
[person id=00]
Крис,[pause t=06] не стой столбом.[clr]
Найди нам какой-нибудь[nl]
транспорт для побега.[scrl]

[message #05]
//[person id=05]
//?[scrl]
[person id=05]
?[scrl]

[message #06]
//[person id=00]
//So that we can[nl]
//get out of here[nl]
//quickly once[scrl]
//I've destroyed[nl]
//Metal Gear.[scrl]
[person id=00]
Чтобы мы могли выбраться[nl]
отсюда,[pause t=06] как только я[nl]
уничтожу Metal Gear.[scrl]

[message #07]
//[person id=05]
//[speed v=04]…… You still[nl]
//trust me?[speed v=03][scrl]
[person id=05]
[speed v=04]...Ты по-прежнему[nl]
доверяешь мне?[speed v=03][scrl]

[message #08]
//[person id=00]
//…… It's true[nl]
//that you didn't[nl]
//tell me the[scrl]
//truth.[clr]
//But I trust you.[scrl]
[person id=00]
...Ты не сказала мне[nl]
правду.[clr]
Но я доверяю тебе.[scrl]

[message #09]
//[person id=05]
//Why?[scrl]
[person id=05]
Почему?[scrl]

[message #10]
//[person id=00]
//Because [nl]
//I want to.[scrl]
[person id=00]
Потому что хочу[nl]
доверять.[scrl]

[message #11]
//[person id=05]
//…………[scrl]
[person id=05]
...[scrl]

[message #12]
//[person id=00]
//Do I need any[nl]
//other reason?[scrl]
[person id=00]
По-твоему,[pause t=06] нужны ещё[nl]
причины?[scrl]

[message #13]
//[person id=05]
//……Thank you……[scrl]
[person id=05]
Спасибо...[scrl]

[message #14]
//[person id=05]
//I'll find[nl]
//something.[pause t=08][nl]
//I promise.[scrl]
[person id=05]
Я что-нибудь найду.[pause t=08][nl]
Обещаю.[scrl]

[message #15]
//[person id=01]
//Snake,[pause t=06]Metal[nl]
//Gear is through[nl]
//there. [pause t=0A]Hurry![scrl]
[person id=01]
Снейк,[pause t=06] Metal Gear[nl]
впереди. [pause t=0A]Торопись![scrl]

[message #16]
//[person id=0C]
//I see that the[nl]
//little vendetta[nl]
//has been played[scrl]
//out to its[nl]
//conclusion.[scrl]
[person id=0C]
Вижу,[pause t=06] жалкая вендетта[nl]
закончилась,[pause t=06] как и[nl]
должна была.[scrl]

[message #17]
//[person id=00]
//[speed v=02]General![speed v=03][scrl]
[person id=00]
[speed v=02]Генерал![speed v=03][scrl]

[message #18]
//[person id=0C]
//Once a loser,[pause t=06][nl]
//always a loser,[pause t=06][nl]
//eh Snake? [clr]
//The last one[nl]
//standing is [nl]
//the winner.[scrl]
[person id=0C]
Неудачник всегда им[nl]
останется,[pause t=06] да,[pause t=06] Снейк?[clr]
Побеждает лишь твёрдо[nl]
стоящий на ногах.[scrl]

[message #19]
//[person id=0C]
//And that would [nl]
//be myself- [clr]
//not you,[pause t=06]not[nl]
//Black Chamber[nl]
//and certainly[scrl]
//not America.[clr]
//I used them[nl]
//all,[pause t=06]you see- [pause t=0A][nl]
//Parker,[scrl]
//Black Chamber……[clr]
//[person id=00]
//What?[clr]
//[person id=0C]
//Weren't you sent[nl]
//to cover up[nl]
//Outer Heaven and[scrl]
//Project Babel- [pause t=0A][nl]
//or rather the[nl]
//truth about[scrl]
//GLF and the[nl]
//U.S.?[clr]
//Just like[nl]
//that woman?[clr]
//[person id=00]
//[speed v=02]GLF and the[nl]
//U.S.?[pause t=0A][nl]
//What truth?[speed v=03][clr]
//[person id=0C]
//Ha,ha,ha.[pause t=0A] So[nl]
//you're nothing[nl]
//but a pawn too……[clr]
//just like Viper[nl]
//and his lot.[clr]
//[person id=00]
//[speed v=02]There's a[nl]
//connection[nl]
//between GLF[scrl]
//and the States,[pause t=06][nl]
//and Outer[nl]
//Heaven?[speed v=03][clr]
//[person id=0C]
//Fine.[pause t=06] I will[nl]
//tell you all[nl]
//about -[clr]
//if you win.[clr]
//Winner takes[nl]
//it all,[pause t=06]loser[nl]
//relinquishes[scrl]
//all.[clr]
//That is the way[nl]
//of the world.[scrl]
[person id=0C]
И это буду я.[clr]
Не ты,[pause t=06] не «Тёмная[nl]
палата»‎ и уж точно не[nl]
Америка.[clr]
Видишь ли,[pause t=06] я всех их[nl]
использовал,[pause t=06] - Паркера,[nl]
«Тёмную палату»‎...[clr]
[person id=00]
Что?[clr]
[person id=0C]
Разве тебя,[pause t=06] как и ту[nl]
женщину,[pause t=06] прислали не для[nl]
того,[pause t=06] чтобы скрыть[scrl]
правду об Аутер-Хевен и[nl]
о проекте «Вавилон»‎?[clr]
А вернее,[pause t=06] правду о GLF и[nl]
Соединённых Штатах?[clr]
[person id=00]
[speed v=02]О GLF и Соединённых[nl]
Штатах?[clr]
Какую правду?[speed v=03][clr]
[person id=0C]
Ха-ха-ха.[clr]
Выходит,[pause t=06] ты тоже всего[nl]
лишь пешка...[clr]
Совсем как Вайпер и его[nl]
друзья.[clr]
[person id=00]
[speed v=02]Существует связь между[nl]
GLF,[pause t=06] Штатами и[nl]
Аутер-Хевен?[speed v=03][clr]
[person id=0C]
Так и быть. Я всё тебе[nl]
расскажу.[clr]
Если ты победишь.[clr]
Победителю достаётся[nl]
всё,[pause t=06] проигравший всё[nl]
теряет.[clr]
Так устроен мир.[scrl]

[message #20]
//[person id=0C]
//And you will[nl]
//abide by it,[pause t=06][nl]
//Snake![scrl]
[person id=0C]
И ты не исключение,[nl]
Снейк![scrl]

[message #21]
//[person id=01]
//Snake,[pause t=06]Metal[nl]
//Gear must be[nl]
//destroyed![clr]
//Take out its[nl]
//legs first of[nl]
//all![clr]
//Hit it hard[nl]
//with mines [nl]
//and C4![scrl]
[person id=01]
Снейк,[pause t=06] Metal Gear[nl]
необходимо уничтожить![clr]
Выведи из строя его[nl]
ноги,[pause t=06] прежде всего![clr]
Взорви их минами или[nl]
С4![scrl]

[block #04]
[message #00]
//[person id=0C]
//[speed v=04]Solid Snake -[clr]
//the name[nl]
//`Legend' may[nl]
//have been[scrl]
//propaganda,[pause t=06]but[nl]
//it seems no[nl]
//exaggeration……[speed v=03][scrl]
[person id=0C]
[speed v=04]Солид Снейк.[clr]
Пусть имя «Легенда»‎ -[nl]
- часть пропаганды,[pause t=06] но,[nl]
похоже,[pause t=06] способности твои[scrl]
не преувеличивают...[speed v=03][scrl]

[message #01]
//[person id=00]
//I want the[nl]
//truth.[pause t=03] All of[nl]
//it.[scrl]
[person id=00]
Мне нужна правда.[clr]
Вся до последнего.[scrl]

[message #02]
//[person id=0C]
//…… A winner's[nl]
//privilege.[clr]
//After all,[pause t=06]you [nl]
//have the right [nl]
//to know - [clr]
//about Outer [nl]
//Heaven,[pause t=08][nl]
//Metal Gear,[clr]
//Project Babel,[pause t=08][nl]
//and the link[nl]
//between GLF[scrl]
//and the U.S……[fade val=8F][sound id=08][pause t=FA][clr]
//Outer Heaven[nl]
//was a U.S-backed[nl]
//venture that[scrl]
//provided[nl]
//mercenaries to[nl]
//its `clients'.[clr]
//It was a way to[nl]
//unofficially[nl]
//check anti-[scrl]
//American forces,[clr]
//and the idea[nl]
//apparently[nl]
//originated with[scrl]
//the DDCI of the[nl]
//time.[clr]
//[person id=00]
//[speed v=02]What?[speed v=03][clr]
//[person id=0C]
//But the field[nl]
//commander,[pause t=06][nl]
//Big Boss,[pause t=06]was a[scrl]
//loose cannon[nl]
//that broke out[nl]
//of the program,[clr]
//and Outer Heaven[nl]
//was brought[nl]
//down by you.[clr]
//As a part of a [nl]
//plausible[nl]
//denial of their[scrl]
//involvement in[nl]
//Outer Heaven,[clr]
//the government[nl]
//constructed a[nl]
//hero myth,[clr]
//handed you[nl]
//and Fox-Hound[nl]
//to the[scrl]
//international[nl]
//media.[clr]
//That is the [nl]
//truth behind[nl]
//your rise to[scrl]
//the status of[nl]
//`Legend'.[clr]
//[person id=00]
//…………[clr]
//[person id=0C]
//Ha,ha,ha.[pause t=0A][nl]
//Shocking,[pause t=06]isn't[nl]
//it?[clr]
//To learn that [nl]
//your glory[nl]
//was a staged[scrl]
//one?[scrl]
[person id=0C]
...Право победителя.[clr]
В конце концов,[pause t=06] ты[nl]
должен знать о связи[nl]
между GLF и Штатами...[fade val=8F][sound id=08][pause t=FA][clr]
Аутер-Хевен образовалась[nl]
в результате[nl]
финансирования со[scrl]
стороны самих[nl]
Соединённых Штатов,[pause t=06] дабы[nl]
обеспечивать наёмниками[scrl]
своих «клиентов»‎.[clr]
Таким способом шла[nl]
неофициальная проверка[nl]
антиамериканских сил.[clr]
Сама идея пришла от[nl]
тогдашнего замдиректора[nl]
ЦРУ.[clr]
[person id=00]
[speed v=02]Что?[speed v=03][clr]
[person id=0C]
Но действующий командир,[nl]
Большой Босс,[pause t=06] словно с[nl]
цепи сорвался,[pause t=06] нарушил[scrl]
программу,[pause t=06] и Аутер-Хевен[nl]
уничтожили с твоей[nl]
помощью.[clr]
Чтобы скрыть свою[nl]
причастность к[nl]
Аутер-Хевен,[pause t=06] власти[scrl]
предприняли ряд[nl]
действий,[pause t=06] в том числе[nl]
сочинили «миф о герое»‎,[scrl]
а тебя и «Фоксхаунд»‎[nl]
отдали международным[nl]
средствам массовой[scrl]
информации.[clr]
Именно так ты[nl]
превратился в[nl]
«Легенду»‎.[clr]
[person id=00]
...[clr]
[person id=0C]
Ха-ха-ха.[pause t=0A] Ужасно,[pause t=06] не[nl]
правда ли?[clr]
Узнать,[pause t=06] что твоя слава[nl]
заранее подстроена?[scrl]

[message #03]
//[person id=00]
//…… And the[nl]
//connection[nl]
//between GLF[scrl]
//and the U.S.?[clr]
//[person id=0C]
//Even after[nl]
//Outer Heaven[nl]
//collapsed,[clr]
//the relationship[nl]
//went on,[pause t=06]right[nl]
//into Project[scrl]
//Babel.[clr]
//The U.S.provided[nl]
//covert support [nl]
//for GLF;[clr]
//I was their [nl]
//field[nl]
//controller.[clr]
//The objective[nl]
//was diminishment[nl]
//of anti-[clr]
//American forces[nl]
//in the African[nl]
//continent.[clr]
//Provoke an[nl]
//ethnic minority[nl]
//in Gindra into[scrl]
//a calculated[nl]
//conflict,[pause t=06]then[nl]
//involve other[scrl]
//neighboring[nl]
//nations.[clr]
//Create a climate[nl]
//of hostility to[nl]
//discourage[scrl]
//organized[nl]
//alliance,[clr]
//then send in a[nl]
//contingent of[nl]
//U.S-dominated[scrl]
//peacekeeping[nl]
//troops for an[nl]
//indefinite stay,[clr]
//where they can[nl]
//exercise control[nl]
//over the entire[scrl]
//region.[clr]
//It was a bid to [nl]
//build a new [nl]
//world order in [scrl]
//the confusion of[nl]
//the post-Cold [nl]
//War era…… [clr]
//a means to [nl]
//establish the[nl]
//U.S. as the sole[scrl]
//superpower,[pause t=06]a[nl]
//single hegemony[nl]
//over an[scrl]
//artificial[nl]
//Babel,[pause t=06][nl]
//manageable[scrl]
//chaos……[clr]
//This was Project[nl]
//Babel,[clr]
//the brainchild [nl]
//of Parker,[pause t=06]Army[nl]
//Chief of Staff.[clr]
//The return for[nl]
//my services was[nl]
//a lavish reward[scrl]
//and guarantee of[nl]
//safety……[fade val=0F][pause t=E8][sound id=0E][scrl]
[person id=00]
...Что насчёт связи[nl]
между США и GLF?[clr]
[person id=0C]
Даже после падения[nl]
Аутер-Хевен,[pause t=06] сохранились[nl]
отношения,[pause t=06] выросшие[scrl]
позднее в проект[nl]
«Вавилон»‎.[clr]
США тайно поддерживала[nl]
GLF.[clr]
Я был их ставленником.[clr]
Основной задачей стало[nl]
подавление[nl]
антиамериканских сил на[scrl]
африканском континенте.[clr]
Провокация национальных[nl]
меньшинств Гиндры с[nl]
целью образования[scrl]
контролируемого[nl]
конфликта,[pause t=06] с последующим[nl]
участием в этом[scrl]
конфликте соседних[nl]
наций.[clr]
Создавалась атмосфера[nl]
взаимной враждебности[scrl]
для деморализации[nl]
сложившихся альянсов,[nl]
затем высылались[scrl]
миротворческие отряды,[nl]
по большей части[nl]
состоящие из[scrl]
американцев,[pause t=06] остающиеся[nl]
в местах,[pause t=06] откуда они[nl]
распространяли своё[scrl]
влияние на весь регион.[clr]
Так строился новый[nl]
мировой порядок в эпоху[nl]
неразберихи, наступившую[scrl]
после Холодной Войны...[clr]
Гегемония США над[nl]
искусственным[nl]
«Вавилоном»‎,[scrl]
контролируемый хаос...[clr]
Это и был «Вавилон»‎ -[nl]
- проект Паркера.[clr]
В ответ за свою службу я[nl]
получал щедрое[nl]
вознаграждение и[scrl]
гарантию[nl]
безопасности...[fade val=0F][pause t=E8][sound id=0E][scrl]

[message #04]
//[person id=0C]
//Take this.[clr]
//This disk [nl]
//contains all the[nl]
//information that[scrl]
//Parker ordered[nl]
//that woman[nl]
//soldier,[pause t=06]Chris,[scrl]
//to destroy.[clr]
//It's all here,[pause t=06][nl]
//proof of what I [nl]
//have just told [scrl]
//you,[pause t=06] including[nl]
//details of[nl]
//all bank[scrl]
//transactions.[clr]
//There is enough[nl]
//dirt here to[nl]
//bring down some[scrl]
//of the highest[nl]
//people in the[nl]
//Government.[clr]
//This is like[nl]
//a bomb,[pause t=06]ready[nl]
//to explode.[scrl]
[person id=0C]
Возьми.[clr]
Этот диск содержит всю[nl]
информацию,[pause t=06] которую[nl]
приказали уничтожить[scrl]
той женщине,[pause t=06] Крис.[clr]
Всё здесь,[nl]
доказательства моих[nl]
слов,[pause t=06] включая данные обо[scrl]
всех банковских[nl]
операциях.[clr]
Здесь достаточно грязи,[nl]
чтобы закопать[nl]
нескольких[scrl]
высокопоставленных[nl]
людей из правительства.[scrl]

[message #05]
//[person id=0C]
//This too is[nl]
//the winner's[nl]
//privilege.[clr]
//Do with it what[nl]
//you like.[clr]
//[person id=00]
//You deceived[nl]
//your people all[nl]
//this time?[clr]
//Your followers[nl]
//believe in you.[clr]
//So does Sophie……[scrl]
[person id=0C]
Ещё одно право[nl]
победителя.[clr]
Делай с ним,[pause t=06] что сочтёшь[nl]
нужным.[clr]
[person id=00]
Всё это время ты[nl]
обманывал свой народ?[clr]
И Софи в тебя верила...[scrl]

[block #05]
[message #00]
//[person id=0C]
//[speed v=04]Yes……[pause t=06] Sophie……[speed v=03][clr]
//I left her……[pause t=0C][nl]
//cruelly too.[clr]
//But still she[nl]
//stayed with me [nl]
//as my lieutenant[scrl]
//……[clr]
//[speed v=04]But I never saw[nl]
//her smile after[nl]
//that……[speed v=03][clr]
//[person id=00]
//…………[clr]
//[person id=0C]
//I didn't deceive[nl]
//them. [pause t=06]I had no[nl]
//intention of[scrl]
//being Parker's[nl]
//henchman in the[nl]
//first place.[clr]
//It was the aid [nl]
//I needed,[pause t=06]and [nl]
//with it,[pause t=06]I was [scrl]
//going to break [nl]
//the bargain and[nl]
//build our[scrl]
//country.[clr]
//The end [nl]
//justifies[nl]
//the means,[clr]
//especially when[nl]
//others have[nl]
//faith in the[scrl]
//fiction.[clr]
//I only gave them[nl]
//the truth in the[nl]
//guise they[scrl]
//wanted.[clr]
//[person id=00]
//Can a nation[nl]
//built by those[nl]
//means have any[scrl]
//value?[scrl]
[person id=0C]
[speed v=04]Да...[pause t=06] Софи...[speed v=03][clr]
Я оставил её... Тоже[nl]
бессердечно.[clr]
Но она всё равно[nl]
осталась со мной,[nl]
осталась моим[scrl]
лейтенантом...[clr]
[speed v=04]Но с тех пор я ни разу[nl]
не видел улыбки на её[nl]
лице...[speed v=03][clr]
[person id=00]
...[clr]
[person id=0C]
Я не обманывал их.[clr]
Я никогда не хотел[nl]
становиться прихвостнем[nl]
Паркера.[clr]
Я собирался нарушить[nl]
договор,[pause t=06] но мне нужна[nl]
была помощь,[pause t=06] чтобы позже[scrl]
поднять нашу страну.[clr]
Цель оправдывает[nl]
средства,[pause t=06] особенно,[nl]
когда остальные верят в[scrl]
иллюзию.[clr]
Я всего лишь подарил им[nl]
правду в том виде,[pause t=06] в[nl]
каком они хотели её[scrl]
увидеть.[clr]
[person id=00]
Чем гордиться нации,[nl]
построенной таким[nl]
способом?[scrl]

[message #01]
//[person id=0C]
//Ha. [pause t=06]Doesn't the[nl]
//world operate on[nl]
//what you call[scrl]
//`those means'?[clr]
//Everyone just[nl]
//pretends[nl]
//otherwise.[clr]
//Justice and[nl]
//ideals are[nl]
//nothing but[scrl]
//words,[pause t=06]after[nl]
//all……[clr]
//[person id=00]
//…………[scrl]
[person id=0C]
Ха. А разве весь мир не[nl]
строится,[pause t=06] как ты[nl]
выразился,[pause t=06] «таким[scrl]
способом»‎?[clr]
Все притворяются кем-то[nl]
другим.[clr]
В конце концов,[nl]
«справедливость»‎ и[nl]
«высшие цели»‎ - просто[scrl]
слова...[clr]
[person id=00]
...[scrl]

[message #02]
//[person id=0C]
//Well,[pause t=06]well……[pause t=0A]So[nl]
//this is the way[nl]
//dreams end……[clr]
//[speed v=04]well,[pause t=08]it is not[nl]
//[speed v=05]the worst thing[nl]
//……[clr]
//[speed v=08]…………[speed v=03][scrl]
[person id=0C]
Ну,[pause t=06] ну... Значит,[pause t=06] вот[nl]
как рушатся мечты.[clr]
[speed v=04]Что ж,[pause t=06] могло быть и[nl]
хуже...[clr]
[speed v=08]...[speed v=03][scrl]

[message #03]
//[person id=00]
//[speed v=01]Viper![speed v=03][scrl]
[person id=00]
[speed v=01]Вайпер![speed v=03][scrl]

[message #04]
//[person id=0A]
//I told you -[pause t=0A][nl]
//it's not over[nl]
//yet.[scrl]
[person id=0A]
Я же сказал,[pause t=06] это ещё не[nl]
конец.[scrl]

[message #05]
//[person id=00]
//[speed v=01]Viper! [pause t=06][speed v=03]Still……[clr]
//[person id=0A]
//Thanks for[nl]
//saving me[nl]
//the trouble of[scrl]
//removing the[nl]
//General.[clr]
//He controlled[nl]
//Metal Gear[nl]
//to the end.[clr]
//And I had[nl]
//the pleasure[nl]
//of listening[scrl]
//to your[nl]
//conversation.[clr]
//And so finally,[pause t=06][nl]
//I know the[nl]
//identity of[scrl]
//`Anonymous'.[scrl]
[person id=00]
[speed v=01]Вайпер! Всё ещё...[clr]
[person id=0A]
Спасибо,[pause t=06] что убрал[nl]
Генерала за меня.[clr]
До последнего момента[nl]
Metal Gear находился под[scrl]
его контролем.[clr]
И мне очень понравилась[nl]
ваша беседа.[clr]
А ещё теперь я знаю,[pause t=06] кто[nl]
был тем «Анонимом»‎.[scrl]

[message #06]
//[person id=0A]
//It was worth[nl]
//the trouble of[nl]
//leading you all[scrl]
//the way out[nl]
//here.[clr]
//[person id=00]
//[speed v=02]You?[speed v=03][clr]
//[person id=0A]
//This was all[nl]
//a ploy to bring[nl]
//`Anonymous' out[scrl]
//into the open.[clr]
//Seizure of Metal[nl]
//Gear,[clr]
//leading you and [nl]
//Campbell out [nl]
//here to Outer [scrl]
//Heaven -[clr]
//all part of the[nl]
//plan.[clr]
//[person id=00]
//[speed v=02]What does the[nl]
//colonel have to[nl]
//do with this?[speed v=03][clr]
//[person id=0A]
//You don't know[nl]
//what he did?[clr]
//Your dear friend[nl]
//Roy Campbell was[nl]
//in command of[scrl]
//Fox-Hound that[nl]
//night two years[nl]
//ago.[clr]
//[person id=00]
//[speed v=02]The Colonel![speed v=03][clr]
//[person id=0A]
//I figured that[nl]
//when Metal[nl]
//Gear's history[scrl]
//repeated itself[nl]
//and you and[nl]
//Campbell were[scrl]
//pulled into[nl]
//the fray,[pause t=06][nl]
//`Anonymous'[scrl]
//would have to[nl]
//get involved.[clr]
//Two years I have[nl]
//waited for this[nl]
//moment.[clr]
//Two long years![clr]
//[person id=00]
//[speed v=01]Damn it![speed v=02][pause t=06] The[nl]
//decision to call[nl]
//Campbell in and[scrl]
//to send me was[nl]
//made at the[nl]
//highest level.[clr]
//How……[speed v=03][clr]
//[person id=0A]
//Could I have[nl]
//been involved[nl]
//in that process?[clr]
//This is how……[scrl]
[person id=0A]
Определённо,[pause t=06] ради этого[nl]
стоило собрать здесь[nl]
всех вас.[clr]
[person id=00]
[speed v=02]Ты?[speed v=03][clr]
[person id=0A]
Всё это было одной[nl]
большой ловушкой,[pause t=06] с[nl]
целью вывести «Анонима»‎[scrl]
на чистую воду.[clr]
Захватить Metal Gear,[nl]
привести тебя и[nl]
Кэмпбелла сюда,[pause t=06] в[scrl]
Аутер-Хевен,[pause t=06] - всё[nl]
прошло по плану.[clr]
[person id=00]
[speed v=02]При чём здесь[nl]
полковник?[speed v=03][clr]
[person id=0A]
Ты не знаешь,[pause t=06] что он[nl]
сделал?[clr]
Твой дражайший друг Рой[nl]
Кэмпбелл руководил[nl]
«Фоксхаунд»‎ той роковой[scrl]
ночью два года назад.[clr]
[person id=00]
[speed v=02]Полковник![speed v=03][clr]
[person id=0A]
Я понял,[pause t=06] что,[pause t=06] когда[nl]
история Metal Gear[nl]
повторится,[pause t=06] в бой[scrl]
отправят тебя и[nl]
Кэмпбелла.[clr]
Не обойдётся и без[nl]
вмешательства[nl]
«Анонима»‎.[clr]
Два года я ждал этого[nl]
момента.[clr]
Два долгих года![clr]
[person id=00]
[speed v=01]Чёрт![speed v=02][pause t=06][nl]
Решение вызвать[nl]
Кэмпбелла и отправить[scrl]
меня приняли на самом[nl]
высоком уровне.[clr]
Как...[speed v=03][clr]
[person id=0A]
Как я мог повлиять на[nl]
процесс?[clr]
А вот так...[scrl]

[message #07]
//[script val=06][script val=81][person id=01]
//[speed v=02]Snake![pause t=06] We have[nl]
//a problem.[clr]
//The fifth Black[nl]
//Chamber[clr]
//[script val=54][speed v=01]…… wha……,[pause t=06]hey……[speed v=03][clr]
//[person id=13]
//[pause t=82][sound id=84][pause t=82]…………[clr]
//[person id=00]
//[speed v=01]Colonel,[pause t=04]what's[nl]
//going on![speed v=03][clr]
//[person id=14]
//[voice id=04][sound id=0E]The fifth Black[nl]
//Chamber was[nl]
//right here.[clr]
//[person id=00]
//[speed v=01]Who is this![speed v=03][clr]
//[script val=4B][person id=00]
//[speed v=01]McBride!![speed v=03][sound id=0B][pause t=A0][clr]
//[person id=04]
//Surprised,[pause t=06][nl]
//Snake……?[clr]
//After I survived[nl]
//two years ago,[pause t=06]I[nl]
//parted from the[scrl]
//others and[nl]
//slipped into[nl]
//your side.[clr]
//I changed[nl]
//everything -[clr]
//my face,[pause t=06]name,[pause t=06][nl]
//past -[clr]
//to gather[nl]
//information[nl]
//for our cause.[clr]
//Everything [nl]
//I did was for[nl]
//this moment……[clr]
//[speed v=01]Do it,[pause t=06]Viper![pause t=06][nl]
//[speed v=02]This is it![scrl]
[script val=06][script val=81][person id=01]
[speed v=02]Снейк! У нас проблема.[clr]
Пятый член «Тёмной[nl]
палаты»‎...[clr]
[script val=54][speed v=01]...Что за... [pause t=06]Эй...[speed v=03][clr]
[person id=13]
[pause t=82][sound id=84][pause t=82]...[clr]
[person id=00]
[speed v=01]Полковник,[pause t=06] что[nl]
происходит?![speed v=03][clr]
[person id=14]
[voice id=04][sound id=0E]А пятый[nl]
член «Тёмной палаты»‎ был[nl]
всё время здесь.[clr]
[person id=00]
[speed v=01]Кто это![speed v=03][clr]
[script val=4B][person id=00]
[speed v=01]МакБрид!!![speed v=03][sound id=0B][pause t=A0][clr]
[person id=04]
Удивлён,[pause t=06] Снейк?..[clr]
Когда я выжил два года[nl]
назад,[pause t=06] я покинул[nl]
остальных и проник на[scrl]
вашу сторону.[clr]
Я изменил всё,[pause t=06] -[nl]
внешность,[pause t=06] имя,[pause t=06] прошлое,[nl]
- чтобы собирать[scrl]
информацию ради нашего[nl]
дела.[clr]
Всё,[pause t=06] что я сделал,[pause t=06] я[nl]
сделал ради этого[nl]
момента...[clr]
[speed v=01]Давай же,[pause t=06] Вайпер![pause t=06][nl]
[speed v=02]Настало время![scrl]

[block #06]
[message #00]
//[person id=0A]
//You may forget[nl]
//or refuse to[nl]
//acknowledge it,[clr]
//but our hell[nl]
//goes on.[clr]
//And it will go [nl]
//on until we [nl]
//destroy all[scrl]
//of you,[pause t=06]not just[nl]
//`Anonymous'![scrl]
[person id=0A]
Ты можешь не обращать[nl]
внимания или отказаться[nl]
признавать это,[pause t=06] но наша[scrl]
жизнь стала адом.[clr]
И ад не прекратится,[nl]
пока мы не уничтожим[nl]
всех вас.[clr]
Всех,[pause t=06] а не только[nl]
«Анонима»‎![scrl]

[message #01]
//[person id=00]
//[speed v=02]What did you[nl]
//just do?[speed v=03][clr]
//[person id=0A]
//The bolts of[nl]
//vengeance -[clr]
//preparing for[nl]
//nuclear strike.[fade val=88][sound id=06][pause t=C0][clr]
//[person id=00]
//[speed v=01]How can that[nl]
//be?[pause t=06][speed v=03] Metal Gear[nl]
//was destroyed![clr]
//[person id=0A]
//You are a fool.[pause t=06][nl]
//Did you think[nl]
//Metal Gear was[scrl]
//just an armored[nl]
//transport for a[nl]
//nuclear payload?[clr]
//[person id=00]
//[speed v=02]What?[speed v=03][clr]
//[person id=0A]
//The nature of[nl]
//this beast is[nl]
//an integrated[scrl]
//launch system[nl]
//with real-time[nl]
//relay control[scrl]
//of seven armed[nl]
//satellites,[clr]
//all with nuclear[nl]
//capability.[clr]
//The rail gun is [nl]
//just a cherry on[nl]
//top.[clr]
//[person id=00]
//[speed v=02]Armed[nl]
//satellites?[clr]
//Nuclear strike[nl]
//from planetary[nl]
//orbit?[speed v=03][clr]
//[person id=0A]
//That's right.[pause t=06][nl]
//Able to strike[nl]
//any point on[scrl]
//Earth without[nl]
//relying on[nl]
//ICBM's,[pause t=06]and[scrl]
//impossible to[nl]
//defend against.[clr]
//[person id=00]
//[speed v=02]You're going to[nl]
//murder millions[nl]
//of innocent[scrl]
//people for[nl]
//your personal[nl]
//vengeance?[speed v=03][clr]
//[person id=0A]
//Innocent?[clr]
//Grazing on[nl]
//spoon-fed[nl]
//`Justice' and[scrl]
//`Order',[pause t=06]content[nl]
//to ignore what[nl]
//goes on behind[scrl]
//the fine words?[clr]
//Their crime is[nl]
//equal to that of[nl]
//`Anonymous' -[scrl]
[person id=00]
[speed v=02]Что ты сделал?[speed v=03][clr]
[person id=0A]
Сейчас свершится[nl]
возмездие.[clr]
Приготовься к ядерному[nl]
удару.[fade val=88][sound id=06][pause t=C0][clr]
[person id=00]
[speed v=01]Как это возможно?[pause t=06][speed v=03][nl]
Metal Gear выведен из[nl]
строя![clr]
[person id=0A]
Дурак.[clr]
Неужели ты думаешь,[pause t=06] что[nl]
Metal Gear - всего лишь[nl]
бронированный транспорт[scrl]
для перетаскивания[nl]
ядерных ракет?[clr]
[person id=00]
[speed v=02]Что?[speed v=03][clr]
[person id=0A]
Истинная природа этого[nl]
зверя - интегрированная[nl]
система запуска с[scrl]
управлением в реальном[nl]
времени семью[nl]
орбитальными[scrl]
спутниками, способными к[nl]
нанесению ядерного[nl]
удара.[clr]
Рельсовая пушка - просто[nl]
вишенка на торте.[clr]
[person id=00]
[speed v=02]Ударные спутники?[nl]
Ядерный удар с орбиты[nl]
планеты?[speed v=03][clr]
[person id=0A]
Именно так.[pause t=06][clr]
Возможность нанести[nl]
удар,[pause t=06] от которого[nl]
невозможно защититься,[scrl]
по любой точке Земли,[nl]
без каких-либо МКБР.[clr]
[person id=00]
[speed v=02]Ты собираешься убить[nl]
миллионы ни в чём[nl]
неповинных людей ради[scrl]
своей мести?[speed v=03][clr]
[person id=0A]
Ни в чём неповинных?[clr]
Которых пичкают[nl]
«справедливостью»‎ и[nl]
«правом»‎,[pause t=06] а они только[scrl]
рады кормиться красивыми[nl]
словами,[pause t=06] игнорируя[nl]
происходящее?[clr]
Их преступление не[nl]
меньше,[pause t=06] чем преступление[nl]
«Анонима»‎...[scrl]

[message #02]
//[person id=0A]
//[speed v=02]no,[pause t=06]their[nl]
//complacency[nl]
//is what makes[scrl]
//`Anonymous'[nl]
//possible![speed v=03][clr]
//This strike is[nl]
//for my murdered[nl]
//comrades.[clr]
//But that won't [nl]
//be the end.[clr]
//[speed v=01]This is a [nl]
//declaration[nl]
//of war against[scrl]
//`Anonymous'!![speed v=03][scrl]
[person id=0A]
[speed v=02]Нет,[pause t=06] более того,[pause t=06] это их[nl]
самодовольство рождает[nl]
«Анонимов»‎![speed v=03][clr]
Этот удар - за моих[nl]
убитых товарищей.[clr]
Но на этом всё не[nl]
кончится.[clr]
[speed v=01]Я объявляю «Анониму»‎[nl]
войну!!![speed v=03][scrl]

[message #03]
//[person id=0A]
//[voice id=1B]I've just[nl]
//activated the[nl]
//elevator.[clr]
//Once Metal Gear[nl]
//is out on the[nl]
//surface,[clr]
//its signals will[nl]
//be transmitted[nl]
//and those [scrl]
//seven satellites[nl]
//will enter[nl]
//attack mode.[scrl]
[person id=0A]
[voice id=1B]Я активировал[nl]
подъёмник.[clr]
Как только Metal Gear[nl]
окажется на поверхности,[nl]
он отправит сигналы,[pause t=06] и[scrl]
семь спутников перейдут[nl]
в режим атаки.[scrl]

[message #04]
//[person id=0A]
//[voice id=1B]In 90 seconds![scrl]
[person id=0A]
[voice id=1B]Через 90 секунд![scrl]

[message #05]
//[person id=00]
//[voice id=1A][speed v=01]I WILL stop you![speed v=03][scrl]
[person id=00]
[voice id=1A][speed v=01]Я остановлю[nl]
тебя![speed v=03][scrl]

[message #06]
//[person id=0A]
//[voice id=1B][speed v=01]Okay Snake.[pause t=06][nl]
//Give it your[nl]
//best shot![clr]
//This is your [nl]
//last fight![clr]
//Come on![speed v=03][scrl]
[person id=0A]
[voice id=1B][speed v=01]Хорошо,[nl]
Снейк. Покажи всё,[pause t=06] что[nl]
умеешь![clr]
Это твоя последняя[nl]
битва![clr]
Давай же![speed v=03][scrl]

[message #07]
//[person id=0A]
//[speed v=04]How could I……[pause t=08][nl]
//be beaten by[nl]
//you……[speed v=03][scrl]
[person id=0A]
[speed v=04]Как я мог... Пасть от[nl]
твоей руки...[speed v=03][scrl]

[message #08]
//[person id=0A]
//[speed v=04]Snake……[pause t=0A] how do[nl]
//you do it?[clr]
//How do you [nl]
//keep……[pause t=0A][nl]
//fighting?……[clr]
//living?……[speed v=03][scrl]
[person id=0A]
[speed v=04]Снейк... Как это у тебя[nl]
получается?[clr]
Как ты продолжаешь...[nl]
Бороться?[clr]
Жить?..[speed v=03][scrl]

[message #09]
//[person id=0A]
//[speed v=04]For what?……[pause t=0F][nl]
//whom?…… [clr]
//In the name of [nl]
//what cause……?[speed v=03][scrl]
[person id=0A]
[speed v=04]...Ради чего?[pause t=0F][nl]
Кого?..[clr]
Во имя чего...?[speed v=03][scrl]

[message #10]
//[person id=0A]
//[speed v=05]…………[speed v=03][scrl]
[person id=0A]
[speed v=05]...[speed v=03][scrl]

[message #11]
//[person id=0A]
//[speed v=06]It's over……[nl]
//[pause t=0F][speed v=07]My comrades……[clr]
//I didn't do[nl]
//right by you[nl]
//all…… [speed v=03][scrl]
[person id=0A]
[speed v=06]Всё кончено...[nl]
[pause t=0F][speed v=07]Мои друзья...[clr]
Я подвёл всех вас...[speed v=03][scrl]

[message #12]
//[person id=00]
//Viper……[scrl]
[person id=00]
Вайпер...[scrl]

[message #13]
//[person id=0D]
//Snake.[scrl]
[person id=0D]
Снейк.[scrl]

[message #14]
//[person id=00]
//It's you.[scrl]
[person id=00]
Это ты.[scrl]

[message #15]
//[person id=00]
//The General……[scrl]
[person id=00]
Генерал...[scrl]

[message #16]
//[person id=0D]
//I heard.[pause t=06][nl]
//All of it.[clr]
//[speed v=04]Including the [nl]
//part about GLF [nl]
//and the U.S……[speed v=03][scrl]
[person id=0D]
Я слышала.[pause t=06][nl]
Всё.[clr]
[speed v=04]Всё насчёт GLF и[nl]
США...[speed v=03][scrl]

[message #17]
//[person id=00]
//……I see……[clr]
//What will you [nl]
//do now?[fade val=96][sound id=0C][pause t=DA][pause t=DA][scrl]
[person id=00]
Ясно...[clr]
Что ты будешь делать[nl]
теперь?[fade val=96][sound id=0C][pause t=DA][pause t=DA][scrl]

[message #18]
//[person id=0D]
//Stay here.[scrl]
[person id=0D]
Останусь здесь.[scrl]

[message #19]
//[person id=00]
//With GLF?[scrl]
[person id=00]
Вместе с GLF?[scrl]

[message #20]
//[person id=0D]
//Yes……[scrl]
[person id=0D]
Да...[scrl]

[message #21]
//[person id=00]
//Continue the[nl]
//General's work?[scrl]
[person id=00]
Чтобы продолжить дело[nl]
Генерала?[scrl]

[message #22]
//[person id=0D]
//Right now,[clr]
//I don't even [nl]
//know whether [nl]
//I loved him,[scrl]
//or hated him……[scrl]
[person id=0D]
Я уже не знаю,[pause t=06] любила я[nl]
его или ненавидела...[scrl]

[message #23]
//[person id=0D]
//[speed v=05]I just……[pause t=12][nl]
//couldn't leave[nl]
//his side.[speed v=03][scrl]
[person id=0D]
[speed v=05]Просто я... Не могу[nl]
оставить его.[speed v=03][scrl]

[message #24]
//[person id=00]
//…………[scrl]
[person id=00]
...[scrl]

[message #25]
//[person id=0D]
//His ideals may[nl]
//have been faked,[clr]
//but they weren't[nl]
//empty.[clr]
//That's what [nl]
//I think.[clr]
//And there are[nl]
//many here still[nl]
//who believe [scrl]
//that too.[scrl]
[person id=0D]
Пусть его «идеалы»‎[nl]
оказались выдуманными,[nl]
но они не были[scrl]
пустышками.[clr]
Я так думаю.[clr]
И многие здесь[nl]
по-прежнему в них верят.[scrl]

[block #07]
[message #00]
//[person id=0D]
//We'll work[nl]
//together to[nl]
//build a country[scrl]
//of our own,[pause t=06][nl]
//for ourselves.[clr]
//This time,[pause t=06]with [nl]
//real ideals.[fade val=16][pause t=D8][pause t=C8][sound id=0E][scrl]
[person id=0D]
Вместе мы построим[nl]
страну.[clr]
Страну для себя.[clr]
На этот раз с истинными[nl]
идеалами.[fade val=16][pause t=D8][pause t=C8][sound id=0E][scrl]

[message #01]
//[person id=05]
//[speed v=01]Snake![speed v=03][scrl]
[person id=05]
[speed v=01]Снейк![speed v=03][scrl]

[message #02]
//[person id=0D]
//It's her.[pause t=03][nl]
//Don't keep her[nl]
//waiting.[scrl]
[person id=0D]
Это за тобой.[clr]
Не заставляй её ждать.[scrl]

[message #03]
//[person id=00]
//I won't.[scrl]
[person id=00]
Не заставлю.[scrl]

[message #04]
//[person id=00]
//…… He called[nl]
//your name,[pause t=06][nl]
//you know.[scrl]
//At the end.[scrl]
[person id=00]
...Знаешь,[pause t=06] он вспоминал[nl]
тебя.[clr]
Перед смертью.[scrl]

[message #05]
//[person id=0D]
//[speed v=05]…………[clr]
//[speed v=06]Did he……[speed v=03][scrl]
[person id=0D]
[speed v=05]...[clr]
[speed v=06]Вспоминал...[speed v=03][scrl]

[message #06]
//[person id=05]
//[speed v=01]Snake![clr]
//[speed v=02]I got us a jeep.[speed v=03][clr]
//[person id=00]
//Good work.[clr]
//[person id=05]
//[speed v=04]Is it over?[speed v=03][clr]
//[person id=00]
//Yes……[pause t=08]it's all[nl]
//over.[clr]
//[person id=05]
//Is it……?[scrl]
[person id=05]
[speed v=01]Снейк![clr]
[speed v=02]Я нашла нам джип.[speed v=03][clr]
[person id=00]
Молодец.[clr]
[person id=05]
[speed v=04]Всё закончилось?[speed v=03][clr]
[person id=00]
Да...[pause t=08] Всё закончилось.[clr]
[person id=05]
Да?..[scrl]

[message #07]
//[person id=05]
//[speed v=05]What about her?[speed v=03][scrl]
[person id=05]
[speed v=05]А как же она?[speed v=03][scrl]

[message #08]
//[person id=00]
//She's strong.[clr]
//And she'll[nl]
//become even[nl]
//stronger……[scrl]
[person id=00]
Она сильная.[clr]
И станет ещё сильнее...[scrl]

[message #09]
//[person id=05]
//[speed v=04]……You don't[nl]
//have to go?[pause t=08][nl]
//With her……?[speed v=03][scrl]
[person id=05]
[speed v=04]...Разве ты не[nl]
пойдёшь?[pause t=08][nl]
С ней?..[speed v=03][scrl]

[message #10]
//[person id=00]
//To GLF?[pause t=08] Why?[scrl]
[person id=00]
В ряды GLF?[pause t=08] С чего[nl]
вдруг?[scrl]

[message #11]
//[person id=05]
//[speed v=02]Nothing.[nl]
//[pause t=06]Really.[clr]
//[speed v=03]Let's get out[nl]
//of here.[clr]
//[person id=00]
//Right……[clr]
//[person id=00]
//[sound id=81][pause t=E4]Wait,[pause t=04]there's[nl]
//the Codec.[scrl]
[person id=05]
[speed v=02]Забудь.[nl]
[pause t=06]Правда.[clr]
[speed v=03]Давай убираться отсюда.[clr]
[person id=00]
Верно...[clr]
[person id=00]
[sound id=81][pause t=E4]Погоди,[nl]
вызов по кодеку.[scrl]

[message #12]
//[script val=06][script val=81][person id=01]
//[speed v=02]Snake![speed v=03][clr]
//[person id=00]
//[speed v=02]Colonel![nl]
//[pause t=06]Everything[nl]
//all right?[speed v=03][clr]
//[script val=4A][person id=03]
//Yeah.[pause t=06] I put[nl]
//a bullet in[nl]
//McBride.[clr]
//[person id=00]
//You?[clr]
//[script val=46][person id=01]
//Snake,[pause t=06]I owe you[nl]
//an apology……[clr]
//It's true that I[nl]
//was in charge of[nl]
//Black Chamber's[scrl]
//termination.[clr]
//We were told[nl]
//that there was a[nl]
//terrorist group[scrl]
//coming in.[clr]
//[speed v=05]Secret[nl]
//liquidation on[nl]
//a dark night……[speed v=03][clr]
//Only when it was[nl]
//all over was [nl]
//I told that the[scrl]
//target had been[nl]
//one of our own,[pause t=06][nl]
//an American [scrl]
//unit……[speed v=03][clr]
//[person id=00]
//Was that the[nl]
//reason for your[nl]
//retirement?[clr]
//[person id=01]
//[speed v=04]Yes……[clr]
//I lived with the[nl]
//guilt these [nl]
//two years.[clr]
//[speed v=03]But when they[nl]
//hijacked Metal[nl]
//Gear,[clr]
//I was called in [nl]
//by NSA chief[nl]
//Steve Gardner,[clr]
//the mission[nl]
//controller……[scrl]
[script val=06][script val=81][person id=01]
[speed v=02]Снейк![speed v=03][clr]
[person id=00]
[speed v=02]Полковник![nl]
[pause t=06]У вас всё в[nl]
порядке?[speed v=03][clr]
[script val=4A][person id=03]
Ага. Я подстрелил[nl]
МакБрида.[clr]
[person id=00]
Ты?[clr]
[script val=46][person id=01]
Снейк,[pause t=06] я должен перед[nl]
тобой извиниться...[clr]
Я действительно[nl]
руководил ликвидацией[nl]
«Тёмной палаты»‎.[clr]
Нам сказали,[pause t=06] что группа[nl]
террористов готовит[nl]
нападение.[clr]
[speed v=05]Секретная операция[nl]
темной ночью...[speed v=03][clr]
Лишь когда всё было[nl]
кончено,[pause t=06] я узнал,[pause t=06] что[nl]
целью были наши же[scrl]
ребята,[pause t=06] американское[nl]
спецподразделение...[speed v=03][clr]
[person id=00]
Именно поэтому ты ушёл в[nl]
отставку?[clr]
[person id=01]
[speed v=04]Да... Два года я жил с[nl]
чувством вины.[clr]
[speed v=03]Но когда они похитили[nl]
Metal Gear,[pause t=06] шеф[nl]
агентства национальной[scrl]
безопасности,[pause t=06] Стив[nl]
Гарднер,[pause t=06] руководитель[nl]
операции,[pause t=06] вызвал[scrl]
меня...[scrl]

[message #13]
//[script val=06][script val=81][person id=00]
//So you took the[nl]
//job to confront[nl]
//the past?[clr]
//[person id=01]
//A job which was[nl]
//offered to me[nl]
//with the[clr]
//alternative[nl]
//of making the[nl]
//incident public.[clr]
//Along with[nl]
//evidence that[nl]
//it was I who[scrl]
//planned the[nl]
//thing.[clr]
//[person id=00]
//Blackmail,[pause t=05]huh?[clr]
//But……[pause t=0C] how would[nl]
//Gardner know[nl]
//about that?[clr]
//[person id=01]
//Probably dug it[nl]
//up somewhere.[clr]
//He is a former [nl]
//CIA Director……[clr]
//[person id=00]
//[speed v=02]Former DCI?[speed v=03][clr]
//Don't tell me……[clr]
//seven years ago,[pause t=06][nl]
//during the Outer[nl]
//Heaven incident,[clr]
//who was the[nl]
//DDCI……?[clr]
//[script val=4A][person id=03]
//Now you've got[nl]
//it.[clr]
//Gardner was[nl]
//the Deputy[nl]
//Director of[scrl]
//Central[nl]
//Intelligence,[pause t=06][nl]
//all right.[clr]
//[person id=00]
//Weasel?[clr]
//[person id=03]
//He was the one[nl]
//who organized[nl]
//Outer Heaven and[scrl]
//the development[nl]
//of Metal Gear.[fade val=96][sound id=08][pause t=DA][pause t=DA][clr]
//Metal Gear used[nl]
//to be under CIA[nl]
//control,[pause t=06]like[scrl]
//Viper said.[clr]
//Gardner was also[nl]
//the one who[nl]
//salvaged the[scrl]
//Metal Gear you[nl]
//totalled from[nl]
//Outer Heaven[scrl]
//and continued[nl]
//the development[nl]
//program.[clr]
//In other words,[pause t=06][nl]
//Project Babel[nl]
//was actually[scrl]
//his idea.[clr]
//But two years[nl]
//ago,[pause t=06]Metal Gear[nl]
//was seized by[scrl]
//foreign[nl]
//terrorists and[nl]
//as a result,[pause t=06]the[scrl]
//control of the[nl]
//weapon,[pause t=06]and the[nl]
//leadership of[scrl]
//Project Babel,[pause t=06][nl]
//was transferred[nl]
//away to Parker[scrl]
//and the Army.[clr]
//And Gardner had[nl]
//Black Chamber[nl]
//erased to ensure[scrl]
//their silence.[scrl]
[script val=06][script val=81][person id=00]
И ты согласился,[pause t=06] чтобы[nl]
встретить прошлое лицом[nl]
к лицу?[clr]
[person id=01]
Мне предложили[nl]
согласиться,[pause t=06] угрожая[nl]
раскрыть тот инцидент[scrl]
обществу.[clr]
И рассказать,[pause t=06] что это я[nl]
всё спланировал.[clr]
[person id=00]
Шантаж,[pause t=06] да?[clr]
Но... Как об этом узнал[nl]
Гарднер?[clr]
[person id=01]
Видимо,[pause t=06] нарыл[nl]
где-нибудь.[clr]
Он бывший директор[nl]
ЦРУ...[clr]
[person id=00]
[speed v=02]Бывший директор[nl]
ЦРУ?[speed v=03][clr]
Погоди-ка... семь лет[nl]
назад,[pause t=06] во время событий[nl]
Аутер-Хевен,[pause t=06] кто был[scrl]
заместителем директора[nl]
ЦРУ?[clr]
[script val=4A][person id=03]
Ну наконец-то дошло.[clr]
Гарднер и был этим[nl]
заместителем.[clr]
[person id=00]
Визель?[clr]
[person id=03]
Это он подготовил[nl]
Аутер-Хевен и разработку[nl]
Metal Gear.[fade val=96][sound id=08][pause t=DA][pause t=DA][clr]
Metal Gear когда-то был[nl]
под контролем у ЦРУ,[pause t=06] как[nl]
и сказал Вайпер.[clr]
Именно Гарднер вывез из[nl]
Аутер-Хевен останки[nl]
Metal Gear,[scrl]
уничтоженного тобою,[pause t=06] и[nl]
продолжил разработку на[nl]
их основе.[clr]
Иными словами,[pause t=06] проект[nl]
«Вавилон»‎ был,[pause t=06] по сути,[nl]
его идеей.[clr]
Но два года назад[nl]
неизвестные террористы[nl]
похитили Metal Gear,[pause t=06] в[scrl]
результате,[pause t=06] после[nl]
завершения инцидента,[nl]
контроль над оружием и[scrl]
руководство проектом[nl]
«Вавилон»‎ перешили к[nl]
Паркеру и военным.[clr]
После чего Гарднер[nl]
попытался стереть[nl]
«Тёмную Палату»‎ с лица[scrl]
земли,[pause t=06] чтобы точно[nl]
знать,[pause t=06] что они никогда[nl]
не заговорят.[scrl]

