[
  {
    "TxId": "b8cf75a4bcde7b49a908cf24bd17f5b655f144c16ca81085840aeae25ca92ec7",
    "Key": "E_Meter8",
    "timestamp": 1684788948,
    "isDelete": false,
    "Record": {
      "objectType": "E_Meter",
      "e_meter_ID": "",
      "owner_ID": "MessBetr1",
      "flat_ID": "FLAT6",
      "energyRessource_ID": "",
      "meter_value": 1839.8636,
      "last_meter_value": 1839.8478,
      "diff_meter_value": 0.015799999999899228,
      "unit": "kWh",
      "updateTS": 1621025400, 14.05.21 22:50
      "isActive": true
    }
  },
  {
    "TxId": "ffb784134a0f36cccf60e5fe678d864156fe92793522b4c583536404dd8653a5",
    "Key": "E_Meter8",
    "timestamp": 1684788932,
    "isDelete": false,
    "Record": {
      "objectType": "E_Meter",
      "e_meter_ID": "",
      "owner_ID": "MessBetr1",
      "flat_ID": "FLAT6",
      "energyRessource_ID": "",
      "meter_value": 1839.8478,
      "last_meter_value": 1839.8322,
      "diff_meter_value": 0.015599999999949432,
      "unit": "kWh",
      "updateTS": 1621025100,
      "isActive": true
    }
  },
  {
    "TxId": "99c112e763816561096748640b7a6ba7a2540b0c7ec2a3b88eb11ed93386680c",
    "Key": "E_Meter8",
    "timestamp": 1684788917,
    "isDelete": false,
    "Record": {
      "objectType": "E_Meter",
      "e_meter_ID": "",
      "owner_ID": "MessBetr1",
      "flat_ID": "FLAT6",
      "energyRessource_ID": "",
      "meter_value": 1839.8322,
      "last_meter_value": 1839.8165,
      "diff_meter_value": 0.015700000000151704,
      "unit": "kWh",
      "updateTS": 1621024800,
      "isActive": true
    }
  },
  {
    "TxId": "e4fef9bad1d7a9a70e4bc35fff3b4344b28f8a10ca90ba3fb574cf7d91a57dc5",
    "Key": "E_Meter8",
    "timestamp": 1684788902,
    "isDelete": false,
    "Record": {
      "objectType": "E_Meter",
      "e_meter_ID": "",
      "owner_ID": "MessBetr1",
      "flat_ID": "FLAT6",
      "energyRessource_ID": "",
      "meter_value": 1839.8165,
      "last_meter_value": 1839.799,
      "diff_meter_value": 0.01749999999992724,
      "unit": "kWh",
      "updateTS": 1621024500,
      "isActive": true
    }
  },
  {
    "TxId": "2382dcd68ec5457f354d6073b5acc11131af8f5c06e2bd81b9be0775f752686f",
    "Key": "E_Meter8",
    "timestamp": 1684788886,
    "isDelete": false,
    "Record": {
      "objectType": "E_Meter",
      "e_meter_ID": "",
      "owner_ID": "MessBetr1",
      "flat_ID": "FLAT6",
      "energyRessource_ID": "",
      "meter_value": 1839.799,
      "last_meter_value": 1839.7826,
      "diff_meter_value": 0.01639999999997599,
      "unit": "kWh",
      "updateTS": 1621024200,
      "isActive": true
    }
  },
  {
    "TxId": "4ec043a577ba5fb2fc4e9c7908addfe783b87a7aaa8e8480c729e2cbc6e584a9",
    "Key": "E_Meter8",
    "timestamp": 1684788871,
    "isDelete": false,
    "Record": {
      "objectType": "E_Meter",
      "e_meter_ID": "",
      "owner_ID": "MessBetr1",
      "flat_ID": "FLAT6",
      "energyRessource_ID": "",
      "meter_value": 1839.7826,
      "last_meter_value": 1839.7671,
      "diff_meter_value": 0.015499999999974534,
      "unit": "kWh",
      "updateTS": 1621023900,
      "isActive": true
    }
  },
  {
    "TxId": "7508072d44e9e52770f4f995d3fd403e4d33021562abf9ca73925e7a95710bdb",
    "Key": "E_Meter8",
    "timestamp": 1684788856,
    "isDelete": false,
    "Record": {
      "objectType": "E_Meter",
      "e_meter_ID": "",
      "owner_ID": "MessBetr1",
      "flat_ID": "FLAT6",
      "energyRessource_ID": "",
      "meter_value": 1839.7671,
      "last_meter_value": 1839.752,
      "diff_meter_value": 0.015100000000074942,
      "unit": "kWh",
      "updateTS": 1621023600,
      "isActive": true
    }
  },
  {
    "TxId": "5e3085586534091f070cbcc75f832e2bdd1e550dab0ff916409be916ee9adc51",
    "Key": "E_Meter8",
    "timestamp": 1684788841,
    "isDelete": false,
    "Record": {
      "objectType": "E_Meter",
      "e_meter_ID": "",
      "owner_ID": "MessBetr1",
      "flat_ID": "FLAT6",
      "energyRessource_ID": "",
      "meter_value": 1839.752,
      "last_meter_value": 1839.737,
      "diff_meter_value": 0.01499999999987267,
      "unit": "kWh",
      "updateTS": 1621023300,
      "isActive": true
    }
  },
  {
    "TxId": "a076fadb5e6786032ea6a1e5d8c536a788761616c1166fc6cafc16929cf1172e",
    "Key": "E_Meter8",
    "timestamp": 1684788826,
    "isDelete": false,
    "Record": {
      "objectType": "E_Meter",
      "e_meter_ID": "",
      "owner_ID": "MessBetr1",
      "flat_ID": "FLAT6",
      "energyRessource_ID": "",
      "meter_value": 1839.737,
      "last_meter_value": 1839.7216,
      "diff_meter_value": 0.015399999999999636,
      "unit": "kWh",
      "updateTS": 1621023000,
      "isActive": true
    }
  },
  {
    "TxId": "1f97d4e810620d613a8809a72944a813616ea993af00630db1b3df8f83590d6b",
    "Key": "E_Meter8",
    "timestamp": 1684788810,
    "isDelete": false,
    "Record": {
      "objectType": "E_Meter",
      "e_meter_ID": "",
      "owner_ID": "MessBetr1",
      "flat_ID": "FLAT6",
      "energyRessource_ID": "",
      "meter_value": 1839.7216,
      "last_meter_value": 1839.7059,
      "diff_meter_value": 0.015700000000151704,
      "unit": "kWh",
      "updateTS": 1621022700,
      "isActive": true
    }
  },
  {
    "TxId": "aec613d8ac3d364290a5e00d5d9837d6e3c1ab82437532bfac4c4c73e32cd2bc",
    "Key": "E_Meter8",
    "timestamp": 1684788795,
    "isDelete": false,
    "Record": {
      "objectType": "E_Meter",
      "e_meter_ID": "",
      "owner_ID": "MessBetr1",
      "flat_ID": "FLAT6",
      "energyRessource_ID": "",
      "meter_value": 1839.7059,
      "last_meter_value": 1839.69,
      "diff_meter_value": 0.015899999999874126,
      "unit": "kWh",
      "updateTS": 1621022400,
      "isActive": true
    }
  },
  {
    "TxId": "17e80015385d6ff87d42aa89ce7bd96af30f0fb8bf0d49dcc9d57501c1a75778",
    "Key": "E_Meter8",
    "timestamp": 1684788780,
    "isDelete": false,
    "Record": {
      "objectType": "E_Meter",
      "e_meter_ID": "",
      "owner_ID": "MessBetr1",
      "flat_ID": "FLAT6",
      "energyRessource_ID": "",
      "meter_value": 1839.69,
      "last_meter_value": 1839.6726,
      "diff_meter_value": 0.017399999999952342,
      "unit": "kWh",
      "updateTS": 1621022100,
      "isActive": true
    }
  },
  {
    "TxId": "d23e710492c183661f6c6a7c0df0d1efd9467b772eb5bf4b8ec165ea3d3343b2",
    "Key": "E_Meter8",
    "timestamp": 1684788765,
    "isDelete": false,
    "Record": {
      "objectType": "E_Meter",
      "e_meter_ID": "",
      "owner_ID": "MessBetr1",
      "flat_ID": "FLAT6",
      "energyRessource_ID": "",
      "meter_value": 1839.6726,
      "last_meter_value": 1839.654,
      "diff_meter_value": 0.018600000000105865,
      "unit": "kWh",
      "updateTS": 1621021800,
      "isActive": true
    }
  },
  {
    "TxId": "410d3575b51aa334a171a27ec079bc6a8ea85625cd7067f1e8ae3af13a95e38c",
    "Key": "E_Meter8",
    "timestamp": 1684788749,
    "isDelete": false,
    "Record": {
      "objectType": "E_Meter",
      "e_meter_ID": "",
      "owner_ID": "MessBetr1",
      "flat_ID": "FLAT6",
      "energyRessource_ID": "",
      "meter_value": 1839.654,
      "last_meter_value": 1839.636,
      "diff_meter_value": 0.018000000000029104,
      "unit": "kWh",
      "updateTS": 1621021500,
      "isActive": true
    }
  },
  {
    "TxId": "f2cbbc0a4d283850767ff098ea58a9d602bdaa65589dfcf8bc0f10d13cde793b",
    "Key": "E_Meter8",
    "timestamp": 1684788733,
    "isDelete": false,
    "Record": {
      "objectType": "E_Meter",
      "e_meter_ID": "",
      "owner_ID": "MessBetr1",
      "flat_ID": "FLAT6",
      "energyRessource_ID": "",
      "meter_value": 1839.636,
      "last_meter_value": 1839.6163,
      "diff_meter_value": 0.019700000000057116,
      "unit": "kWh",
      "updateTS": 1621021200,
      "isActive": true
    }
  },
  {
    "TxId": "cb74ec1addc65894a57c6528a96c230bb86211877ecac727785d6e61a6a4817f",
    "Key": "E_Meter8",
    "timestamp": 1684788717,
    "isDelete": false,
    "Record": {
      "objectType": "E_Meter",
      "e_meter_ID": "",
      "owner_ID": "MessBetr1",
      "flat_ID": "FLAT6",
      "energyRessource_ID": "",
      "meter_value": 1839.6163,
      "last_meter_value": 1839.59,
      "diff_meter_value": 0.026299999999991996,
      "unit": "kWh",
      "updateTS": 1621020900,
      "isActive": true
    }
  },
  {
    "TxId": "24c5ae226b98838dc1b2af67abed4079f424d985448fff55cc45f1433f5db10a",
    "Key": "E_Meter8",
    "timestamp": 1684788702,
    "isDelete": false,
    "Record": {
      "objectType": "E_Meter",
      "e_meter_ID": "",
      "owner_ID": "MessBetr1",
      "flat_ID": "FLAT6",
      "energyRessource_ID": "",
      "meter_value": 1839.59,
      "last_meter_value": 1839.5621,
      "diff_meter_value": 0.027899999999817737,
      "unit": "kWh",
      "updateTS": 1621020600,
      "isActive": true
    }
  },
  {
    "TxId": "f64c340a8497d287e618014dccb0b0e8bd9c46b5baa906d3b9114e3da4918466",
    "Key": "E_Meter8",
    "timestamp": 1684788686,
    "isDelete": false,
    "Record": {
      "objectType": "E_Meter",
      "e_meter_ID": "",
      "owner_ID": "MessBetr1",
      "flat_ID": "FLAT6",
      "energyRessource_ID": "",
      "meter_value": 1839.5621,
      "last_meter_value": 1839.5363,
      "diff_meter_value": 0.025800000000117507,
      "unit": "kWh",
      "updateTS": 1621020300,
      "isActive": true
    }
  },
  {
    "TxId": "74da25b0811554145d89d8f1cb761069b9c3da22bd7e3cb63ffe2820db620bfe",
    "Key": "E_Meter8",
    "timestamp": 1684788671,
    "isDelete": false,
    "Record": {
      "objectType": "E_Meter",
      "e_meter_ID": "",
      "owner_ID": "MessBetr1",
      "flat_ID": "FLAT6",
      "energyRessource_ID": "",
      "meter_value": 1839.5363,
      "last_meter_value": 1839.5106,
      "diff_meter_value": 0.025699999999915235,
      "unit": "kWh",
      "updateTS": 1621020000,
      "isActive": true
    }
  },
  {
    "TxId": "321c64e9dca0a0fd39e2e4550fa5fd72e7d0b34b3748a169ab7954895ba962f4",
    "Key": "E_Meter8",
    "timestamp": 1684788656,
    "isDelete": false,
    "Record": {
      "objectType": "E_Meter",
      "e_meter_ID": "",
      "owner_ID": "MessBetr1",
      "flat_ID": "FLAT6",
      "energyRessource_ID": "",
      "meter_value": 1839.5106,
      "last_meter_value": 1839.487,
      "diff_meter_value": 0.02359999999998763,
      "unit": "kWh",
      "updateTS": 1621019700,
      "isActive": true
    }
  },
  {
    "TxId": "aa62d9c91482a6bb10a775bd01980647dcefc0716552db042528ff10794855d5",
    "Key": "E_Meter8",
    "timestamp": 1684788640,
    "isDelete": false,
    "Record": {
      "objectType": "E_Meter",
      "e_meter_ID": "",
      "owner_ID": "MessBetr1",
      "flat_ID": "FLAT6",
      "energyRessource_ID": "",
      "meter_value": 1839.487,
      "last_meter_value": 1839.4628,
      "diff_meter_value": 0.024200000000064392,
      "unit": "kWh",
      "updateTS": 1621019400,
      "isActive": true
    }
  },
  {
    "TxId": "5cb0aa48bf9dad11fb28a4151f637337e9685c1b60c4c048e466321eec3b902e",
    "Key": "E_Meter8",
    "timestamp": 1684788624,
    "isDelete": false,
    "Record": {
      "objectType": "E_Meter",
      "e_meter_ID": "",
      "owner_ID": "MessBetr1",
      "flat_ID": "FLAT6",
      "energyRessource_ID": "",
      "meter_value": 1839.4628,
      "last_meter_value": 1839.4388,
      "diff_meter_value": 0.024000000000114596,
      "unit": "kWh",
      "updateTS": 1621019100,
      "isActive": true
    }
  },
  {
    "TxId": "f813bb1d3ba8b050a466a667f0169261b6a2c9e37bccba7c2a080c321e5b262d",
    "Key": "E_Meter8",
    "timestamp": 1684788608,
    "isDelete": false,
    "Record": {
      "objectType": "E_Meter",
      "e_meter_ID": "",
      "owner_ID": "MessBetr1",
      "flat_ID": "FLAT6",
      "energyRessource_ID": "",
      "meter_value": 1839.4388,
      "last_meter_value": 1839.4163,
      "diff_meter_value": 0.022499999999809006,
      "unit": "kWh",
      "updateTS": 1621018800,
      "isActive": true
    }
  },
  {
    "TxId": "61e2990e14dbbb759b1e17255ec13e2fb9dc066f4a7f659c19e0e4af40149461",
    "Key": "E_Meter8",
    "timestamp": 1684788593,
    "isDelete": false,
    "Record": {
      "objectType": "E_Meter",
      "e_meter_ID": "",
      "owner_ID": "MessBetr1",
      "flat_ID": "FLAT6",
      "energyRessource_ID": "",
      "meter_value": 1839.4163,
      "last_meter_value": 1839.3939,
      "diff_meter_value": 0.022400000000061482,
      "unit": "kWh",
      "updateTS": 1621018500,
      "isActive": true
    }
  },
  {
    "TxId": "cf7f38bd62584b0b901136173070260273f3b9df1f44b4c5f7a88dd2ef57cb3f",
    "Key": "E_Meter8",
    "timestamp": 1684788578,
    "isDelete": false,
    "Record": {
      "objectType": "E_Meter",
      "e_meter_ID": "",
      "owner_ID": "MessBetr1",
      "flat_ID": "FLAT6",
      "energyRessource_ID": "",
      "meter_value": 1839.3939,
      "last_meter_value": 1839.3715,
      "diff_meter_value": 0.022400000000061482,
      "unit": "kWh",
      "updateTS": 1621018200,
      "isActive": true
    }
  },
  {
    "TxId": "98b0a28216645bd878ffae168e61d4155ada8372b797dd0aec7eea0107b8b0e2",
    "Key": "E_Meter8",
    "timestamp": 1684788563,
    "isDelete": false,
    "Record": {
      "objectType": "E_Meter",
      "e_meter_ID": "",
      "owner_ID": "MessBetr1",
      "flat_ID": "FLAT6",
      "energyRessource_ID": "",
      "meter_value": 1839.3715,
      "last_meter_value": 1839.3488,
      "diff_meter_value": 0.022699999999986176,
      "unit": "kWh",
      "updateTS": 1621017900,
      "isActive": true
    }
  },
  {
    "TxId": "14660ce3fadb4200ad7f03955bc8971ae98602364a3f34492be8eb7e1148cb6b",
    "Key": "E_Meter8",
    "timestamp": 1684788547,
    "isDelete": false,
    "Record": {
      "objectType": "E_Meter",
      "e_meter_ID": "",
      "owner_ID": "MessBetr1",
      "flat_ID": "FLAT6",
      "energyRessource_ID": "",
      "meter_value": 1839.3488,
      "last_meter_value": 1839.3262,
      "diff_meter_value": 0.022600000000011278,
      "unit": "kWh",
      "updateTS": 1621017600,
      "isActive": true
    }
  },
  {
    "TxId": "b41ec398753409faefbbad31ea27759a97ca17c3e1e7b19ad9bfaabefbc380a5",
    "Key": "E_Meter8",
    "timestamp": 1684788531,
    "isDelete": false,
    "Record": {
      "objectType": "E_Meter",
      "e_meter_ID": "",
      "owner_ID": "MessBetr1",
      "flat_ID": "FLAT6",
      "energyRessource_ID": "",
      "meter_value": 1839.3262,
      "last_meter_value": 1839.3037,
      "diff_meter_value": 0.02250000000003638,
      "unit": "kWh",
      "updateTS": 1621017300,
      "isActive": true
    }
  },
  {
    "TxId": "77a0a2aae4f8adc619ae34d2a124a66228d79e9e30240b24aee8be2d66cd35fb",
    "Key": "E_Meter8",
    "timestamp": 1684788516,
    "isDelete": false,
    "Record": {
      "objectType": "E_Meter",
      "e_meter_ID": "",
      "owner_ID": "MessBetr1",
      "flat_ID": "FLAT6",
      "energyRessource_ID": "",
      "meter_value": 1839.3037,
      "last_meter_value": 1839.2809,
      "diff_meter_value": 0.022799999999961074,
      "unit": "kWh",
      "updateTS": 1621017000,
      "isActive": true
    }
  },
  {
    "TxId": "6d128e3294c099ce449662b994f0e9fb6239989566f187842319f4f464d07cad",
    "Key": "E_Meter8",
    "timestamp": 1684788500,
    "isDelete": false,
    "Record": {
      "objectType": "E_Meter",
      "e_meter_ID": "",
      "owner_ID": "MessBetr1",
      "flat_ID": "FLAT6",
      "energyRessource_ID": "",
      "meter_value": 1839.2809,
      "last_meter_value": 1839.2606,
      "diff_meter_value": 0.020299999999906504,
      "unit": "kWh",
      "updateTS": 1621016700,
      "isActive": true
    }
  },
  {
    "TxId": "aefb1977044d0c216af33dd44f298d06beb3285d61494ceca20234d1dd96da8a",
    "Key": "E_Meter8",
    "timestamp": 1684788485,
    "isDelete": false,
    "Record": {
      "objectType": "E_Meter",
      "e_meter_ID": "",
      "owner_ID": "MessBetr1",
      "flat_ID": "FLAT6",
      "energyRessource_ID": "",
      "meter_value": 1839.2606,
      "last_meter_value": 1839.2417,
      "diff_meter_value": 0.01890000000003056,
      "unit": "kWh",
      "updateTS": 1621016400,
      "isActive": true
    }
  },
  {
    "TxId": "e747264ffe7c5102e40986b8f46e9aba8554d60d2b9157b952bba58a790405a1",
    "Key": "E_Meter8",
    "timestamp": 1684788469,
    "isDelete": false,
    "Record": {
      "objectType": "E_Meter",
      "e_meter_ID": "",
      "owner_ID": "MessBetr1",
      "flat_ID": "FLAT6",
      "energyRessource_ID": "",
      "meter_value": 1839.2417,
      "last_meter_value": 1839.2227,
      "diff_meter_value": 0.019000000000005457,
      "unit": "kWh",
      "updateTS": 1621016100,
      "isActive": true
    }
  },
  {
    "TxId": "5af43aaff6377ff14bed6aef8303d428535668b1a2f80d37fda8bbe2832f9948",
    "Key": "E_Meter8",
    "timestamp": 1684788454,
    "isDelete": false,
    "Record": {
      "objectType": "E_Meter",
      "e_meter_ID": "",
      "owner_ID": "MessBetr1",
      "flat_ID": "FLAT6",
      "energyRessource_ID": "",
      "meter_value": 1839.2227,
      "last_meter_value": 1839.2024,
      "diff_meter_value": 0.020300000000133878,
      "unit": "kWh",
      "updateTS": 1621015800,
      "isActive": true
    }
  },
  {
    "TxId": "025cc8a1f31ec38e643cd444fd6153d3dd875fad977252c6ab689ee308ead521",
    "Key": "E_Meter8",
    "timestamp": 1684788439,
    "isDelete": false,
    "Record": {
      "objectType": "E_Meter",
      "e_meter_ID": "",
      "owner_ID": "MessBetr1",
      "flat_ID": "FLAT6",
      "energyRessource_ID": "",
      "meter_value": 1839.2024,
      "last_meter_value": 1839.181,
      "diff_meter_value": 0.021399999999857755,
      "unit": "kWh",
      "updateTS": 1621015500,
      "isActive": true
    }
  },
  {
    "TxId": "6f2c5ee80c5966733e32ea4e3cc91d3d25455bcc3ab9d141d90dbdbd68c1b237",
    "Key": "E_Meter8",
    "timestamp": 1684788424,
    "isDelete": false,
    "Record": {
      "objectType": "E_Meter",
      "e_meter_ID": "",
      "owner_ID": "MessBetr1",
      "flat_ID": "FLAT6",
      "energyRessource_ID": "",
      "meter_value": 1839.181,
      "last_meter_value": 1839.159,
      "diff_meter_value": 0.021999999999934516,
      "unit": "kWh",
      "updateTS": 1621015200,
      "isActive": true
    }
  },
  {
    "TxId": "aff91c8b1abfa36d943e1cd6a06bbfd6a300c7c2f928825464e4fbea4c57ea3b",
    "Key": "E_Meter8",
    "timestamp": 1684788409,
    "isDelete": false,
    "Record": {
      "objectType": "E_Meter",
      "e_meter_ID": "",
      "owner_ID": "MessBetr1",
      "flat_ID": "FLAT6",
      "energyRessource_ID": "",
      "meter_value": 1839.159,
      "last_meter_value": 1839.1367,
      "diff_meter_value": 0.022300000000086584,
      "unit": "kWh",
      "updateTS": 1621014900,
      "isActive": true
    }
  },
  {
    "TxId": "26f24c6c6da8d2b0224a07269a3f2948ed2016e53643e1c8c51e8e9233c0b3b5",
    "Key": "E_Meter8",
    "timestamp": 1684788393,
    "isDelete": false,
    "Record": {
      "objectType": "E_Meter",
      "e_meter_ID": "",
      "owner_ID": "MessBetr1",
      "flat_ID": "FLAT6",
      "energyRessource_ID": "",
      "meter_value": 1839.1367,
      "last_meter_value": 1839.1149,
      "diff_meter_value": 0.02179999999998472,
      "unit": "kWh",
      "updateTS": 1621014600,
      "isActive": true
    }
  },
  {
    "TxId": "999ade9aa5cb7bca2e9119bc662f6bca79a344559d11e08e99bb6ccf543ddf11",
    "Key": "E_Meter8",
    "timestamp": 1684788378,
    "isDelete": false,
    "Record": {
      "objectType": "E_Meter",
      "e_meter_ID": "",
      "owner_ID": "MessBetr1",
      "flat_ID": "FLAT6",
      "energyRessource_ID": "",
      "meter_value": 1839.1149,
      "last_meter_value": 1839.0854,
      "diff_meter_value": 0.029500000000098225,
      "unit": "kWh",
      "updateTS": 1621014300,
      "isActive": true
    }
  },
  {
    "TxId": "27b1437aff94fc66b1476a5b85ee0fa7849b1af213d9b22efb6479a4ef0ac796",
    "Key": "E_Meter8",
    "timestamp": 1684788362,
    "isDelete": false,
    "Record": {
      "objectType": "E_Meter",
      "e_meter_ID": "",
      "owner_ID": "MessBetr1",
      "flat_ID": "FLAT6",
      "energyRessource_ID": "",
      "meter_value": 1839.0854,
      "last_meter_value": 1839.0447,
      "diff_meter_value": 0.04070000000001528,
      "unit": "kWh",
      "updateTS": 1621014000,
      "isActive": true
    }
  },
  {
    "TxId": "cd7d2bf75eb29c9b761d3a63dd6a3df6b8be33873328792126291a7560d0e0fe",
    "Key": "E_Meter8",
    "timestamp": 1684788347,
    "isDelete": false,
    "Record": {
      "objectType": "E_Meter",
      "e_meter_ID": "",
      "owner_ID": "MessBetr1",
      "flat_ID": "FLAT6",
      "energyRessource_ID": "",
      "meter_value": 1839.0447,
      "last_meter_value": 1839.0065,
      "diff_meter_value": 0.03819999999996071,
      "unit": "kWh",
      "updateTS": 1621013700,
      "isActive": true
    }
  },
  {
    "TxId": "c7751c4acbe3abdece04a4405e6e7bc7999cc03d9b1df34e43103b96afdfab68",
    "Key": "E_Meter8",
    "timestamp": 1684788332,
    "isDelete": false,
    "Record": {
      "objectType": "E_Meter",
      "e_meter_ID": "",
      "owner_ID": "MessBetr1",
      "flat_ID": "FLAT6",
      "energyRessource_ID": "",
      "meter_value": 1839.0065,
      "last_meter_value": 1838.9713,
      "diff_meter_value": 0.03520000000003165,
      "unit": "kWh",
      "updateTS": 1621013400,
      "isActive": true
    }
  },
  {
    "TxId": "78387d5392c8e0df9a9577d3920b6bba895f5aa12380ffd7a69bd0ce8c485fcc",
    "Key": "E_Meter8",
    "timestamp": 1684788317,
    "isDelete": false,
    "Record": {
      "objectType": "E_Meter",
      "e_meter_ID": "",
      "owner_ID": "MessBetr1",
      "flat_ID": "FLAT6",
      "energyRessource_ID": "",
      "meter_value": 1838.9713,
      "last_meter_value": 1838.9359,
      "diff_meter_value": 0.035399999999981446,
      "unit": "kWh",
      "updateTS": 1621013100,
      "isActive": true
    }
  },
  {
    "TxId": "bb7c6f077ee325dcf987a75c6ece776b12b4bf91e0656a2ff2c0d1923bba91bd",
    "Key": "E_Meter8",
    "timestamp": 1684788301,
    "isDelete": false,
    "Record": {
      "objectType": "E_Meter",
      "e_meter_ID": "",
      "owner_ID": "MessBetr1",
      "flat_ID": "FLAT6",
      "energyRessource_ID": "",
      "meter_value": 1838.9359,
      "last_meter_value": 1838.8997,
      "diff_meter_value": 0.036200000000008004,
      "unit": "kWh",
      "updateTS": 1621012800,
      "isActive": true
    }
  },
  {
    "TxId": "34518c094af776b54a75914b20fa069951726fbde8caf0171ca98cb4b957c43a",
    "Key": "E_Meter8",
    "timestamp": 1684788286,
    "isDelete": false,
    "Record": {
      "objectType": "E_Meter",
      "e_meter_ID": "",
      "owner_ID": "MessBetr1",
      "flat_ID": "FLAT6",
      "energyRessource_ID": "",
      "meter_value": 1838.8997,
      "last_meter_value": 1838.8628,
      "diff_meter_value": 0.03689999999983229,
      "unit": "kWh",
      "updateTS": 1621012500,
      "isActive": true
    }
  },
  {
    "TxId": "c23118eb662e44a3dc70b6dd7908f5477d777ea42ead53acfeae50dd6f572d79",
    "Key": "E_Meter8",
    "timestamp": 1684788270,
    "isDelete": false,
    "Record": {
      "objectType": "E_Meter",
      "e_meter_ID": "",
      "owner_ID": "MessBetr1",
      "flat_ID": "FLAT6",
      "energyRessource_ID": "",
      "meter_value": 1838.8628,
      "last_meter_value": 1838.8109,
      "diff_meter_value": 0.05190000000015971,
      "unit": "kWh",
      "updateTS": 1621012200,
      "isActive": true
    }
  },
  {
    "TxId": "cb663c76484fed0ab02980b0b557d2479215b03f5ef7ea12795c42d1003cc881",
    "Key": "E_Meter8",
    "timestamp": 1684788255,
    "isDelete": false,
    "Record": {
      "objectType": "E_Meter",
      "e_meter_ID": "",
      "owner_ID": "MessBetr1",
      "flat_ID": "FLAT6",
      "energyRessource_ID": "",
      "meter_value": 1838.8109,
      "last_meter_value": 1838.7502,
      "diff_meter_value": 0.06069999999999709,
      "unit": "kWh",
      "updateTS": 1621011900,
      "isActive": true
    }
  },
  {
    "TxId": "a9b2cbf9ab08888534822875c0f2f2b65b59da8689cf8a00a0a5c76a0d2e24d5",
    "Key": "E_Meter8",
    "timestamp": 1684788239,
    "isDelete": false,
    "Record": {
      "objectType": "E_Meter",
      "e_meter_ID": "",
      "owner_ID": "MessBetr1",
      "flat_ID": "FLAT6",
      "energyRessource_ID": "",
      "meter_value": 1838.7502,
      "last_meter_value": 1838.5765,
      "diff_meter_value": 0.17370000000005348,
      "unit": "kWh",
      "updateTS": 1621011600,
      "isActive": true
    }
  },
  {
    "TxId": "79caae66ca4eca4bcbb75bae037b1a3bae6105e61bdb052dee0255540809dc33",
    "Key": "E_Meter8",
    "timestamp": 1684788224,
    "isDelete": false,
    "Record": {
      "objectType": "E_Meter",
      "e_meter_ID": "",
      "owner_ID": "MessBetr1",
      "flat_ID": "FLAT6",
      "energyRessource_ID": "",
      "meter_value": 1838.5765,
      "last_meter_value": 1838.4377,
      "diff_meter_value": 0.13879999999994652,
      "unit": "kWh",
      "updateTS": 1621011300,
      "isActive": true
    }
  },
  {
    "TxId": "02f95169fac312b16fb43e6c8bc523c11743762aa291932dc7e2989f31a785a4",
    "Key": "E_Meter8",
    "timestamp": 1684788209,
    "isDelete": false,
    "Record": {
      "objectType": "E_Meter",
      "e_meter_ID": "",
      "owner_ID": "MessBetr1",
      "flat_ID": "FLAT6",
      "energyRessource_ID": "",
      "meter_value": 1838.4377,
      "last_meter_value": 1838.1753,
      "diff_meter_value": 0.2623999999998432,
      "unit": "kWh",
      "updateTS": 1621011000,
      "isActive": true
    }
  },
  {
    "TxId": "a7dd7567ba7dd593024c68a1bcef4471ca5b35f29597667642632cd9db32ed65",
    "Key": "E_Meter8",
    "timestamp": 1684788193,
    "isDelete": false,
    "Record": {
      "objectType": "E_Meter",
      "e_meter_ID": "",
      "owner_ID": "MessBetr1",
      "flat_ID": "FLAT6",
      "energyRessource_ID": "",
      "meter_value": 1838.1753,
      "last_meter_value": 1837.9583,
      "diff_meter_value": 0.21700000000009823,
      "unit": "kWh",
      "updateTS": 1621010700,
      "isActive": true
    }
  },
  {
    "TxId": "b82bc369abdc0bcae9a6011fc0ad730a050ef805bf991784eb8798413e5197f0",
    "Key": "E_Meter8",
    "timestamp": 1684788178,
    "isDelete": false,
    "Record": {
      "objectType": "E_Meter",
      "e_meter_ID": "",
      "owner_ID": "MessBetr1",
      "flat_ID": "FLAT6",
      "energyRessource_ID": "",
      "meter_value": 1837.9583,
      "last_meter_value": 1837.7396,
      "diff_meter_value": 0.21869999999989886,
      "unit": "kWh",
      "updateTS": 1621010400,
      "isActive": true
    }
  },
  {
    "TxId": "bebd13d11c159e96a661f37950572899f69445b10a5086c122032e770c1ef47d",
    "Key": "E_Meter8",
    "timestamp": 1684788162,
    "isDelete": false,
    "Record": {
      "objectType": "E_Meter",
      "e_meter_ID": "",
      "owner_ID": "MessBetr1",
      "flat_ID": "FLAT6",
      "energyRessource_ID": "",
      "meter_value": 1837.7396,
      "last_meter_value": 1837.5344,
      "diff_meter_value": 0.2052000000001044,
      "unit": "kWh",
      "updateTS": 1621010100,
      "isActive": true
    }
  },
  {
    "TxId": "906cca19b168396d3be7af17367dc8a0876337a11d252eb73312e0ec12f8f39d",
    "Key": "E_Meter8",
    "timestamp": 1684788147,
    "isDelete": false,
    "Record": {
      "objectType": "E_Meter",
      "e_meter_ID": "",
      "owner_ID": "MessBetr1",
      "flat_ID": "FLAT6",
      "energyRessource_ID": "",
      "meter_value": 1837.5344,
      "last_meter_value": 1837.2109,
      "diff_meter_value": 0.32349999999996726,
      "unit": "kWh",
      "updateTS": 1621009800,
      "isActive": true
    }
  },
  {
    "TxId": "4eb917c5bb93cdf37a68223df4741127f84c24ccfca367086094f65a6724ae1f",
    "Key": "E_Meter8",
    "timestamp": 1684788132,
    "isDelete": false,
    "Record": {
      "objectType": "E_Meter",
      "e_meter_ID": "",
      "owner_ID": "MessBetr1",
      "flat_ID": "FLAT6",
      "energyRessource_ID": "",
      "meter_value": 1837.2109,
      "last_meter_value": 1836.9015,
      "diff_meter_value": 0.30940000000009604,
      "unit": "kWh",
      "updateTS": 1621009500,
      "isActive": true
    }
  },
  {
    "TxId": "009eaaea02aeff95277ba7c81dab4ba6a71ce2c48b4256bca4a3268222f66514",
    "Key": "E_Meter8",
    "timestamp": 1684788116,
    "isDelete": false,
    "Record": {
      "objectType": "E_Meter",
      "e_meter_ID": "",
      "owner_ID": "MessBetr1",
      "flat_ID": "FLAT6",
      "energyRessource_ID": "",
      "meter_value": 1836.9015,
      "last_meter_value": 1836.5992,
      "diff_meter_value": 0.3022999999998319,
      "unit": "kWh",
      "updateTS": 1621009200,
      "isActive": true
    }
  },
  {
    "TxId": "4f51740c7d3a4f02fbda8a71628711b043c7afcadba9eca7a2b45eaf8f614237",
    "Key": "E_Meter8",
    "timestamp": 1684788100,
    "isDelete": false,
    "Record": {
      "objectType": "E_Meter",
      "e_meter_ID": "",
      "owner_ID": "MessBetr1",
      "flat_ID": "FLAT6",
      "energyRessource_ID": "",
      "meter_value": 1836.5992,
      "last_meter_value": 1836.3497,
      "diff_meter_value": 0.2495000000001255,
      "unit": "kWh",
      "updateTS": 1621008900,
      "isActive": true
    }
  },
  {
    "TxId": "12912e66a2b0ff60f5d6bfefa279a975b48e184b93c8b1f8bbcbaea807d90c13",
    "Key": "E_Meter8",
    "timestamp": 1684788086,
    "isDelete": false,
    "Record": {
      "objectType": "E_Meter",
      "e_meter_ID": "",
      "owner_ID": "MessBetr1",
      "flat_ID": "FLAT6",
      "energyRessource_ID": "",
      "meter_value": 1836.3497,
      "last_meter_value": 1836.0281,
      "diff_meter_value": 0.32159999999998945,
      "unit": "kWh",
      "updateTS": 1621008600,
      "isActive": true
    }
  },
  {
    "TxId": "94d6fcded382cf61b01d70c03f68fe2e62854503e9177f22d5b3f37f44837ca0",
    "Key": "E_Meter8",
    "timestamp": 1684788070,
    "isDelete": false,
    "Record": {
      "objectType": "E_Meter",
      "e_meter_ID": "",
      "owner_ID": "MessBetr1",
      "flat_ID": "FLAT6",
      "energyRessource_ID": "",
      "meter_value": 1836.0281,
      "last_meter_value": 1835.598,
      "diff_meter_value": 0.43010000000003856,
      "unit": "kWh",
      "updateTS": 1621008300,
      "isActive": true
    }
  },
  {
    "TxId": "78c6a0e1b7e484139bd2ff0b29e56dc696f1aaf8525ce0bec2502ad5c68fd3fa",
    "Key": "E_Meter8",
    "timestamp": 1684788055,
    "isDelete": false,
    "Record": {
      "objectType": "E_Meter",
      "e_meter_ID": "",
      "owner_ID": "MessBetr1",
      "flat_ID": "FLAT6",
      "energyRessource_ID": "",
      "meter_value": 1835.598,
      "last_meter_value": 1835.1259,
      "diff_meter_value": 0.4720999999999549,
      "unit": "kWh",
      "updateTS": 1621008000,
      "isActive": true
    }
  },
  {
    "TxId": "6f67fc06714486c7bb675d78df2c8c00467c7bf97548566a821776e518ae0c8d",
    "Key": "E_Meter8",
    "timestamp": 1684788039,
    "isDelete": false,
    "Record": {
      "objectType": "E_Meter",
      "e_meter_ID": "",
      "owner_ID": "MessBetr1",
      "flat_ID": "FLAT6",
      "energyRessource_ID": "",
      "meter_value": 1835.1259,
      "last_meter_value": 1834.7479,
      "diff_meter_value": 0.37799999999992906,
      "unit": "kWh",
      "updateTS": 1621007700,
      "isActive": true
    }
  },
  {
    "TxId": "53b9edf35d9e2569243471a843a3e3e8a278819b00e0799cecce75484cb4d249",
    "Key": "E_Meter8",
    "timestamp": 1684788024,
    "isDelete": false,
    "Record": {
      "objectType": "E_Meter",
      "e_meter_ID": "",
      "owner_ID": "MessBetr1",
      "flat_ID": "FLAT6",
      "energyRessource_ID": "",
      "meter_value": 1834.7479,
      "last_meter_value": 1834.495,
      "diff_meter_value": 0.25290000000018154,
      "unit": "kWh",
      "updateTS": 1621007400,
      "isActive": true
    }
  },
  {
    "TxId": "4a1038649815d2bfc2114afe44d5b8a3d3e5ade042a1f0473e7540ea7bc09f79",
    "Key": "E_Meter8",
    "timestamp": 1684788009,
    "isDelete": false,
    "Record": {
      "objectType": "E_Meter",
      "e_meter_ID": "",
      "owner_ID": "MessBetr1",
      "flat_ID": "FLAT6",
      "energyRessource_ID": "",
      "meter_value": 1834.495,
      "last_meter_value": 1834.0835,
      "diff_meter_value": 0.4114999999999327,
      "unit": "kWh",
      "updateTS": 1621007100,
      "isActive": true
    }
  },
  {
    "TxId": "aefbf2f69a50d615a8bdd1454470e109a08094d3d30ef4ba295e7b0fc7fce0ff",
    "Key": "E_Meter8",
    "timestamp": 1684787993,
    "isDelete": false,
    "Record": {
      "objectType": "E_Meter",
      "e_meter_ID": "",
      "owner_ID": "MessBetr1",
      "flat_ID": "FLAT6",
      "energyRessource_ID": "",
      "meter_value": 1834.0835,
      "last_meter_value": 1833.8961,
      "diff_meter_value": 0.1874000000000251,
      "unit": "kWh",
      "updateTS": 1621006800,
      "isActive": true
    }
  },
  {
    "TxId": "1d0a51a7a838ea76131391ee96cfd2653b460530ff6eb39fab40fe33b8f4129f",
    "Key": "E_Meter8",
    "timestamp": 1684787977,
    "isDelete": false,
    "Record": {
      "objectType": "E_Meter",
      "e_meter_ID": "",
      "owner_ID": "MessBetr1",
      "flat_ID": "FLAT6",
      "energyRessource_ID": "",
      "meter_value": 1833.8961,
      "last_meter_value": 1833.873,
      "diff_meter_value": 0.023099999999885767,
      "unit": "kWh",
      "updateTS": 1621006500,
      "isActive": true
    }
  },
  {
    "TxId": "6d7ff530967451c61364991530d646d9043b5465cc80bb7eb91eb63221c52a65",
    "Key": "E_Meter8",
    "timestamp": 1684787961,
    "isDelete": false,
    "Record": {
      "objectType": "E_Meter",
      "e_meter_ID": "",
      "owner_ID": "MessBetr1",
      "flat_ID": "FLAT6",
      "energyRessource_ID": "",
      "meter_value": 1833.873,
      "last_meter_value": 1833.8499,
      "diff_meter_value": 0.02310000000011314,
      "unit": "kWh",
      "updateTS": 1621006200,
      "isActive": true
    }
  },
  {
    "TxId": "068a811ab6a3a394a9dfeb6c038b0aac72430ca3cecd1d2456b97f5d99368742",
    "Key": "E_Meter8",
    "timestamp": 1684787945,
    "isDelete": false,
    "Record": {
      "objectType": "E_Meter",
      "e_meter_ID": "",
      "owner_ID": "MessBetr1",
      "flat_ID": "FLAT6",
      "energyRessource_ID": "",
      "meter_value": 1833.8499,
      "last_meter_value": 1833.8267,
      "diff_meter_value": 0.023199999999860665,
      "unit": "kWh",
      "updateTS": 1621005900,
      "isActive": true
    }
  },
  {
    "TxId": "3b75df55b0892801d7bc3ad129b9328eb773db0cec220e51844b85e3e391e284",
    "Key": "E_Meter8",
    "timestamp": 1684787930,
    "isDelete": false,
    "Record": {
      "objectType": "E_Meter",
      "e_meter_ID": "",
      "owner_ID": "MessBetr1",
      "flat_ID": "FLAT6",
      "energyRessource_ID": "",
      "meter_value": 1833.8267,
      "last_meter_value": 1833.8018,
      "diff_meter_value": 0.02490000000011605,
      "unit": "kWh",
      "updateTS": 1621005600,
      "isActive": true
    }
  },
  {
    "TxId": "0a266b5bfbf2aec7f3552ced60d5f0484c6e50e0d0c1e8a3d1763238d4f211f8",
    "Key": "E_Meter8",
    "timestamp": 1684787915,
    "isDelete": false,
    "Record": {
      "objectType": "E_Meter",
      "e_meter_ID": "",
      "owner_ID": "MessBetr1",
      "flat_ID": "FLAT6",
      "energyRessource_ID": "",
      "meter_value": 1833.8018,
      "last_meter_value": 1833.7806,
      "diff_meter_value": 0.02119999999990796,
      "unit": "kWh",
      "updateTS": 1621005300,
      "isActive": true
    }
  },
  {
    "TxId": "1b27c65ab0f5a845b442de254a4bc764a13042c7aa5e6de52714d0af201cfc4b",
    "Key": "E_Meter8",
    "timestamp": 1684787899,
    "isDelete": false,
    "Record": {
      "objectType": "E_Meter",
      "e_meter_ID": "",
      "owner_ID": "MessBetr1",
      "flat_ID": "FLAT6",
      "energyRessource_ID": "",
      "meter_value": 1833.7806,
      "last_meter_value": 1833.7628,
      "diff_meter_value": 0.017800000000079308,
      "unit": "kWh",
      "updateTS": 1621005000,
      "isActive": true
    }
  },
  {
    "TxId": "385cbb81651fae376a1ee0a67e4fc2d1753575ec102cdef041ee101df2e27699",
    "Key": "E_Meter8",
    "timestamp": 1684787884,
    "isDelete": false,
    "Record": {
      "objectType": "E_Meter",
      "e_meter_ID": "",
      "owner_ID": "MessBetr1",
      "flat_ID": "FLAT6",
      "energyRessource_ID": "",
      "meter_value": 1833.7628,
      "last_meter_value": 1833.7506,
      "diff_meter_value": 0.012199999999893407,
      "unit": "kWh",
      "updateTS": 1621004700,
      "isActive": true
    }
  },
  {
    "TxId": "740bd30d753fbd51ab02b053caea389d13f13603785d81f00a43488705393289",
    "Key": "E_Meter8",
    "timestamp": 1684787868,
    "isDelete": false,
    "Record": {
      "objectType": "E_Meter",
      "e_meter_ID": "",
      "owner_ID": "MessBetr1",
      "flat_ID": "FLAT6",
      "energyRessource_ID": "",
      "meter_value": 1833.7506,
      "last_meter_value": 1833.7336,
      "diff_meter_value": 0.01700000000005275,
      "unit": "kWh",
      "updateTS": 1621004400,
      "isActive": true
    }
  },
  {
    "TxId": "41e18e3275ec4e68dcc2217b08fb2e3078a1bbacea275ef90e5b5b4d8571fd12",
    "Key": "E_Meter8",
    "timestamp": 1684787852,
    "isDelete": false,
    "Record": {
      "objectType": "E_Meter",
      "e_meter_ID": "",
      "owner_ID": "MessBetr1",
      "flat_ID": "FLAT6",
      "energyRessource_ID": "",
      "meter_value": 1833.7336,
      "last_meter_value": 1833.7161,
      "diff_meter_value": 0.01749999999992724,
      "unit": "kWh",
      "updateTS": 1621004100,
      "isActive": true
    }
  },
  {
    "TxId": "56746260fef09fd8c97183e55c26543d6a86f3c05959cecc2eff05de4342214d",
    "Key": "E_Meter8",
    "timestamp": 1684787837,
    "isDelete": false,
    "Record": {
      "objectType": "E_Meter",
      "e_meter_ID": "",
      "owner_ID": "MessBetr1",
      "flat_ID": "FLAT6",
      "energyRessource_ID": "",
      "meter_value": 1833.7161,
      "last_meter_value": 1833.7,
      "diff_meter_value": 0.016100000000051296,
      "unit": "kWh",
      "updateTS": 1621003800,
      "isActive": true
    }
  },
  {
    "TxId": "839750d3f23f6fed900546eb04ea1fb620fca60de64982d937ea33d02138610a",
    "Key": "E_Meter8",
    "timestamp": 1684787821,
    "isDelete": false,
    "Record": {
      "objectType": "E_Meter",
      "e_meter_ID": "",
      "owner_ID": "MessBetr1",
      "flat_ID": "FLAT6",
      "energyRessource_ID": "",
      "meter_value": 1833.7,
      "last_meter_value": 1833.684,
      "diff_meter_value": 0.016000000000076398,
      "unit": "kWh",
      "updateTS": 1621003500,
      "isActive": true
    }
  },
  {
    "TxId": "aa3ba34b24cfc0203fae160b57ef65f92e06544e82109bee77888331c985c1f5",
    "Key": "E_Meter8",
    "timestamp": 1684787806,
    "isDelete": false,
    "Record": {
      "objectType": "E_Meter",
      "e_meter_ID": "",
      "owner_ID": "MessBetr1",
      "flat_ID": "FLAT6",
      "energyRessource_ID": "",
      "meter_value": 1833.684,
      "last_meter_value": 1833.6682,
      "diff_meter_value": 0.015799999999899228,
      "unit": "kWh",
      "updateTS": 1621003200,
      "isActive": true
    }
  },
  {
    "TxId": "7be5e184818a53d8ab64ecfe5c36718e2e24367fd24ec44bdcb1d9895f44f02e",
    "Key": "E_Meter8",
    "timestamp": 1684787790,
    "isDelete": false,
    "Record": {
      "objectType": "E_Meter",
      "e_meter_ID": "",
      "owner_ID": "MessBetr1",
      "flat_ID": "FLAT6",
      "energyRessource_ID": "",
      "meter_value": 1833.6682,
      "last_meter_value": 1833.6523,
      "diff_meter_value": 0.0159000000001015,
      "unit": "kWh",
      "updateTS": 1621002900,
      "isActive": true
    }
  },
  {
    "TxId": "d6b3920de0b07953ecdd8d5dddb611e1d8e379ce770649606fbbd9dc484e448b",
    "Key": "E_Meter8",
    "timestamp": 1684787775,
    "isDelete": false,
    "Record": {
      "objectType": "E_Meter",
      "e_meter_ID": "",
      "owner_ID": "MessBetr1",
      "flat_ID": "FLAT6",
      "energyRessource_ID": "",
      "meter_value": 1833.6523,
      "last_meter_value": 1833.6359,
      "diff_meter_value": 0.01639999999997599,
      "unit": "kWh",
      "updateTS": 1621002600,
      "isActive": true
    }
  },
  {
    "TxId": "55fe542d042ad974eb0d2b50ee360130f0a04487d5ca9ca70eb8d3f98df99136",
    "Key": "E_Meter8",
    "timestamp": 1684787759,
    "isDelete": false,
    "Record": {
      "objectType": "E_Meter",
      "e_meter_ID": "",
      "owner_ID": "MessBetr1",
      "flat_ID": "FLAT6",
      "energyRessource_ID": "",
      "meter_value": 1833.6359,
      "last_meter_value": 1833.6193,
      "diff_meter_value": 0.016599999999925785,
      "unit": "kWh",
      "updateTS": 1621002300,
      "isActive": true
    }
  },
  {
    "TxId": "8ecb2d47392a0df09462ce2ecf8262d0e1f3e76bbef3894652ee8e397af9e715",
    "Key": "E_Meter8",
    "timestamp": 1684787744,
    "isDelete": false,
    "Record": {
      "objectType": "E_Meter",
      "e_meter_ID": "",
      "owner_ID": "MessBetr1",
      "flat_ID": "FLAT6",
      "energyRessource_ID": "",
      "meter_value": 1833.6193,
      "last_meter_value": 1833.6029,
      "diff_meter_value": 0.01639999999997599,
      "unit": "kWh",
      "updateTS": 1621002000,
      "isActive": true
    }
  },
  {
    "TxId": "27668dcfb7f148250104c13a3368378bde2243850f46b8649cc57b3371ab511a",
    "Key": "E_Meter8",
    "timestamp": 1684787728,
    "isDelete": false,
    "Record": {
      "objectType": "E_Meter",
      "e_meter_ID": "",
      "owner_ID": "MessBetr1",
      "flat_ID": "FLAT6",
      "energyRessource_ID": "",
      "meter_value": 1833.6029,
      "last_meter_value": 1833.5863,
      "diff_meter_value": 0.01660000000015316,
      "unit": "kWh",
      "updateTS": 1621001700,
      "isActive": true
    }
  },
  {
    "TxId": "3828d3e400daaa5b27fdfe01154f9deab979e127b83dcff5b3586832e3cbe624",
    "Key": "E_Meter8",
    "timestamp": 1684787712,
    "isDelete": false,
    "Record": {
      "objectType": "E_Meter",
      "e_meter_ID": "",
      "owner_ID": "MessBetr1",
      "flat_ID": "FLAT6",
      "energyRessource_ID": "",
      "meter_value": 1833.5863,
      "last_meter_value": 1833.571,
      "diff_meter_value": 0.015300000000024738,
      "unit": "kWh",
      "updateTS": 1621001400,
      "isActive": true
    }
  },
  {
    "TxId": "0cba69d2f2966b823474723a2bb441293dd96942a441d1a27ccab82e0674af8a",
    "Key": "E_Meter8",
    "timestamp": 1684787697,
    "isDelete": false,
    "Record": {
      "objectType": "E_Meter",
      "e_meter_ID": "",
      "owner_ID": "MessBetr1",
      "flat_ID": "FLAT6",
      "energyRessource_ID": "",
      "meter_value": 1833.571,
      "last_meter_value": 1833.5354,
      "diff_meter_value": 0.03559999999993124,
      "unit": "kWh",
      "updateTS": 1621001100,
      "isActive": true
    }
  },
  {
    "TxId": "2a702fe2411c4fbede6761ae17c0247f0d0f639b0ca995224c587ed1c00a0769",
    "Key": "E_Meter8",
    "timestamp": 1684787682,
    "isDelete": false,
    "Record": {
      "objectType": "E_Meter",
      "e_meter_ID": "",
      "owner_ID": "MessBetr1",
      "flat_ID": "FLAT6",
      "energyRessource_ID": "",
      "meter_value": 1833.5354,
      "last_meter_value": 1833.5175,
      "diff_meter_value": 0.017900000000054206,
      "unit": "kWh",
      "updateTS": 1621000800,
      "isActive": true
    }
  },
  {
    "TxId": "d53011887964cc893707ab1b76de81409879d4e2b8e180ab09ddddc0b85d59c1",
    "Key": "E_Meter8",
    "timestamp": 1684787666,
    "isDelete": false,
    "Record": {
      "objectType": "E_Meter",
      "e_meter_ID": "",
      "owner_ID": "MessBetr1",
      "flat_ID": "FLAT6",
      "energyRessource_ID": "",
      "meter_value": 1833.5175,
      "last_meter_value": 1833.4983,
      "diff_meter_value": 0.019199999999955253,
      "unit": "kWh",
      "updateTS": 1621000500,
      "isActive": true
    }
  },
  {
    "TxId": "1d364acd425ca41a698ed8a03a2b007855e3f2e18496f6ba76d971d3663cb9e4",
    "Key": "E_Meter8",
    "timestamp": 1684787651,
    "isDelete": false,
    "Record": {
      "objectType": "E_Meter",
      "e_meter_ID": "",
      "owner_ID": "MessBetr1",
      "flat_ID": "FLAT6",
      "energyRessource_ID": "",
      "meter_value": 1833.4983,
      "last_meter_value": 1833.3878,
      "diff_meter_value": 0.11050000000000182,
      "unit": "kWh",
      "updateTS": 1621000200, 14.05.21 15:50,
      "isActive": true
    }
  }
]
