   ___               _
  / __|  _  _   ___ | |_   ___   _ __    ___   _ _
 | (__  | || | (_-< |  _| / _ \ | '  \  / -_) | '_|
  \___|  \_,_| /__/  \__| \___/ |_|_|_| \___| |_|

${application.title} ${application.version}
Powered by Spring Boot ${spring-boot.version}