{
  "container": "ubuntu-20.04",
  "envsetup": "poky/oe-init-build-env",
  "distro": "poky",
  "machine": "qemux86-64",
  "target": "core-image-minimal",
  "sources": {
    "git_trees": [
      {
        "url": "git://git.yoctoproject.org/poky",
        "branch": "honister"
      }
    ]
  }
}
