{
  "container": "ubuntu-20.04",
  "distro": "rpb",
  "envsetup": "setup-environment",
  "machine": "dragonboard-845c",
  "sources": {
    "repo": {
      "branch": "qcom/honister",
      "manifest": "default.xml",
      "url": "https://github.com/96boards/oe-rpb-manifest.git"
    }
  },
  "targets": [ "core-image-minimal rpb-console-image", "-c populate_sdk core-image-minimal"]
}
