"102.8042","41.564594","857089","0.1945259"
"102.8042","41.564594","857090","0.1945259"
"102.62418","41.08454","857123","0.31867057"
"102.61418","40.134434","857156","0.52297163"
"101.84407","38.544262","857206","0.6236559"
"101.56403","37.88419","857223","0.6480938"
"101.14398","36.874077","857240","0.6813294"
"100.82394","36.09399","857256","0.6930596"
"100.41388","35.243896","857273","0.69403714"
"100.00383","34.443806","857290","0.69403714"
"99.54376","33.543705","857306","0.68328446"
"98.823654","32.34358","857323","0.72043014"
"98.34359","31.56349","857340","0.71358746"
"97.92353","30.633387","857356","0.7047898"
"97.51347","29.66328","857373","0.69403714"
"96.90339","28.483149","857390","0.68230695"
"96.413315","27.67306","857406","0.67155427"
"95.953255","26.872972","857423","0.6901271"
"95.61321","26.162891","857440","0.71163243"
"95.24316","25.50282","857456","0.70576733"
"94.62308","24.532713","857473","0.6969697"
"94.123","23.97265","857490","0.6920821"
"93.65294","23.482595","857506","0.69403714"
"93.212875","22.88253","857523","0.6989247"
"92.69281","22.132446","857540","0.6979472"
"90.16246","19.272131","857606","0.6959922"
"89.43236","18.212013","857623","0.67057675"
"88.93229","17.511936","857640","0.66373414"
"88.47222","16.811857","857656","0.6627566"
"88.02216","16.151785","857673","0.6617791"
"87.572105","15.521716","857690","0.6617791"
"86.852","14.511603","857706","0.6617791"
"86.36193","13.811526","857723","0.6539589"
"85.88187","13.191458","857740","0.6363636"
"85.4218","12.541387","857756","0.62463343"
"84.93174","11.831307","857773","0.6226784"
"84.04162","10.981215","857790","0.6168133"
"83.48154","10.461157","857806","0.61485827"
"83.24151","10.191126","857823","0.6119257"
"82.78144","9.631064","857840","0.60801566"
"81.88132","8.800973","857856","0.6226784"
"81.42125","8.59095","857873","0.6353861"
"80.93118","8.440932","857890","0.629521"
"80.45111","8.2409115","857905","0.62463343"
"80.011055","8.100895","857923","0.6236559"
"79.550995","7.9908834","857940","0.5982405"
"79.06093","7.9008737","857956","0.57478005"
"78.55086","7.8208647","857973","0.57478005"
"78.06078","7.7808604","857990","0.572825"
"77.62073","7.700851","858006","0.57087"
"77.21067","7.6608467","858023","0.56891495"
"76.630585","7.6408453","858040","0.55718476"
"76.23053","7.750857","858056","0.53372437"
"75.81048","7.9008737","858073","0.52297163"
"75.2604","7.9508786","858090","0.52492666"
"74.820335","8.060891","858106","0.5650049"
"74.820335","8.060891","858123","0.6031281"
"74.410286","8.280915","858140","0.5982405"
"74.410286","8.280915","858156","0.59433043"
"74.26026","8.730966","858167","0.59237534"
"74.23026","9.151012","858190","0.55718476"
"74.23026","9.541055","858206","0.52297163"
"74.26026","9.971102","858223","0.52394915"
"74.530304","10.691182","858240","0.5259042"
"74.79034","11.221241","858256","0.5259042"
"75.06037","11.881313","858273","0.5268817"
"75.36041","12.611394","858290","0.5268817"
"75.66045","13.21146","858306","0.5474096"
"76.13052","14.001547","858323","0.56304985"
"76.430565","14.511603","858340","0.57087"
"76.76061","15.041663","858356","0.5913978"
"77.11066","15.651729","858373","0.597263"
"77.49071","16.2818","858390","0.597263"
"78.04079","17.171898","858406","0.6001955"
"78.36083","17.73196","858423","0.60117304"
"78.66087","18.212013","858440","0.60117304"
"78.960915","18.622059","858456","0.6099707"
"79.46098","19.302134","858473","0.62658846"
"79.751015","19.772184","858490","0.6344086"
"80.011055","20.232237","858506","0.6363636"
"80.25109","20.662283","858523","0.63734114"
"80.50112","21.092333","858540","0.63831866"
"80.90118","21.762407","858556","0.6412512"
"81.19122","22.192453","858573","0.64320624"
"81.451256","22.652506","858590","0.6461388"
"81.691284","23.112555","858606","0.64907134"
"82.031334","23.652613","858623","0.6520039"
"82.27137","23.912643","858640","0.65493643"
"82.5214","24.162672","858656","0.65102637"
"83.471535","25.332802","858723","0.65591395"
"83.65156","25.552824","858740","0.65884656"
"83.74158","25.702839","858756","0.6608016"
"84.03162","26.172894","858773","0.6627566"
"84.24164","26.50293","858790","0.66373414"
"84.41167","26.842968","858806","0.6666667"
"84.59169","27.153002","858823","0.6686217"
"84.76172","27.423033","858840","0.6608016"
"84.92174","27.79307","858856","0.6402737"
"85.03175","28.153114","858873","0.6451613"
"85.13176","28.523153","858890","0.6480938"
"85.23178","28.85319","858906","0.65102637"
"85.29179","29.183226","858923","0.65591395"
"85.331795","29.723286","858940","0.6617791"
"85.29179","30.053322","858956","0.6676442"
"85.22178","30.363356","858973","0.67155427"
"85.10176","30.653389","858990","0.67644185"
"84.96174","30.913416","859006","0.6813294"
"84.6717","31.38347","859023","0.68914956"
"84.41167","31.703503","859040","0.6930596"
"84.14163","32.01354","859056","0.69501466"
"83.851585","32.28357","859073","0.69990224"
"83.41152","32.973644","859090","0.686217"
"83.14149","33.36369","859106","0.6735093"
"82.90146","33.683723","859123","0.6803519"
"82.671425","33.99376","859140","0.68328446"
"82.461395","34.313793","859156","0.6871945"
"82.18136","34.993866","859173","0.69501466"
"82.07134","35.533928","859190","0.6969697"
"81.93132","35.943974","859206","0.6989247"
"81.80131","36.344017","859223","0.7028348"
"81.581276","36.934082","859240","0.70674485"
"81.46126","37.324127","859256","0.70772237"
"81.31123","37.684162","859273","0.7086999"
"81.0712","37.964195","859290","0.71260995"
"80.81117","38.29423","859306","0.72043014"
"80.601135","38.8743","859323","0.6979472"
"80.57114","39.00431","859339","0.69990224"
"80.55113","39.00431","859356","0.70185727"
"80.55113","39.00431","859373","0.7038123"
"80.55113","39.00431","859386","0.70674485"
"80.55113","39.00431","859406","0.70772237"
"80.55113","38.894302","859423","0.7096774"
"80.55113","38.72428","859439","0.7106549"
"80.67115","38.384243","859456","0.7096774"
"80.82117","37.604156","859473","0.7302053"
"81.0612","37.224113","859489","0.72727275"
"81.281235","36.83407","859506","0.7253177"
"81.42125","36.494034","859523","0.72238517"
"81.48126","36.173996","859539","0.7194526"
"81.67129","35.713947","859556","0.71847504"
"81.7813","35.223892","859573","0.7155425"
"81.90132","34.733837","859589","0.71358746"
"82.031334","34.443806","859606","0.7106549"
"82.161354","34.22378","859623","0.7096774"
"82.39139","33.873745","859639","0.70772237"
"82.58141","33.603714","859656","0.7047898"
"82.76143","33.29368","859673","0.7028348"
"82.98147","32.93364","859689","0.6911046"
"83.381516","32.39358","859706","0.6813294"
"83.70156","32.083546","859723","0.7086999"
"84.0016","31.863522","859739","0.7350929"
"84.23164","31.643496","859756","0.73216033"
"84.41167","31.433474","859773","0.7292278"
"84.701706","31.143442","859789","0.72825027"
"84.93174","30.95342","859806","0.72727275"
"85.17177","30.773403","859823","0.72727275"
"85.411804","30.58338","859839","0.7253177"
"85.78186","30.363356","859856","0.72238517"
"86.01188","30.253344","859873","0.72043014"
"86.23191","30.183334","859889","0.71847504"
"86.36193","30.13333","859906","0.7174975"
"86.641975","30.063324","859923","0.7155425"
"86.96202","29.983313","859939","0.714565"
"87.18205","29.983313","859956","0.7155425"
"87.45209","30.193336","859973","0.7155425"
"87.78213","30.483372","859989","0.7174975"
"88.18219","30.813404","860006","0.72043014"
"88.85229","31.173449","860023","0.72238517"
"89.27234","31.423471","860039","0.7243402"
"89.662384","31.723509","860056","0.72727275"
"90.022446","32.023537","860073","0.73216033"
"90.61252","32.75362","860089","0.7194526"
"91.03258","33.38369","860106","0.70087975"
"91.46265","33.853745","860123","0.7028348"
"91.83269","34.27379","860139","0.70674485"
"92.14273","34.65383","860156","0.71358746"
"92.6028","35.313904","860173","0.7155425"
"92.94284","35.853966","860189","0.7194526"
"93.3529","36.414024","860206","0.72238517"
"93.822975","36.964085","860223","0.72629523"
"94.28302","37.43414","860239","0.73313785"
"94.89312","38.25423","860256","0.72727275"
"95.26317","38.80429","860273","0.7174975"
"95.64322","39.26434","860289","0.72140765"
"96.02327","39.764397","860306","0.7233627"
"96.683365","40.694496","860323","0.71358746"
"97.093414","41.404575","860339","0.7106549"
"97.483475","42.014645","860356","0.71260995"
"97.93353","42.594707","860373","0.714565"
"98.24357","43.17477","860389","0.72727275"
"99.133705","44.014862","860406","0.7086999"
"99.65378","44.644936","860423","0.70772237"
"100.183846","45.325012","860439","0.70185727"
"100.71392","46.145103","860456","0.6959922"
"101.45402","47.39524","860473","0.69990224"
"101.90408","48.095318","860489","0.7038123"
"102.41415","48.785393","860506","0.70087975"
"102.94422","49.375454","860523","0.70185727"
"103.41429","49.99553","860539","0.7028348"
"104.03437","51.13565","860556","0.7047898"
"104.40443","51.86573","860573","0.70576733"
"104.75448","52.4858","860589","0.70576733"
"105.084526","53.045864","860606","0.7047898"
"105.414566","53.605927","860623","0.69990224"
"105.784615","54.56603","860639","0.6979472"
"106.00465","55.10609","860656","0.6989247"
"106.22468","55.646156","860673","0.6979472"
"106.45472","56.156208","860689","0.6979472"
"106.74475","57.18632","860706","0.6989247"
"106.91478","57.736378","860723","0.7155425"
"107.0948","58.18643","860739","0.7155425"
"107.27482","58.66649","860756","0.7155425"
"107.474846","59.306553","860773","0.7155425"
"107.77489","60.346672","860789","0.71358746"
"108.01493","61.016747","860806","0.71260995"
"108.26496","61.716824","860823","0.71652"
"108.545","62.3969","860839","0.72043014"
"108.795044","62.95696","860856","0.72043014"
"109.14508","63.697037","860873","0.72043014"
"109.35511","64.17709","860889","0.7194526"
"109.55513","64.68716","860906","0.71847504"
"109.81517","65.247215","860923","0.7194526"
"110.34525","66.10731","860939","0.72140765"
"110.635284","66.68737","860956","0.7233627"
"110.945335","67.237434","860973","0.7233627"
"111.26538","67.70749","860989","0.72043014"
"111.60542","68.087524","861006","0.72043014"
"112.17551","68.667595","861023","0.7194526"
"112.65557","69.12764","861039","0.7174975"
"113.11564","69.6477","861056","0.71652"
"113.49569","70.17776","861073","0.71652"
"114.02576","70.84783","861089","0.71163243"
"114.3458","71.19787","861106","0.7096774"
"114.66584","71.52791","861123","0.71163243"
"115.14591","71.837944","861139","0.72238517"
"115.59597","72.047966","861156","0.7302053"
"116.01603","72.18798","861173","0.72727275"
"116.296074","72.247986","861189","0.7253177"
"116.52611","72.287994","861206","0.7233627"
"116.63612","72.287994","861223","0.72140765"
"116.78613","72.26799","861239","0.72140765"
"116.90615","72.18798","861256","0.72140765"
"116.99616","72.047966","861273","0.72238517"
"116.936165","71.717926","861289","0.72238517"
"116.756134","71.4379","861306","0.72140765"
"116.46609","71.01785","861323","0.7233627"
"116.23606","70.66781","861339","0.7253177"
"115.98602","70.25776","861356","0.72727275"
"115.70599","69.81772","861373","0.7292278"
"115.285934","69.37767","861389","0.7194526"
"114.725845","68.747604","861406","0.71260995"
"114.48582","68.30755","861423","0.71358746"
"114.26579","67.8675","861439","0.714565"
"114.05576","67.43746","861456","0.7155425"
"113.86574","66.997406","861473","0.71163243"
"113.6057","66.26733","861489","0.71260995"
"113.45568","65.817276","861506","0.714565"
"113.31566","65.42723","861523","0.7155425"
"113.20565","65.077194","861539","0.71652"
"113.11564","64.60714","861556","0.71652"
"113.07563","64.37711","861573","0.71652"
"113.07563","64.2471","861589","0.71652"
"113.19565","64.2371","861606","0.714565"
"113.32566","64.2271","861623","0.71358746"
"113.64571","64.47713","861639","0.7106549"
"113.90574","64.77716","861656","0.7096774"
"114.185776","65.1772","861673","0.70772237"
"114.48582","65.59725","861689","0.7047898"
"115.12591","66.227325","861706","0.71260995"
"115.59597","66.667366","861723","0.7243402"
"115.90601","67.13741","861739","0.7243402"
"116.20606","67.57747","861756","0.72043014"
"116.49609","67.99752","861773","0.71847504"
"116.95616","68.62759","861789","0.71652"
"117.27621","69.05763","861806","0.714565"
"117.606255","69.40768","861823","0.71260995"
"117.9463","69.6977","861839","0.71163243"
"118.24634","69.917725","861856","0.7096774"
"118.6364","70.11775","861873","0.70772237"
"118.736404","70.11775","861889","0.70674485"
"118.88643","70.13776","861906","0.70674485"
"118.996445","70.15775","861923","0.70772237"
"119.09646","70.10775","861939","0.7086999"
"119.09646","69.757706","861956","0.7086999"
"119.00645","69.347664","861973","0.7106549"
"118.80642","68.85761","861989","0.71260995"
"118.54639","68.377556","862006","0.7155425"
"118.036316","67.69748","862023","0.72140765"
"117.63625","67.20743","862039","0.71847504"
"117.20619","66.667366","862056","0.71847504"
"116.81614","66.12731","862073","0.7243402"
"116.51609","65.59725","862089","0.72629523"
"116.136055","64.81717","862106","0.72825027"
"115.91601","64.347115","862123","0.7302053"
"115.70599","63.89706","862139","0.7311828"
"115.50596","63.447018","862156","0.73216033"
"115.13592","62.846943","862173","0.7243402"
"114.98589","62.50691","862189","0.7194526"
"114.83588","62.16687","862206","0.7096774"
"114.775856","61.876835","862223","0.7047898"
"114.73586","61.736824","862239","0.70576733"
"114.725845","61.416786","862256","0.7047898"
"114.80586","61.306778","862273","0.7047898"
"114.97589","61.29678","862289","0.70772237"
"115.29594","61.32678","862306","0.71652"
"115.70599","61.796833","862323","0.7233627"
"116.02603","62.286884","862339","0.7253177"
"116.37608","62.71693","862356","0.72238517"
"116.71612","63.08697","862373","0.72043014"
"117.04617","63.447018","862389","0.71847504"
"117.556244","64.04707","862406","0.71652"
"117.9263","64.507126","862423","0.71358746"
"118.28635","64.957184","862439","0.71163243"
"118.64639","65.37723","862456","0.7096774"
"118.996445","65.77727","862473","0.70772237"
"119.52652","66.297325","862489","0.7047898"
"119.86657","66.58736","862506","0.70087975"
"120.1366","66.89739","862523","0.7028348"
"120.37664","67.18742","862539","0.71358746"
"120.886696","67.407455","862556","0.7194526"
"121.25676","67.607475","862573","0.7174975"
"121.6268","67.74749","862589","0.714565"
"121.84684","67.807495","862606","0.71358746"
"122.036865","67.887505","862623","0.71163243"
"122.40691","67.8775","862639","0.71260995"
"122.49693","67.73749","862656","0.71260995"
"122.48692","67.51746","862673","0.714565"
"122.36691","67.107414","862689","0.7096774"
"122.12687","66.52735","862706","0.71163243"
"121.68681","65.70727","862723","0.7194526"
"121.196754","65.1572","862739","0.72238517"
"120.74669","64.55714","862756","0.72043014"
"120.36663","63.927067","862773","0.71260995"
"119.786545","63.036972","862789","0.71260995"
"119.3865","62.53691","862806","0.7155425"
"118.996445","62.036854","862823","0.7174975"
"118.626396","61.586803","862839","0.714565"
"118.35635","61.186764","862856","0.71163243"
"118.146324","60.616703","862873","0.71260995"
"118.116325","60.35667","862889","0.71260995"
"118.09631","60.26666","862906","0.71163243"
"118.12633","60.116642","862923","0.7106549"
"118.446365","60.006638","862939","0.70772237"
"118.736404","60.116642","862956","0.70576733"
"119.146454","60.386673","862973","0.7028348"
"119.61653","60.766716","862989","0.6989247"
"120.0566","61.256775","863006","0.69403714"
"120.55666","62.10687","863023","0.70674485"
"120.93671","62.676926","863039","0.7194526"
"121.45678","63.14698","863056","0.7174975"
"121.77682","63.587032","863073","0.714565"
"122.086876","64.00708","863089","0.71163243"
"122.85697","64.51713","863106","0.70772237"
"123.24703","64.747154","863123","0.71358746"
"123.49706","64.86717","863139","0.72727275"
"123.7571","65.00719","863156","0.73313785"
"124.187164","65.1472","863173","0.7311828"
"124.4272","65.197205","863189","0.7311828"
"124.517204","65.197205","863206","0.7302053"
"124.67724","65.197205","863223","0.7292278"
"124.79724","65.197205","863239","0.7302053"
"124.92727","64.917175","863256","0.73216033"
"124.95727","64.64714","863273","0.73313785"
"124.947266","64.2371","863289","0.7350929"
"124.80724","63.677036","863306","0.73900294"
"124.58722","63.056973","863323","0.7419355"
"124.08716","62.116867","863339","0.7360704"
"123.717094","61.496796","863356","0.72727275"
"123.387054","60.876728","863373","0.72043014"
"122.977","60.206657","863389","0.71652"
"122.15688","59.16654","863406","0.7243402"
"121.736824","58.52647","863423","0.72825027"
"121.29676","57.97641","863439","0.73216033"
"120.856705","57.40635","863456","0.72238517"
"120.38663","56.806274","863473","0.70772237"
"119.65654","56.0962","863489","0.70576733"
"119.17647","55.63615","863506","0.7096774"
"118.656395","55.136097","863523","0.71260995"
"118.09631","54.61603","863539","0.71652"
"117.17619","53.745945","863556","0.72238517"
"116.65612","53.30589","863573","0.7253177"
"116.186066","52.945854","863589","0.72825027"
"115.745995","52.615818","863606","0.73216033"
"115.25592","52.225773","863623","0.7302053"
"114.45582","51.535698","863639","0.72140765"
"113.96575","51.195656","863656","0.72238517"
"113.45568","50.815617","863673","0.7233627"
"112.91561","50.435574","863689","0.7253177"
"112.34551","49.96552","863706","0.72727275"
"111.50542","49.26544","863723","0.7311828"
"111.00533","48.925407","863739","0.73313785"
"110.555275","48.49536","863756","0.73411536"
"110.0652","48.025307","863773","0.73411536"
"109.2651","47.51525","863789","0.73216033"
"108.80503","47.265224","863806","0.7311828"
"108.32497","46.78517","863823","0.73313785"
"107.784904","46.24511","863839","0.73313785"
"107.26482","45.645046","863856","0.73313785"
"106.53471","44.96497","863873","0.7370479"
"106.084656","44.50492","863889","0.7380254"
"105.64459","43.99486","863906","0.740958"
"105.164536","43.54481","863923","0.74486804"
"104.75448","43.13477","863939","0.7438905"
"104.114395","42.494694","863956","0.7546432"
"103.5043","42.024643","863973","0.7536657"
"102.91422","41.494587","863989","0.7546432"
"102.364136","40.97453","864006","0.7556207"
"101.65404","40.34446","864023","0.7546432"
"101.334","39.91441","864039","0.74486804"
"101.284","39.37435","864056","0.5151515"
"101.11397","38.704277","864071","0.020527858"
"100.6039","37.964195","864121","0.020527858"
"100.6039","37.964195","864121","0.020527858"
