"107.134796","62.55691","274744","0.062561095"
"107.1048","62.4269","274772","0.08211143"
"107.124794","62.176872","274805","0.10459433"
"107.20482","61.89684","274838","0.14662756"
"107.20482","61.746822","274855","0.21309873"
"107.0648","61.45679","274872","0.27663735"
"106.93478","61.066746","274888","0.3264907"
"106.86477","60.79672","274905","0.34995112"
"106.79476","60.51669","274922","0.37634408"
"106.66474","60.14665","274938","0.398827"
"106.424706","59.53658","274955","0.41935483"
"106.28468","59.146534","274972","0.4340176"
"106.15467","58.766502","274988","0.44965786"
"106.01465","58.406456","275005","0.46432063"
"105.874626","58.106426","275022","0.47605082"
"105.70462","57.71638","275038","0.49266863"
"105.48457","57.35634","275055","0.5151515"
"105.284546","56.986305","275072","0.5366569"
"105.164536","56.696266","275088","0.54545456"
"105.04451","56.296223","275105","0.5356794"
"104.604454","55.486134","275138","0.53958946"
"104.474434","55.216106","275155","0.54447705"
"104.34441","54.956074","275172","0.55131966"
"104.184395","54.516026","275188","0.5601173"
"104.08438","54.135986","275205","0.56207234"
"104.024376","53.72594","275222","0.56402737"
"103.95436","53.345894","275238","0.56891495"
"103.85434","53.00586","275255","0.572825"
"103.69432","52.545803","275272","0.5786901"
"103.63432","52.245773","275288","0.58162266"
"103.5343","51.925743","275305","0.5835777"
"103.474304","51.575703","275322","0.58748776"
"103.40428","50.945637","275338","0.6060606"
"103.344284","50.535587","275355","0.59433043"
"103.23426","50.135544","275372","0.5982405"
"103.11425","49.7255","275388","0.60215056"
"103.00423","49.40546","275405","0.6060606"
"102.83421","49.03542","275422","0.6099707"
"102.62418","48.615376","275438","0.6109482"
"102.44416","48.24533","275455","0.61290324"
"102.24413","47.9253","275472","0.6158358"
"102.0541","47.59526","275488","0.6177908"
"101.80407","47.265224","275505","0.62658846"
"101.61404","46.975193","275522","0.6177908"
"101.41402","46.63515","275538","0.62072337"
"101.20399","46.265118","275555","0.6217009"
"100.88394","45.685047","275572","0.6236559"
"100.65391","45.285004","275588","0.62463343"
"100.45388","45.02498","275605","0.62561095"
"100.213844","44.814953","275622","0.6353861"
"99.933815","44.51492","275638","0.64418375"
"99.57376","44.034866","275655","0.6461388"
"99.293724","43.754837","275672","0.6451613"
"99.003685","43.4648","275688","0.6451613"
"98.85366","43.17477","275705","0.6539589"
"98.54362","42.88474","275722","0.65786904"
"98.00354","42.44469","275738","0.65493643"
"97.71351","42.114655","275755","0.6539589"
"97.42346","41.78462","275772","0.6539589"
"97.14342","41.434578","275788","0.65493643"
"96.66335","40.884518","275805","0.65884656"
"96.27331","40.514477","275822","0.66373414"
"95.923256","40.124435","275838","0.66471165"
"95.61321","39.71439","275855","0.6617791"
"95.27316","39.294342","275872","0.6598241"
"94.27303","38.26423","275905","0.65102637"
"93.802956","37.804176","275922","0.6598241"
"93.3329","37.414135","275938","0.6725318"
"92.702805","36.794064","275955","0.6666667"
"92.34276","36.37402","275972","0.6617791"
"92.002716","35.863964","275988","0.65786904"
"91.60266","35.333904","276005","0.65591395"
"91.21261","34.793846","276022","0.6539589"
"90.61252","34.05376","276038","0.6520039"
"90.28247","33.623714","276055","0.6461388"
"89.95244","33.21367","276072","0.6402737"
"89.56238","32.64361","276088","0.6304985"
"89.14232","32.053543","276105","0.6461388"
"88.51224","31.403473","276122","0.6686217"
"88.072174","30.923418","276138","0.6676442"
"87.64212","30.413359","276155","0.6656892"
"87.24206","29.853298","276172","0.6627566"
"86.631966","28.9632","276188","0.65786904"
"86.1219","28.423143","276205","0.65591395"
"85.581825","27.893084","276222","0.65786904"
"85.10176","27.443031","276238","0.6539589"
"84.60169","26.952978","276255","0.67155427"
"83.82159","26.122887","276272","0.6920821"
"83.28151","25.572826","276288","0.6920821"
"82.76143","25.002764","276305","0.6920821"
"82.27137","24.442703","276322","0.6930596"
"81.80131","23.882639","276338","0.6920821"
"81.0412","23.002542","276355","0.6930596"
"80.53113","22.202454","276372","0.6969697"
"80.07107","21.582386","276388","0.6989247"
"79.590996","21.022324","276405","0.6989247"
"78.84089","20.232237","276422","0.6969697"
"78.37083","19.702177","276438","0.6979472"
"77.93077","19.142117","276455","0.6911046"
"77.54072","18.612057","276472","0.67644185"
"77.17066","18.132006","276488","0.6686217"
"76.640594","17.361917","276505","0.6686217"
"76.28054","16.771852","276522","0.6608016"
"75.9505","16.181787","276538","0.6539589"
"75.72047","15.631728","276555","0.6529814"
"75.43043","14.911649","276572","0.65004885"
"75.240395","14.441596","276588","0.65004885"
"75.080376","14.001547","276605","0.6334311"
"74.96036","13.531496","276622","0.62463343"
"74.90035","13.101448","276638","0.6119257"
"74.80034","12.351365","276655","0.5913978"
"74.76033","11.791304","276672","0.5904203"
"74.73032","11.321251","276688","0.5884653"
"74.71033","10.931208","276705","0.58748776"
"74.71033","10.471157","276722","0.5855327"
"74.77033","9.741076","276738","0.58162266"
"74.85035","9.331032","276755","0.61388075"
"74.85035","9.331032","276772","0.6480938"
"74.96036","8.790972","276788","0.6471163"
"75.09038","8.310919","276805","0.61876833"
"75.09038","8.310919","276822","0.56304985"
"75.250404","7.840866","276838","0.5601173"
"75.250404","7.840866","276855","0.5581623"
"75.44042","7.4008183","276872","0.5552297"
"75.44042","7.4008183","276888","0.5493646"
"75.68046","7.0007734","276905","0.5464321"
"75.68046","7.0007734","276922","0.57087"
"76.19054","6.6707373","276938","0.58064514"
"76.19054","6.6707373","276955","0.572825"
"77.07065","6.4707155","276972","0.5796676"
"77.49071","6.500718","276988","0.5786901"
"77.94077","6.550724","277005","0.5767351"
"78.410835","6.6007295","277022","0.5835777"
"78.880905","6.630733","277038","0.58162266"
"79.35096","6.710742","277055","0.5796676"
"79.78102","6.88076","277072","0.5796676"
"80.221085","7.120787","277088","0.57087"
"80.74116","7.370815","277105","0.58748776"
"81.86131","7.5608354","277122","0.6060606"
"82.331375","7.750857","277138","0.61876833"
"82.791435","7.9008737","277155","0.629521"
"83.24151","8.080893","277172","0.627566"
"83.71157","8.32092","277185","0.6285435"
"84.21164","8.630954","277205","0.6119257"
"84.71171","8.980993","277222","0.59628546"
"85.36179","9.511052","277238","0.6001955"
"85.76185","9.861091","277255","0.6050831"
"86.37194","10.541164","277272","0.6168133"
"86.77199","10.981215","277288","0.62463343"
"87.15205","11.541276","277305","0.627566"
"87.5421","12.181346","277322","0.6422287"
"87.97215","12.84142","277338","0.65786904"
"88.68226","13.731519","277355","0.64320624"
"89.15233","14.421594","277372","0.6471163"
"89.59238","15.121671","277388","0.65004885"
"90.022446","15.75174","277405","0.6529814"
"90.71253","16.861864","277422","0.6529814"
"91.1826","17.611946","277438","0.65591395"
"91.68267","18.312023","277455","0.6656892"
"92.13273","18.9921","277472","0.67644185"
"92.52278","19.672174","277488","0.6813294"
"93.17288","20.732292","277505","0.6901271"
"93.62293","21.402367","277521","0.69403714"
"94.073006","22.102446","277538","0.6979472"
"94.52306","22.88253","277555","0.68328446"
"94.96313","23.462593","277571","0.67741936"
"95.42319","24.392696","277588","0.6911046"
"95.753235","25.112774","277605","0.6959922"
"96.12328","25.712841","277621","0.6979472"
"96.48333","26.30291","277638","0.7028348"
"97.06341","27.433033","277655","0.6911046"
"97.40346","28.203117","277671","0.67644185"
"97.683495","28.793182","277688","0.684262"
"98.04355","29.393248","277705","0.6901271"
"98.4536","30.203337","277721","0.6989247"
"99.11369","31.263456","277738","0.7096774"
"99.52376","31.833519","277755","0.7174975"
"99.8738","32.363575","277771","0.7243402"
"100.23385","32.94364","277788","0.7292278"
"100.70392","33.903748","277805","0.69990224"
"100.983955","34.413807","277821","0.7047898"
"101.25399","35.01387","277838","0.70576733"
"101.56403","35.633938","277855","0.7047898"
"101.90408","36.224003","277871","0.70772237"
"102.40415","37.044094","277888","0.7106549"
"102.7642","37.584156","277905","0.714565"
"103.03424","38.09421","277921","0.7302053"
"103.42429","38.554264","277938","0.714565"
"103.91437","38.964306","277955","0.6871945"
"104.43443","39.63438","277971","0.6920821"
"104.774475","40.10443","277988","0.6920821"
"105.09451","40.594486","278005","0.6930596"
"105.33456","41.014534","278021","0.6901271"
"105.71461","41.664604","278038","0.6871945"
"106.02466","42.104656","278055","0.686217"
"106.28468","42.5247","278071","0.6920821"
"106.554726","42.91474","278088","0.686217"
"106.86477","43.274784","278105","0.67741936"
"107.29483","43.92486","278121","0.6783969"
"107.57487","44.394905","278138","0.67741936"
"107.90491","44.824955","278155","0.6783969"
"108.25496","45.184994","278171","0.67741936"
"108.615","45.635044","278188","0.67644185"
"109.125084","46.39513","278205","0.67644185"
"109.48513","46.875183","278221","0.67741936"
"109.89518","47.28523","278238","0.684262"
"110.275246","47.625263","278255","0.686217"
"110.7953","48.265335","278271","0.6803519"
"111.145355","48.765392","278288","0.6783969"
"111.50542","49.105427","278305","0.67644185"
"111.85546","49.39546","278321","0.67644185"
"112.20551","49.855515","278338","0.67546433"
"112.72558","50.47558","278355","0.67155427"
"113.06563","50.825623","278371","0.67546433"
"113.36567","51.145653","278388","0.6725318"
"113.6357","51.45569","278405","0.6666667"
"114.00576","51.925743","278421","0.6656892"
"114.27579","52.225773","278438","0.66373414"
"114.55583","52.4958","278455","0.6627566"
"114.96589","52.855846","278471","0.66959924"
"115.34594","53.21588","278488","0.67644185"
"115.68598","53.62593","278505","0.6735093"
"115.91601","53.875957","278521","0.6725318"
"116.176056","54.115986","278538","0.67155427"
"116.44609","54.356007","278555","0.66959924"
"116.676125","54.53603","278571","0.6686217"
"117.04617","54.766056","278588","0.6686217"
"117.30621","54.976078","278605","0.6666667"
"117.596245","55.1861","278621","0.66471165"
"117.86629","55.35612","278638","0.66373414"
"118.236336","55.546135","278655","0.6608016"
"118.486374","55.686153","278671","0.65884656"
"118.74641","55.816174","278688","0.65786904"
"119.036446","55.98619","278705","0.65591395"
"119.31649","56.136204","278721","0.6539589"
"119.70655","56.376232","278738","0.6520039"
"119.96658","56.536247","278755","0.65004885"
"120.27662","56.86629","278771","0.65591395"
"120.50666","57.256332","278788","0.6735093"
"120.636665","57.506355","278805","0.6813294"
"121.03672","57.85639","278821","0.6793744"
"121.26676","58.076416","278838","0.6783969"
"121.50679","58.29644","278855","0.67644185"
"121.64681","58.556473","278871","0.6744868"
"121.91684","58.926514","278888","0.6735093"
"122.086876","59.196545","278905","0.67155427"
"122.43693","59.506577","278921","0.67057675"
"122.74696","59.856617","278938","0.6686217"
"123.007","60.206657","278955","0.6676442"
"123.27704","60.696712","278971","0.67155427"
"123.427055","61.016747","278988","0.67644185"
"123.587074","61.32678","279005","0.6793744"
"123.66708","61.646812","279021","0.68914956"
"123.92714","62.116867","279038","0.69990224"
"124.057144","62.386894","279055","0.6989247"
"124.17717","62.666927","279071","0.6989247"
"124.28718","62.966957","279088","0.6979472"
"124.39719","63.246994","279105","0.6969697"
"124.52721","63.637035","279121","0.6930596"
"124.58722","63.87706","279138","0.6920821"
"124.637215","64.12708","279155","0.6911046"
"124.66723","64.36712","279171","0.68817204"
"124.70722","64.64714","279188","0.686217"
"124.72724","65.01718","279205","0.684262"
"124.74724","65.23721","279221","0.6803519"
"124.76725","65.32722","279238","0.6783969"
"124.76725","65.46724","279255","0.67546433"
"124.76725","65.67726","279271","0.6735093"
"124.75723","65.78728","279288","0.67057675"
"124.70722","65.87728","279305","0.6627566"
"124.687225","65.87728","279321","0.6520039"
"124.5472","65.87728","279338","0.64320624"
"124.19717","65.55724","279355","0.6363636"
"123.897125","65.23721","279371","0.6344086"
"123.62709","64.837166","279388","0.629521"
"123.36704","64.44713","279405","0.62561095"
"123.11701","64.12708","279421","0.61876833"
"122.68696","63.657032","279438","0.6119257"
"122.3269","63.256992","279455","0.6099707"
"122.01686","62.806946","279471","0.60801566"
"121.786835","62.386894","279488","0.6099707"
"121.29676","61.876835","279505","0.627566"
"120.93671","61.606808","279521","0.61485827"
"120.66668","61.316776","279538","0.60117304"
"120.37664","60.976738","279555","0.6031281"
"120.1066","60.5667","279571","0.6001955"
"119.70655","60.04664","279588","0.6001955"
"119.46651","59.866623","279605","0.6041056"
"119.25649","59.78661","279621","0.6060606"
"119.166466","59.706596","279638","0.60703814"
"118.826416","59.506577","279655","0.6089932"
"118.68639","59.476578","279671","0.6089932"
"118.576385","59.436565","279688","0.6099707"
"118.45637","59.426567","279702","0.6109482"
"118.346344","59.456573","279721","0.6119257"
"118.30634","59.596592","279738","0.6119257"
"118.26635","59.736603","279755","0.6119257"
"118.21634","59.836613","279771","0.6119257"
"118.16633","59.936626","279788","0.6119257"
"118.12633","60.04664","279805","0.61290324"
"118.08632","60.376675","279821","0.61485827"
"118.116325","60.6567","279838","0.6158358"
"118.29634","60.966743","279855","0.61388075"
"118.486374","61.256775","279871","0.6119257"
"118.75641","61.716824","279888","0.61485827"
"118.97645","62.086864","279905","0.6177908"
"119.196465","62.4169","279921","0.6158358"
"119.376495","62.68693","279938","0.6158358"
"119.54652","62.946957","279955","0.61485827"
"119.836555","63.397007","279971","0.61388075"
"120.036575","63.717045","279988","0.6119257"
"120.20661","64.05708","280005","0.6158358"
"120.40664","64.387115","280021","0.62072337"
"120.55666","64.68716","280038","0.6236559"
"120.8467","65.1472","280055","0.62658846"
"121.02672","65.447235","280071","0.62658846"
"121.13674","65.73727","280088","0.62561095"
"121.27676","66.03729","280105","0.62658846"
"121.46678","66.52735","280121","0.63734114"
"121.54679","66.89739","280138","0.6402737"
"121.54679","67.20743","280155","0.63734114"
"121.5668","67.477455","280171","0.63734114"
"121.606804","67.72749","280188","0.6392962"
"121.64681","68.11753","280205","0.6392962"
"121.64681","68.36755","280221","0.6412512"
"121.64681","68.617584","280238","0.6422287"
"121.6268","68.80761","280255","0.64320624"
"121.5968","69.04763","280271","0.6461388"
"121.5968","69.17764","280288","0.6480938"
"121.48679","69.25765","280305","0.6480938"
"121.36677","69.25765","280321","0.6471163"
"121.17675","69.147644","280338","0.6451613"
"120.75669","68.89761","280355","0.6480938"
"120.426636","68.63759","280371","0.64907134"
"120.19661","68.26755","280388","0.6402737"
"120.00659","67.81749","280405","0.629521"
"119.75655","67.407455","280421","0.6304985"
"119.46651","66.867386","280438","0.63831866"
"119.23647","66.457344","280455","0.63831866"
"118.96644","65.977295","280471","0.6344086"
"118.736404","65.477234","280488","0.6353861"
"118.33636","64.65715","280505","0.6402737"
"118.026306","64.12708","280521","0.64320624"
"117.71628","63.717045","280538","0.6451613"
"117.42622","63.42701","280555","0.6480938"
"117.17619","63.19699","280571","0.65102637"
"116.83614","62.87695","280588","0.6529814"
"116.61611","62.626923","280605","0.65493643"
"116.40608","62.366894","280621","0.65689147"
"116.19605","62.116867","280638","0.66373414"
"115.956024","61.85684","280655","0.6617791"
"115.62597","61.556805","280671","0.65493643"
"115.44595","61.43679","280688","0.65591395"
"115.17591","61.316776","280705","0.6529814"
"114.84587","61.236767","280721","0.64418375"
"114.62584","61.13676","280734","0.6392962"
"114.50582","61.09675","280755","0.6402737"
"114.39581","61.07675","280771","0.6412512"
"114.28579","61.07675","280788","0.6412512"
"114.19579","61.39679","280821","0.6412512"
"114.185776","61.706818","280838","0.6461388"
"114.185776","62.076866","280855","0.65004885"
"114.20578","62.3969","280871","0.6471163"
"114.27579","62.816944","280888","0.6471163"
"114.38581","63.20699","280905","0.6461388"
"114.59584","63.637035","280921","0.64418375"
"114.86587","64.07708","280938","0.6480938"
"115.25592","64.47713","280955","0.65591395"
"115.65598","65.08719","280971","0.65884656"
"115.846016","65.487236","280988","0.65689147"
"116.04604","65.83728","281005","0.65689147"
"116.24606","66.15731","281021","0.65591395"
"116.44609","66.50735","281038","0.6598241"
"116.79614","67.05741","281055","0.65689147"
"117.02618","67.357445","281071","0.65591395"
"117.2462","67.637474","281088","0.6539589"
"117.446236","67.887505","281105","0.6529814"
"117.71628","68.29755","281121","0.6520039"
"117.886284","68.59758","281138","0.6529814"
"118.05631","68.907616","281155","0.6529814"
"118.21634","69.17764","281171","0.6539589"
"118.326355","69.44767","281188","0.65493643"
"118.47638","69.85772","281205","0.65786904"
"118.55637","70.10775","281221","0.65786904"
"118.606384","70.34778","281238","0.65786904"
"118.64639","70.567795","281255","0.65884656"
"118.64639","70.88783","281271","0.6617791"
"118.64639","70.98785","281288","0.66373414"
"118.606384","71.13786","281305","0.66471165"
"118.51638","71.24787","281321","0.6666667"
"118.41637","71.29788","281338","0.6676442"
"118.13632","71.31789","281355","0.6676442"
"117.9763","71.31789","281371","0.6676442"
"117.75626","71.16787","281388","0.6676442"
"117.46623","70.937836","281405","0.6686217"
"117.146194","70.657814","281421","0.66959924"
"116.70612","70.15775","281438","0.67155427"
"116.45609","69.79772","281455","0.6744868"
"116.21605","69.42767","281471","0.67546433"
"115.99603","69.04763","281488","0.67741936"
"115.65598","68.32755","281505","0.67741936"
"115.37594","67.807495","281521","0.6735093"
"115.0659","67.33745","281538","0.66373414"
"114.86587","66.9174","281555","0.66373414"
"114.63584","66.547356","281571","0.66373414"
"114.3058","66.03729","281588","0.6617791"
"114.06576","65.657265","281605","0.66373414"
"113.80573","65.22721","281621","0.6656892"
"113.53568","64.81717","281638","0.6676442"
"113.285645","64.51713","281655","0.6686217"
"112.95561","64.2371","281671","0.67155427"
"112.75559","64.04707","281688","0.67155427"
"112.55556","63.86706","281705","0.67155427"
"112.29552","63.707043","281721","0.6725318"
"112.04549","63.587032","281734","0.6725318"
"111.895454","63.50702","281755","0.6725318"
"111.76545","63.457016","281771","0.67057675"
"111.655426","63.377007","281788","0.6686217"
"111.535416","63.357002","281805","0.66959924"
"111.355385","63.46702","281821","0.67057675"
"111.34538","63.657032","281838","0.6725318"
"111.33539","63.927067","281855","0.67155427"
"111.3754","64.2471","281871","0.66959924"
"111.435394","64.58714","281888","0.6686217"
"111.58543","65.1672","281905","0.6686217"
"111.71544","65.55724","281921","0.6666667"
"111.93546","65.93729","281938","0.6656892"
"112.255516","66.28733","281955","0.66471165"
"112.795586","66.89739","281971","0.65689147"
"113.05562","67.26743","281988","0.66373414"
"113.29566","67.64748","282005","0.66373414"
"113.49569","68.03752","282021","0.6627566"
"113.69571","68.417564","282038","0.6627566"
"113.99575","68.97762","282055","0.6617791"
"114.20578","69.357666","282071","0.6608016"
"114.37581","69.767715","282088","0.6608016"
"114.49582","70.17776","282105","0.6608016"
"114.60584","70.697815","282121","0.6617791"
"114.65584","70.99785","282138","0.6627566"
"114.695854","71.28788","282155","0.66373414"
"114.71585","71.60792","282171","0.6656892"
"114.71585","71.88795","282188","0.6666667"
"114.695854","72.06796","282205","0.6666667"
"114.65584","72.21798","282221","0.6676442"
"114.60584","72.357994","282238","0.6676442"
"114.51583","72.48801","282255","0.66959924"
"114.46582","72.578026","282271","0.67057675"
"114.23578","72.688034","282288","0.67057675"
"114.12577","72.688034","282305","0.67057675"
"113.98575","72.64803","282321","0.67057675"
"113.78573","72.52802","282338","0.6725318"
"113.35567","72.127975","282355","0.6725318"
"112.97561","71.69793","282371","0.6725318"
"112.51555","71.187874","282388","0.6744868"
"112.01549","70.67781","282405","0.67546433"
"111.58543","70.167755","282421","0.67644185"
"111.04534","69.32766","282438","0.6783969"
"110.6953","68.667595","282455","0.67741936"
"110.37525","67.977516","282471","0.6783969"
"109.975204","67.327446","282488","0.67741936"
"109.585144","66.73737","282505","0.6744868"
"109.175095","65.9973","282521","0.67546433"
"108.92506","65.527245","282538","0.67644185"
"108.68502","64.997185","282555","0.67644185"
"108.42498","64.45712","282571","0.67644185"
"108.034935","63.657032","282588","0.67644185"
"107.76489","63.236988","282605","0.67741936"
"107.49486","62.896954","282621","0.67741936"
"107.174805","62.546913","282638","0.67741936"
"106.86477","62.02686","282655","0.6735093"
"106.53471","61.036747","282671","0.6627566"
"106.4147","60.41668","282688","0.57575756"
"106.214676","59.376564","282705","0.10654937"
"106.11467","58.946518","282708","9.775171E-4"
"106.11467","58.946518","282715","9.775171E-4"
