"89.552376","33.863747","1289457","0.13782991"
"89.44236","33.83374","1289466","0.13587488"
"89.56238","33.813736","1289499","0.18963832"
"89.87242","34.30379","1289549","0.27761486"
"90.17246","34.783844","1289583","0.29618767"
"90.19247","34.923862","1289599","0.33333334"
"90.21246","35.213894","1289616","0.39589444"
"90.21246","35.313904","1289632","0.41055718"
"90.49251","35.46392","1289649","0.42130986"
"90.942566","35.513927","1289666","0.42913002"
"91.33262","35.573933","1289682","0.4349951"
"91.45264","35.783955","1289699","0.46138808"
"91.48264","36.11399","1289716","0.49560118"
"91.48264","36.404026","1289732","0.51906157"
"91.48264","36.64405","1289749","0.52981424"
"92.01272","36.934082","1289766","0.540567"
"92.502785","36.974087","1289782","0.55034214"
"93.06286","37.024094","1289799","0.5591398"
"93.46291","37.16411","1289816","0.5796676"
"93.57293","37.29412","1289832","0.6177908"
"92.962845","37.974197","1289899","0.65493643"
"93.58293","38.154217","1289916","0.6598241"
"94.84311","38.464252","1289932","0.64418375"
"95.33318","38.63427","1289949","0.65102637"
"95.44319","38.684277","1289966","0.65493643"
"95.26317","38.974308","1289982","0.65786904"
"94.63307","39.324345","1289999","0.65786904"
"94.45305","39.52437","1290016","0.65591395"
"94.58307","39.71439","1290032","0.6539589"
"95.073135","39.944416","1290049","0.65493643"
"95.673225","40.214443","1290066","0.6598241"
"96.263306","40.674496","1290082","0.66373414"
"96.37332","40.984528","1290099","0.6617791"
"96.34331","41.284565","1290116","0.6627566"
"96.213295","41.574596","1290132","0.66471165"
"96.39332","41.98464","1290149","0.65884656"
"96.853386","42.184666","1290166","0.6520039"
"97.42346","42.34468","1290182","0.65102637"
"97.88352","42.5147","1290199","0.6529814"
"98.113556","42.69472","1290216","0.65493643"
"98.023544","42.97475","1290232","0.65689147"
"97.6635","43.184772","1290249","0.6529814"
"97.53347","43.364796","1290266","0.64907134"
"97.63349","43.394794","1290282","0.6471163"
"98.09356","43.564816","1290299","0.6471163"
"99.073685","43.784843","1290316","0.64907134"
"99.463745","43.914852","1290332","0.64907134"
"99.55376","44.034866","1290349","0.65102637"
"99.42374","44.164883","1290366","0.6529814"
"98.96368","44.314896","1290382","0.65591395"
"98.833664","44.394905","1290399","0.65591395"
"98.833664","44.50492","1290416","0.65493643"
"99.123695","44.52492","1290432","0.65493643"
"99.53375","44.564922","1290449","0.65591395"
"99.8538","44.614933","1290461","0.65689147"
"99.973816","44.724945","1290482","0.65786904"
"99.8438","44.834957","1290499","0.65884656"
"99.60377","44.944965","1290516","0.6598241"
"99.39373","45.044983","1290532","0.6598241"
"99.39373","45.044983","1290542","0.65786904"
"99.49375","45.124985","1290566","0.65689147"
"99.73378","45.114986","1290582","0.65884656"
"99.95382","45.114986","1290597","0.6598241"
"100.06383","45.114986","1290614","0.6598241"
"100.06383","45.114986","1290631","0.6608016"
"100.03382","45.234997","1290666","0.6598241"
"100.04382","45.415016","1290682","0.65884656"
"100.45388","45.655045","1290699","0.64907134"
"100.763916","45.835064","1290716","0.6461388"
"100.99396","46.04509","1290732","0.6461388"
"101.07397","46.265118","1290749","0.6461388"
"100.94395","46.645153","1290766","0.64320624"
"100.72392","46.905186","1290782","0.6422287"
"100.5939","47.14521","1290799","0.6412512"
"100.563896","47.38524","1290816","0.63831866"
"100.72392","47.57526","1290832","0.63734114"
"101.273994","47.625263","1290849","0.6480938"
"101.63404","47.58526","1290866","0.6520039"
"101.77407","47.58526","1290882","0.64418375"
"101.91408","47.58526","1290899","0.64418375"
"101.91408","47.705273","1290916","0.64418375"
"101.77407","48.025307","1290932","0.64320624"
"101.75406","48.22533","1290949","0.6412512"
"102.00409","48.44535","1290966","0.6402737"
"102.46416","48.615376","1290982","0.6363636"
"103.19426","48.835396","1290999","0.63147604"
"103.44429","48.975414","1291016","0.63147604"
"103.5343","49.145435","1291032","0.63245356"
"103.5343","49.235443","1291049","0.6353861"
"103.44429","49.41546","1291066","0.6402737"
"103.434296","50.065533","1291082","0.6402737"
"103.674324","50.51558","1291099","0.6392962"
"104.07439","50.92563","1291116","0.6363636"
"104.59445","51.23566","1291132","0.63734114"
"105.164536","51.36568","1291149","0.63245356"
"105.6646","51.575703","1291166","0.62561095"
"105.6946","51.735718","1291182","0.63245356"
"105.68459","51.95574","1291199","0.6422287"
"105.50458","52.245773","1291216","0.65004885"
"105.084526","52.84584","1291232","0.65786904"
"104.984505","53.235886","1291249","0.65786904"
"105.07452","53.505913","1291266","0.65004885"
"105.284546","53.635925","1291282","0.6402737"
"105.40457","53.65593","1291299","0.63734114"
"105.524574","53.93596","1291316","0.6392962"
"105.524574","54.135986","1291332","0.6402737"
"105.50458","54.39601","1291349","0.64320624"
"105.31456","54.716045","1291366","0.6471163"
"105.15454","55.1861","1291382","0.6480938"
"105.27454","55.436127","1291399","0.64418375"
"105.40457","55.516136","1291416","0.6392962"
"105.67461","55.616146","1291432","0.6392962"
"105.81463","55.63615","1291449","0.6412512"
"105.81463","55.63615","1291466","0.64320624"
"105.80463","55.886177","1291482","0.64418375"
"105.6346","56.1262","1291499","0.64418375"
"105.33456","56.426235","1291516","0.6461388"
"105.01452","56.976295","1291532","0.6598241"
"105.02451","57.586365","1291549","0.6656892"
"105.35457","57.686375","1291566","0.65884656"
"105.6646","57.746384","1291582","0.65591395"
"105.874626","57.766384","1291599","0.65689147"
"106.00465","57.78639","1291616","0.65884656"
"106.02466","57.906395","1291632","0.6608016"
"105.92464","58.15643","1291649","0.6617791"
"105.80463","58.376457","1291666","0.6608016"
"105.70462","58.58647","1291682","0.6598241"
"105.834625","58.8265","1291699","0.65689147"
"106.10467","58.866505","1291716","0.65591395"
"106.344696","58.866505","1291732","0.65689147"
"106.44471","58.866505","1291749","0.65786904"
"106.554726","59.036526","1291766","0.65786904"
"106.53471","59.33656","1291782","0.65884656"
"106.3547","59.736603","1291799","0.65884656"
"106.23467","60.076637","1291816","0.65884656"
"106.22468","60.386673","1291832","0.65689147"
"106.47472","60.70671","1291849","0.6539589"
"106.79476","60.756714","1291866","0.6539589"
"107.1048","60.776714","1291882","0.65493643"
"107.21482","60.776714","1291899","0.65591395"
"107.33483","60.79672","1291916","0.65689147"
"107.14481","61.16676","1291932","0.65884656"
"106.95478","61.45679","1291949","0.65786904"
"106.84477","61.766827","1291966","0.65689147"
"106.81476","62.136868","1291982","0.65884656"
"107.0448","62.4269","1291999","0.65689147"
"107.814896","62.486908","1292016","0.6480938"
"108.224945","62.486908","1292032","0.6480938"
"108.34497","62.486908","1292049","0.65004885"
"108.44499","62.586918","1292066","0.6520039"
"108.21495","63.046967","1292082","0.65786904"
"107.94492","63.36701","1292099","0.6617791"
"107.7949","63.697037","1292116","0.6608016"
"107.8049","63.97707","1292132","0.65786904"
"108.17495","64.13709","1292149","0.6480938"
"109.03507","64.2471","1292166","0.63245356"
"109.425125","64.2471","1292182","0.63147604"
"109.53513","64.2471","1292199","0.63147604"
"109.56514","64.45712","1292216","0.63147604"
"109.27511","64.97719","1292232","0.6422287"
"108.99506","65.31722","1292249","0.65102637"
"108.87505","65.61725","1292266","0.6529814"
"108.90505","65.85728","1292282","0.6471163"
"109.295105","65.95729","1292299","0.6334311"
"110.0552","65.977295","1292316","0.6236559"
"110.21523","65.977295","1292332","0.62463343"
"110.21523","66.07731","1292349","0.62658846"
"109.975204","66.26733","1292366","0.629521"
"109.60514","66.53735","1292382","0.6363636"
"109.33511","66.9774","1292399","0.6451613"
"109.32511","67.237434","1292416","0.6451613"
"109.69515","67.317444","1292432","0.6363636"
"110.28523","67.34744","1292449","0.62561095"
"110.895325","67.28744","1292466","0.6217009"
"111.00533","67.277435","1292482","0.6217009"
"110.975334","67.407455","1292499","0.62463343"
"110.7453","67.62747","1292516","0.6344086"
"110.49526","67.89751","1292532","0.6471163"
"110.37525","68.26755","1292549","0.6520039"
"110.525276","68.49757","1292566","0.6480938"
"110.90532","68.617584","1292582","0.6363636"
"111.33539","68.69759","1292599","0.62463343"
"111.59541","68.7176","1292613","0.61974585"
"111.59541","68.907616","1292632","0.62072337"
"111.485405","69.08764","1292649","0.627566"
"111.445404","69.17764","1292666","0.6392962"
"111.305374","69.33766","1292682","0.6471163"
"111.535416","69.52769","1292699","0.6461388"
"112.11549","69.55769","1292716","0.63831866"
"112.73557","69.54768","1292732","0.6285435"
"113.035614","69.52769","1292749","0.6217009"
"112.715576","69.86772","1292782","0.629521"
"112.325516","70.10775","1292799","0.6392962"
"112.05549","70.337776","1292816","0.64418375"
"112.125496","70.51779","1292832","0.6422287"
"112.72558","70.647804","1292849","0.6353861"
"113.18564","70.67781","1292866","0.6285435"
"113.515686","70.71781","1292882","0.6226784"
"113.6357","70.79783","1292899","0.61974585"
"113.6057","70.947845","1292916","0.61974585"
"113.335655","71.23788","1292932","0.62561095"
"113.29566","71.32788","1292949","0.63147604"
"113.24565","71.4479","1292966","0.63147604"
"113.515686","71.58791","1292982","0.629521"
"113.925735","71.62792","1292999","0.6236559"
"114.475815","71.60792","1293016","0.6119257"
"114.57583","71.57792","1293032","0.6099707"
"114.57583","71.57792","1293049","0.61290324"
"114.48582","71.60792","1293066","0.62072337"
"114.23578","71.797935","1293082","0.6402737"
"114.20578","71.90794","1293099","0.64907134"
"114.185776","71.90794","1293116","0.6461388"
"114.50582","71.95795","1293132","0.63734114"
"115.085915","71.86795","1293149","0.6236559"
"115.41594","71.73793","1293166","0.6236559"
"115.51596","71.65792","1293182","0.6236559"
"115.40595","71.65792","1293199","0.62072337"
"115.22592","71.68793","1293216","0.62463343"
"115.0759","71.78793","1293232","0.6353861"
"114.91588","71.89795","1293242","0.6402737"
"115.12591","71.99796","1293266","0.64320624"
"115.55597","71.99796","1293282","0.6461388"
"116.10604","71.82794","1293299","0.63831866"
"116.15605","71.73793","1293316","0.63245356"
"116.15605","71.60792","1293332","0.629521"
"115.786","71.52791","1293349","0.6392962"
"115.35594","71.507904","1293366","0.6461388"
"114.96589","71.4979","1293382","0.6422287"
"114.83588","71.4879","1293399","0.6363636"
"115.035904","71.36789","1293416","0.63831866"
"115.39594","71.187874","1293432","0.64418375"
"115.65598","70.95784","1293449","0.6461388"
"115.69599","70.66781","1293466","0.6480938"
"115.46595","70.5078","1293482","0.6480938"
"115.19592","70.38778","1293499","0.65004885"
"115.02589","70.27776","1293516","0.64907134"
"114.82586","70.15775","1293532","0.6451613"
"114.78587","69.85772","1293549","0.64320624"
"115.01589","69.59769","1293566","0.6471163"
"115.19592","69.32766","1293582","0.6520039"
"115.10591","69.13764","1293599","0.6480938"
"114.84587","68.97762","1293616","0.6451613"
"114.25579","68.7676","1293632","0.65102637"
"113.77572","68.62759","1293649","0.65591395"
"113.42567","68.51757","1293666","0.65884656"
"113.335655","68.43757","1293682","0.65884656"
"113.45568","68.13753","1293699","0.65493643"
"113.77572","67.90751","1293716","0.6520039"
"114.07576","67.69748","1293732","0.65102637"
"114.175766","67.607475","1293749","0.6520039"
"114.19579","67.487465","1293766","0.6539589"
"113.625694","67.407455","1293782","0.6598241"
"113.14564","67.37744","1293799","0.66373414"
"112.83559","67.33745","1293816","0.6656892"
"112.83559","67.327446","1293832","0.6627566"
"113.06563","67.107414","1293849","0.6617791"
"113.64571","66.747375","1293866","0.6480938"
"113.77572","66.667366","1293882","0.6480938"
"113.75572","66.50735","1293899","0.6520039"
"113.27566","66.44734","1293916","0.65689147"
"112.14549","66.42734","1293932","0.6666667"
"111.67544","66.42734","1293949","0.6686217"
"111.67544","66.42734","1293966","0.66373414"
"112.17551","66.377335","1293982","0.65493643"
"112.95561","66.26733","1293999","0.6471163"
"113.465675","66.13731","1294016","0.6471163"
"113.285645","65.92729","1294032","0.65591395"
"112.60557","65.79727","1294049","0.6666667"
"111.775444","65.727264","1294066","0.67644185"
"111.28538","65.647255","1294082","0.6783969"
"111.445404","65.487236","1294099","0.6725318"
"112.1655","65.32722","1294116","0.66471165"
"113.00562","65.1572","1294132","0.65786904"
"113.40567","65.037186","1294149","0.65689147"
"113.09563","64.88717","1294166","0.66471165"
"112.44553","64.81717","1294182","0.67057675"
"111.865456","64.78716","1294199","0.6735093"
"111.72545","64.78716","1294216","0.67057675"
"111.945465","64.78716","1294232","0.66471165"
"112.91561","64.717155","1294249","0.65591395"
"113.36567","64.60714","1294266","0.6539589"
"113.45568","64.56714","1294282","0.65591395"
"113.26565","64.44713","1294299","0.65884656"
"112.52556","64.36712","1294316","0.66471165"
"112.1355","64.347115","1294332","0.66471165"
"112.1355","64.347115","1294349","0.6608016"
"112.60557","64.307106","1294366","0.65493643"
"113.27566","64.2471","1294382","0.65102637"
"113.885735","64.2071","1294399","0.64907134"
"113.885735","64.2071","1294416","0.6529814"
"113.53568","64.187096","1294432","0.65884656"
"113.05562","64.17709","1294449","0.66373414"
"112.72558","64.17709","1294466","0.6627566"
"112.91561","64.27711","1294482","0.65786904"
"113.43568","64.27711","1294499","0.6529814"
"113.99575","64.27711","1294516","0.64907134"
"114.3058","64.257095","1294532","0.64907134"
"114.15577","64.257095","1294549","0.65591395"
"113.68571","64.307106","1294566","0.6617791"
"113.15564","64.41712","1294582","0.66471165"
"112.8556","64.53713","1294599","0.66373414"
"112.95561","64.67715","1294616","0.6598241"
"113.70572","64.82716","1294632","0.65102637"
"114.23578","64.94718","1294649","0.6471163"
"114.51583","64.997185","1294666","0.6471163"
"114.51583","64.997185","1294682","0.65004885"
"114.06576","65.29722","1294699","0.65591395"
"113.72571","65.43723","1294716","0.65786904"
"113.625694","65.487236","1294732","0.65689147"
"113.75572","65.657265","1294749","0.6520039"
"114.185776","65.75727","1294766","0.6471163"
"114.97589","65.897285","1294782","0.6471163"
"115.385956","65.92729","1294799","0.65689147"
"115.50596","66.00729","1294816","0.66471165"
"115.14591","66.10731","1294832","0.65689147"
"114.78587","66.20732","1294849","0.6480938"
"114.67585","66.33733","1294866","0.6471163"
"114.81587","66.467354","1294882","0.64320624"
"115.29594","66.59736","1294899","0.64907134"
"115.816","66.71737","1294916","0.65689147"
"116.05603","66.827385","1294932","0.65493643"
"116.15605","66.9674","1294949","0.6627566"
"116.14605","67.11742","1294966","0.6676442"
"116.10604","67.26743","1294982","0.6656892"
"116.07604","67.357445","1294999","0.66471165"
"116.30607","67.557465","1295016","0.6598241"
"116.5361","67.66748","1295032","0.65786904"
"116.626114","67.68748","1295049","0.65689147"
"116.71612","67.81749","1295066","0.65786904"
"116.71612","67.9175","1295082","0.6598241"
"116.65612","68.13753","1295099","0.65884656"
"116.646126","68.22754","1295116","0.65786904"
"116.79614","68.30755","1295130","0.65493643"
"116.94615","68.38756","1295149","0.6539589"
"117.09618","68.48757","1295160","0.6529814"
"117.1962","68.56758","1295182","0.6529814"
"117.1962","68.657585","1295199","0.6520039"
"117.1962","68.7676","1295216","0.6529814"
"117.186195","68.87762","1295232","0.6529814"
"117.2962","69.00763","1295249","0.65004885"
"117.476234","69.107635","1295266","0.64907134"
"117.65625","69.107635","1295282","0.64907134"
"117.776276","69.12764","1295299","0.64907134"
"117.776276","69.12764","1295316","0.64907134"
"117.776276","69.12764","1295327","0.6480938"
"117.806274","69.27766","1295349","0.6471163"
"117.806274","69.40768","1295366","0.6471163"
"117.82629","69.49768","1295382","0.6471163"
"117.936295","69.54768","1295399","0.64418375"
"118.07632","69.6277","1295416","0.64320624"
"118.236336","69.6477","1295432","0.6422287"
"118.37636","69.677704","1295440","0.6422287"
"118.47638","69.6977","1295466","0.64320624"
"118.47638","69.6977","1295476","0.64418375"
"118.37636","69.81772","1295499","0.6451613"
"118.036316","70.06775","1295516","0.6471163"
"117.74626","70.287766","1295532","0.6480938"
"117.66627","70.51779","1295549","0.6451613"
"118.0063","70.5578","1295566","0.6402737"
"118.54639","70.5278","1295582","0.6363636"
"119.08646","70.35778","1295599","0.6344086"
"119.4265","70.18776","1295616","0.6363636"
"119.50652","70.06775","1295632","0.6422287"
"119.18647","69.95773","1295649","0.6451613"
"118.75641","69.917725","1295666","0.6480938"
"118.41637","69.917725","1295699","0.6471163"
"118.81643","70.12775","1295715","0.63734114"
"119.326485","70.14775","1295732","0.63245356"
"119.69653","70.11775","1295749","0.63147604"
"119.80656","70.03774","1295765","0.6344086"
"119.60653","69.78771","1295782","0.6422287"
"119.196465","69.717705","1295799","0.6471163"
"118.75641","69.6477","1295815","0.65004885"
"118.486374","69.6077","1295832","0.65004885"
"118.486374","69.59769","1295849","0.6451613"
"119.30649","69.437675","1295865","0.6353861"
"119.89657","69.237656","1295882","0.6304985"
"120.20661","69.04763","1295899","0.6304985"
"120.21662","68.85761","1295915","0.6363636"
"119.50652","68.617584","1295932","0.65102637"
"118.626396","68.46757","1295949","0.66471165"
"117.82629","68.377556","1295965","0.6735093"
"117.446236","68.31755","1295982","0.6725318"
"117.606255","68.26755","1295999","0.66471165"
"118.83642","68.13753","1296015","0.64907134"
"119.66654","68.03752","1296032","0.63831866"
"120.02659","67.967514","1296049","0.6353861"
"119.84656","67.837494","1296065","0.64320624"
"119.01645","67.73749","1296082","0.6598241"
"117.16618","67.65748","1296099","0.6911046"
"116.426094","67.58747","1296115","0.69990224"
"116.296074","67.54746","1296132","0.69501466"
"116.846146","67.38745","1296149","0.68328446"
"118.71641","67.16743","1296165","0.65884656"
"119.63653","66.997406","1296182","0.64418375"
"119.786545","66.9474","1296199","0.6402737"
"119.06646","66.80739","1296215","0.65493643"
"117.726265","66.79738","1296232","0.67741936"
"116.03603","66.79738","1296249","0.6959922"
"115.806","66.79738","1296265","0.6930596"
"116.03603","66.787384","1296282","0.6793744"
"116.976166","66.73737","1296299","0.6617791"
"118.20632","66.61736","1296315","0.64418375"
"119.08646","66.457344","1296332","0.6402737"
"118.6664","66.32733","1296349","0.65493643"
"117.606255","66.18731","1296365","0.67741936"
"116.44609","66.0673","1296382","0.69501466"
"115.60597","65.95729","1296399","0.69990224"
"115.745995","65.817276","1296415","0.6901271"
"116.39608","65.61725","1296432","0.6744868"
"117.2962","65.35722","1296449","0.6627566"
"117.95629","65.1472","1296465","0.6598241"
"117.9163","64.89717","1296482","0.6676442"
"117.2962","64.69715","1296499","0.67644185"
"116.546104","64.507126","1296515","0.6852395"
"116.05603","64.37711","1296532","0.6901271"
"116.04604","64.187096","1296549","0.68230695"
"116.546104","63.98707","1296565","0.66959924"
"117.266205","63.75705","1296582","0.65786904"
"117.78628","63.627033","1296599","0.6529814"
"117.8763","63.52702","1296615","0.65689147"
"116.91615","63.327003","1296632","0.6744868"
"116.09605","63.276993","1296649","0.68817204"
"115.335945","63.20699","1296665","0.6852395"
"115.12591","63.15698","1296682","0.67741936"
"115.56597","63.026966","1296699","0.6783969"
"116.69612","62.756935","1296715","0.6666667"
"117.27621","62.616924","1296732","0.6608016"
"117.396225","62.576916","1296749","0.6627566"
"117.03618","62.366894","1296765","0.67546433"
"115.91601","61.99685","1296782","0.68230695"
"115.12591","61.85684","1296799","0.67644185"
"114.745865","61.786827","1296815","0.66471165"
"115.17591","61.66682","1296832","0.66471165"
"115.97602","61.506794","1296849","0.6617791"
"116.90615","61.236767","1296865","0.6480938"
"117.04617","61.14676","1296882","0.65004885"
"116.68613","61.036747","1296899","0.65786904"
"115.826004","60.956738","1296915","0.6676442"
"114.83588","60.916733","1296932","0.67155427"
"114.26579","60.89673","1296949","0.6666667"
"114.43582","60.916733","1296965","0.65786904"
"115.24593","60.936733","1296982","0.65786904"
"116.186066","60.936733","1296999","0.65786904"
"116.89616","60.956738","1297015","0.64907134"
"116.89616","60.956738","1297032","0.6520039"
"116.52611","61.10676","1297049","0.65786904"
"116.086044","61.22677","1297065","0.6627566"
"115.926025","61.316776","1297082","0.66373414"
"116.07604","61.59681","1297099","0.65591395"
"116.57612","61.776825","1297115","0.64907134"
"117.1962","61.956852","1297132","0.6422287"
"117.63625","62.16687","1297149","0.6461388"
"117.74626","62.50691","1297165","0.6539589"
"117.516235","62.676926","1297182","0.65786904"
"117.2562","62.846943","1297199","0.6598241"
"117.216194","62.99696","1297215","0.65786904"
"117.446236","63.15698","1297232","0.6529814"
"118.42637","63.42701","1297249","0.6422287"
"119.02645","63.60703","1297265","0.63734114"
"119.326485","63.767048","1297282","0.6363636"
"119.34649","63.87706","1297299","0.63734114"
"119.23647","63.97707","1297315","0.6412512"
"118.86643","64.11708","1297332","0.6451613"
"118.776405","64.2071","1297349","0.64320624"
"118.986435","64.29711","1297365","0.63831866"
"119.45651","64.35711","1297382","0.63245356"
"120.20661","64.637146","1297399","0.62561095"
"120.346634","64.717155","1297410","0.62463343"
"120.44664","64.837166","1297432","0.62658846"
"120.35663","64.957184","1297449","0.6285435"
"120.18661","65.04719","1297465","0.6304985"
"120.036575","65.0972","1297482","0.629521"
"120.036575","65.25722","1297499","0.62658846"
"120.38663","65.477234","1297515","0.6226784"
"120.62667","65.657265","1297532","0.62463343"
"120.71668","65.807274","1297549","0.6304985"
"120.66668","65.94729","1297565","0.6285435"
"120.47665","66.0873","1297582","0.62561095"
"120.32663","66.227325","1297599","0.62658846"
"120.22661","66.30733","1297615","0.62561095"
"120.39664","66.41734","1297632","0.62658846"
"120.606674","66.47735","1297649","0.6334311"
"120.76669","66.52735","1297665","0.63734114"
"120.90671","66.55736","1297682","0.6392962"
"120.90671","66.55736","1297699","0.64418375"
"120.76669","66.577354","1297715","0.6461388"
"120.66668","66.577354","1297732","0.6412512"
"120.66668","66.577354","1297749","0.6334311"
"120.886696","66.59736","1297765","0.6344086"
"121.38677","66.65737","1297782","0.6334311"
"121.71682","66.67737","1297799","0.63245356"
"121.71682","66.67737","1297815","0.6344086"
"121.71682","66.67737","1297832","0.63734114"
"121.85684","66.63737","1297849","0.6392962"
"121.85684","66.63737","1297882","0.63831866"
"121.84684","66.53735","1297899","0.6353861"
"121.94685","66.53735","1297915","0.6334311"
"122.05686","66.53735","1297929","0.6334311"
"122.05686","66.53735","1297949","0.6363636"
"122.05686","66.53735","1297965","0.63734114"
"122.05686","66.43735","1297982","0.63734114"
"122.05686","66.43735","1297999","0.6363636"
"122.05686","66.43735","1298015","0.6353861"
"122.13689","66.42734","1298032","0.63245356"
"122.3169","66.43735","1298049","0.6304985"
"122.506935","66.49735","1298065","0.6285435"
"122.636955","66.60737","1298079","0.627566"
"122.756966","66.68737","1298099","0.62658846"
"122.846985","66.77738","1298132","0.62658846"
"122.846985","66.77738","1298149","0.6285435"
"122.846985","66.77738","1298165","0.629521"
"123.027","66.58736","1298182","0.629521"
"123.177025","66.49735","1298199","0.6285435"
"123.26703","66.467354","1298215","0.6353861"
"123.26703","66.44734","1298229","0.64320624"
"123.26703","66.44734","1298249","0.64418375"
"123.35704","66.42734","1298265","0.6353861"
"123.35704","66.42734","1298282","0.6344086"
"123.35704","66.42734","1298299","0.6412512"
"123.387054","66.50735","1298315","0.6402737"
"123.53708","66.50735","1298332","0.6461388"
"123.53708","66.50735","1298349","0.6539589"
"123.53708","66.41734","1298365","0.65689147"
"123.53708","66.41734","1298382","0.6539589"
"123.11701","66.28733","1298399","0.64320624"
"122.68696","66.28733","1298415","0.63734114"
"122.3169","66.33733","1298432","0.63831866"
"122.21688","66.42734","1298449","0.6344086"
"122.42691","66.44734","1298465","0.6285435"
"123.13702","66.44734","1298482","0.63147604"
"123.467064","66.387344","1298499","0.6451613"
"123.587074","66.27732","1298515","0.65493643"
"123.56707","66.177315","1298532","0.6539589"
"123.26703","66.0673","1298549","0.6451613"
"122.44692","65.977295","1298565","0.64418375"
"122.05686","65.90728","1298582","0.6480938"
"121.90685","65.87728","1298599","0.6480938"
"121.90685","65.87728","1298615","0.6422287"
"122.38692","65.847275","1298632","0.6353861"
"122.76696","65.79727","1298649","0.6344086"
"122.87698","65.75727","1298665","0.63831866"
"122.67695","65.53725","1298682","0.6461388"
"122.13689","65.29722","1298699","0.65786904"
"120.89671","64.94718","1298715","0.67057675"
"120.28662","64.717155","1298732","0.6666667"
"119.99659","64.52713","1298749","0.6627566"
"120.0766","64.37711","1298765","0.65591395"
"120.45665","64.1971","1298782","0.65884656"
"121.28676","63.927067","1298799","0.66373414"
"121.47679","63.767048","1298815","0.6676442"
"121.17675","63.557022","1298832","0.67546433"
"120.48665","63.28699","1298849","0.6735093"
"119.22648","62.926952","1298865","0.67546433"
"118.706406","62.79694","1298882","0.6783969"
"118.696396","62.646927","1298899","0.6735093"
"119.22648","62.4569","1298915","0.6666667"
"120.0566","62.20688","1298932","0.64907134"
"120.75669","62.046852","1298949","0.6480938"
"120.75669","61.91684","1298965","0.6539589"
"120.31663","61.75683","1298982","0.6529814"
"119.41651","61.59681","1298999","0.6598241"
"118.24634","61.426792","1299015","0.67057675"
"118.12633","61.37678","1299032","0.6656892"
"118.76642","61.24677","1299049","0.6539589"
"119.79655","61.09675","1299065","0.6402737"
"120.62667","61.036747","1299082","0.6412512"
"120.946724","60.94673","1299099","0.65591395"
"120.37664","60.686707","1299115","0.65689147"
"119.34649","60.526688","1299132","0.6608016"
"118.186325","60.41668","1299149","0.6725318"
"117.53625","60.386673","1299165","0.67546433"
"118.01632","60.376675","1299182","0.6598241"
"119.15647","60.36667","1299199","0.6451613"
"120.25662","60.346672","1299215","0.6422287"
"120.91671","60.346672","1299232","0.6451613"
"120.836685","60.346672","1299249","0.65102637"
"120.1366","60.346672","1299265","0.6529814"
"119.196465","60.36667","1299282","0.65884656"
"118.53638","60.406673","1299299","0.6627566"
"118.526375","60.466682","1299315","0.65689147"
"119.72655","60.526688","1299332","0.63831866"
"120.8667","60.556694","1299349","0.6344086"
"121.656815","60.616703","1299365","0.6344086"
"121.80683","60.6467","1299382","0.6363636"
"121.45678","60.766716","1299399","0.6471163"
"120.26662","60.876728","1299415","0.6520039"
"119.66654","60.996742","1299432","0.65102637"
"119.54652","61.02674","1299449","0.6451613"
"120.1066","61.266773","1299465","0.6392962"
"121.5768","61.45679","1299482","0.6344086"
"122.47692","61.606808","1299499","0.6226784"
"122.85697","61.716824","1299515","0.6217009"
"122.586945","61.846836","1299532","0.6304985"
"121.89684","61.98685","1299549","0.6422287"
"120.89671","62.25688","1299565","0.66959924"
"120.78669","62.356895","1299582","0.66471165"
"121.34677","62.626923","1299599","0.64907134"
"122.27689","62.826942","1299615","0.63831866"
"123.41705","63.01696","1299632","0.6412512"
"123.51706","63.09697","1299649","0.65102637"
"123.33704","63.22699","1299665","0.6539589"
"122.77696","63.327003","1299682","0.65786904"
"122.046875","63.407005","1299699","0.65689147"
"122.01686","63.52702","1299715","0.6539589"
"122.26689","63.627033","1299732","0.6461388"
"122.85697","63.75705","1299749","0.6471163"
"123.477066","63.857063","1299765","0.65689147"
"123.83711","63.887062","1299782","0.6617791"
"123.82712","64.02708","1299799","0.6666667"
"123.57709","64.04707","1299815","0.6656892"
"123.467064","64.07708","1299832","0.6529814"
"123.347046","64.1571","1299849","0.64418375"
"123.48707","64.27711","1299865","0.6520039"
"123.95712","64.387115","1299882","0.6520039"
"124.46719","64.49713","1299899","0.6539589"
"124.81726","64.60714","1299914","0.65102637"
"124.74724","64.747154","1299949","0.65591395"
"124.647224","64.747154","1299965","0.65786904"
"124.647224","64.747154","1299982","0.65689147"
"124.82725","64.73716","1299999","0.6520039"
"125.26732","64.70715","1300015","0.6461388"
"125.947395","64.67715","1300032","0.63831866"
"126.05742","64.667145","1300049","0.63831866"
"125.8674","64.627144","1300065","0.6422287"
"125.407326","64.56714","1300082","0.65102637"
"124.70722","64.44713","1300099","0.6656892"
"124.58722","64.41712","1300115","0.66471165"
"124.58722","64.41712","1300132","0.65689147"
"125.077286","64.36712","1300149","0.6422287"
"125.697365","64.32711","1300165","0.62463343"
"126.08742","64.2271","1300177","0.61485827"
"126.04742","63.98707","1300199","0.62658846"
"125.51735","63.747047","1300215","0.64907134"
"124.74724","63.50702","1300232","0.6725318"
"123.78711","63.186985","1300249","0.686217"
"123.48707","63.06697","1300265","0.6871945"
"123.48707","62.926952","1300282","0.6871945"
"123.91712","62.79694","1300299","0.67546433"
"124.62723","62.616924","1300315","0.6666667"
"124.777245","62.49691","1300332","0.67741936"
"124.65723","62.196877","1300349","0.68328446"
"124.13715","61.936848","1300365","0.6744868"
"123.507065","61.66682","1300382","0.66373414"
"122.926994","61.406788","1300399","0.65884656"
"122.456924","61.09675","1300415","0.6598241"
"122.57694","60.906734","1300432","0.65493643"
"123.01699","60.696712","1300449","0.64907134"
"123.387054","60.49669","1300465","0.6539589"
"123.52708","60.236656","1300482","0.65884656"
"123.35704","60.026634","1300499","0.65689147"
"122.74696","59.78661","1300515","0.6627566"
"122.046875","59.52658","1300532","0.6686217"
"121.52679","59.276554","1300549","0.6725318"
"121.26676","59.036526","1300565","0.67057675"
"121.47679","58.88651","1300582","0.6656892"
"121.75682","58.736492","1300599","0.6627566"
"121.84684","58.686485","1300615","0.6627566"
"121.94685","58.556473","1300632","0.6666667"
"121.71682","58.246437","1300649","0.6744868"
"121.12674","58.116425","1300665","0.6783969"
"120.67667","57.986412","1300682","0.6725318"
"120.40664","57.866398","1300699","0.66471165"
"120.30663","57.83639","1300715","0.6617791"
"120.30663","57.71638","1300732","0.65884656"
"120.426636","57.676376","1300749","0.65786904"
"120.426636","57.65637","1300765","0.65884656"
"120.38663","57.526356","1300782","0.6617791"
"119.93657","57.46635","1300799","0.6656892"
"119.51652","57.236324","1300815","0.6676442"
"119.04645","57.0063","1300832","0.6608016"
"118.736404","56.90629","1300845","0.6539589"
"118.6364","56.766277","1300865","0.6539589"
"118.736404","56.506245","1300882","0.6529814"
"118.786415","56.316227","1300899","0.6529814"
"118.81643","56.16621","1300915","0.6539589"
"118.826416","56.036198","1300932","0.65591395"
"118.486374","55.876175","1300949","0.6598241"
"118.0063","55.746166","1300965","0.66373414"
"117.45622","55.536137","1300982","0.6686217"
"117.07619","55.376118","1300999","0.67057675"
"116.98617","55.33612","1301015","0.67057675"
"117.03618","55.096092","1301032","0.6686217"
"117.146194","54.926075","1301049","0.6686217"
"117.16618","54.83606","1301065","0.67057675"
"117.16618","54.686043","1301082","0.6735093"
"116.65612","54.54603","1301099","0.6783969"
"116.256065","54.52603","1301115","0.6813294"
"115.88602","54.496017","1301132","0.684262"
"115.66598","54.436016","1301149","0.6852395"
"115.65598","54.316","1301165","0.6852395"
"115.73599","54.045975","1301182","0.68328446"
"115.75599","53.94596","1301199","0.68328446"
"115.846016","53.795948","1301215","0.686217"
"115.806","53.695934","1301232","0.6901271"
"115.50596","53.62593","1301249","0.6959922"
"114.91588","53.485912","1301265","0.69403714"
"114.57583","53.345894","1301282","0.686217"
"114.57583","53.325893","1301297","0.686217"
"114.55583","53.20588","1301332","0.686217"
"114.53583","53.08587","1301349","0.6871945"
"114.3658","53.00586","1301365","0.68914956"
"114.08577","52.98585","1301382","0.6911046"
"113.68571","52.965855","1301399","0.6930596"
"113.14564","52.945854","1301415","0.6959922"
"113.035614","52.945854","1301432","0.69501466"
"113.035614","52.945854","1301449","0.6930596"
"113.31566","52.815834","1301465","0.6911046"
"113.75572","52.595814","1301482","0.6901271"
"113.86574","52.4958","1301499","0.6920821"
"113.77572","52.4658","1301515","0.69501466"
"113.42567","52.405792","1301532","0.6979472"
"112.81559","52.38579","1301549","0.70087975"
"111.825455","52.235775","1301565","0.7038123"
"111.4754","52.045757","1301599","0.7028348"
"111.60542","51.90574","1301615","0.70087975"
"111.87546","51.72572","1301632","0.69990224"
"112.09548","51.5857","1301648","0.70087975"
"112.18549","51.465687","1301665","0.6930596"
"112.025475","51.36568","1301682","0.6852395"
"111.70544","51.355675","1301699","0.6871945"
"111.08534","51.355675","1301715","0.68914956"
"110.945335","51.355675","1301732","0.68817204"
"110.85532","51.355675","1301749","0.686217"
"111.195366","51.335674","1301765","0.68328446"
"111.67544","51.275665","1301782","0.68817204"
"112.27551","51.215664","1301798","0.69501466"
"112.39552","51.205654","1301815","0.6969697"
"112.39552","51.195656","1301832","0.6989247"
"112.09548","51.09565","1301848","0.70087975"
"111.75545","51.09565","1301865","0.70185727"
"111.29537","51.115654","1301882","0.7028348"
"111.20536","51.13565","1301898","0.6979472"
"111.20536","51.13565","1301915","0.6930596"
"111.435394","51.085648","1301932","0.6911046"
"111.58543","50.975636","1301944","0.6911046"
"111.58543","50.975636","1301965","0.6920821"
"111.58543","50.875626","1301982","0.6930596"
"111.34538","50.85562","1301998","0.69403714"
"111.04534","50.815617","1302015","0.69501466"
"110.635284","50.75561","1302032","0.6959922"
"110.635284","50.74561","1302048","0.69501466"
"110.635284","50.645596","1302065","0.6920821"
"110.87533","50.595592","1302082","0.6901271"
"111.105354","50.51558","1302098","0.68914956"
"111.21538","50.42557","1302115","0.6911046"
"111.11536","50.31556","1302132","0.6930596"
"110.90532","50.27556","1302148","0.6930596"
"110.54527","50.19555","1302165","0.69501466"
"110.44526","50.165546","1302182","0.69403714"
"110.34525","50.12554","1302198","0.69403714"
"110.34525","50.115543","1302215","0.6930596"
"110.34525","49.99553","1302226","0.6920821"
"110.34525","49.87551","1302248","0.6920821"
"110.34525","49.7755","1302258","0.6930596"
"110.305244","49.655487","1302282","0.6930596"
"110.15522","49.515472","1302298","0.6911046"
"109.91519","49.24544","1302315","0.68914956"
"109.51513","49.055424","1302332","0.68817204"
"109.175095","49.055424","1302348","0.68914956"
"108.80503","49.04542","1302365","0.68914956"
"108.44499","48.94541","1302382","0.68914956"
"108.16495","48.835396","1302398","0.68914956"
"107.92491","48.64538","1302415","0.6871945"
"107.91491","48.46536","1302432","0.6852395"
"108.02492","48.255333","1302448","0.6852395"
"108.16495","48.045315","1302465","0.686217"
"108.194954","47.955303","1302482","0.686217"
"108.23496","47.67527","1302498","0.68817204"
"108.05493","47.555256","1302515","0.68817204"
"107.784904","47.525253","1302532","0.68328446"
"107.474846","47.565258","1302548","0.6813294"
"107.15481","47.485245","1302565","0.684262"
"107.0748","47.33523","1302582","0.684262"
"107.0948","47.14521","1302598","0.68230695"
"107.224815","46.945194","1302615","0.68230695"
"107.27482","46.725166","1302632","0.68328446"
"107.32483","46.39513","1302648","0.6852395"
"107.32483","46.30512","1302665","0.686217"
"107.0448","46.1251","1302682","0.6871945"
"106.64474","46.065094","1302698","0.686217"
"105.80463","45.965076","1302715","0.6852395"
"105.25455","45.84507","1302732","0.68817204"
"104.9145","45.705048","1302748","0.6901271"
"104.904495","45.51503","1302765","0.68817204"
"105.364555","45.164993","1302782","0.6852395"
"105.784615","45.05498","1302798","0.68328446"
"106.01465","44.864956","1302815","0.684262"
"106.034645","44.67494","1302832","0.686217"
"105.874626","44.50492","1302848","0.68817204"
"105.40457","44.384907","1302865","0.6901271"
"104.41444","44.304897","1302882","0.6930596"
"103.96438","44.254894","1302898","0.6911046"
"103.87435","44.23489","1302915","0.68817204"
"104.04437","44.19488","1302932","0.684262"
"104.624466","44.04487","1302948","0.6813294"
"104.92451","43.92486","1302965","0.68328446"
"104.9445","43.804844","1302982","0.6871945"
"104.79447","43.72483","1302998","0.6911046"
"104.35442","43.674828","1303015","0.6920821"
"103.5043","43.63482","1303032","0.6920821"
"103.344284","43.63482","1303048","0.68817204"
"103.5343","43.62482","1303065","0.6803519"
"104.234406","43.584816","1303082","0.6725318"
"105.12453","43.4448","1303098","0.6666667"
"105.914635","43.304787","1303115","0.67057675"
"105.82462","43.204777","1303132","0.6793744"
"105.17454","43.17477","1303148","0.7038123"
"103.94436","43.164772","1303165","0.7253177"
"102.18412","43.204777","1303182","0.7086999"
"101.83408","43.284786","1303198","0.686217"
"101.9941","43.304787","1303215","0.66471165"
"102.794205","43.294785","1303232","0.6539589"
"103.87435","43.13477","1303248","0.6598241"
"104.55444","43.004753","1303265","0.6803519"
"104.444435","42.754726","1303282","0.6979472"
"103.79434","42.68472","1303298","0.7038123"
"102.91422","42.654716","1303315","0.7028348"
"101.97409","42.644714","1303332","0.69990224"
"101.88408","42.644714","1303348","0.68914956"
"102.18412","42.634712","1303365","0.6783969"
"102.724205","42.5147","1303382","0.67741936"
"103.30427","42.31468","1303398","0.6783969"
"103.65432","42.064648","1303415","0.68914956"
"103.40428","41.874626","1303432","0.6989247"
"102.90422","41.69461","1303448","0.7028348"
"102.27413","41.5846","1303465","0.70185727"
"101.574036","41.484585","1303482","0.69990224"
"101.484024","41.404575","1303498","0.6979472"
"101.50403","41.274563","1303515","0.69403714"
"101.67405","41.124546","1303532","0.6920821"
"101.78407","40.864517","1303548","0.69403714"
"101.93409","40.484474","1303565","0.6959922"
"101.93409","40.254448","1303582","0.6959922"
"101.89408","39.994423","1303598","0.6959922"
"101.69406","39.744392","1303615","0.6969697"
"101.45402","39.494366","1303632","0.6979472"
"101.11397","39.17433","1303648","0.7038123"
"100.99396","38.964306","1303665","0.7086999"
"100.88394","38.764286","1303682","0.70674485"
"100.81393","38.564262","1303698","0.70576733"
"100.79393","38.31423","1303715","0.71847504"
"100.70392","37.964195","1303732","0.7311828"
"100.683914","37.784176","1303748","0.7311828"
"100.65391","37.604156","1303765","0.7311828"
"100.58389","37.384132","1303782","0.7302053"
"100.31386","37.044094","1303798","0.72825027"
"100.103836","36.84407","1303815","0.72629523"
"99.973816","36.63405","1303832","0.7253177"
"99.95382","36.414024","1303848","0.7243402"
"99.973816","36.123993","1303865","0.72238517"
"100.11384","35.633938","1303882","0.72238517"
"100.17384","35.2939","1303898","0.72043014"
"100.19384","35.023872","1303915","0.7194526"
"100.08383","34.783844","1303932","0.71847504"
"99.683784","34.54382","1303948","0.7155425"
"99.30373","34.413807","1303965","0.71260995"
"99.003685","34.30379","1303982","0.7086999"
"98.923676","34.153774","1303997","0.70576733"
"99.05369","34.033764","1304015","0.7038123"
"99.513756","33.793736","1304032","0.70185727"
"99.77379","33.613716","1304048","0.7028348"
"99.79379","33.313683","1304065","0.6959922"
"99.663765","33.04365","1304082","0.71652"
"99.293724","32.983646","1304098","0.7419355"
"98.30359","32.83363","1304115","0.7370479"
"97.77351","32.773624","1304132","0.73313785"
"97.63349","32.73362","1304148","0.7302053"
"97.6235","32.623608","1304165","0.7253177"
"98.09356","32.49359","1304182","0.72140765"
"98.46361","32.363575","1304198","0.72238517"
"98.62363","32.18356","1304215","0.7233627"
"98.60363","31.963533","1304232","0.7243402"
"98.233574","31.683504","1304248","0.7243402"
"97.44347","31.443474","1304265","0.71847504"
"97.0334","31.38347","1304282","0.714565"
"96.933395","31.343466","1304298","0.70772237"
"97.04341","31.183447","1304315","0.69990224"
"97.49347","30.95342","1304332","0.6969697"
"98.3836","30.743397","1304348","0.6989247"
"98.73364","30.413359","1304365","0.70185727"
"98.74365","30.073324","1304382","0.70674485"
"98.3936","29.853298","1304398","0.70772237"
"97.45347","29.77329","1304415","0.70185727"
"96.88339","29.743288","1304432","0.69990224"
"96.60335","29.713284","1304448","0.6959922"
"96.60335","29.703283","1304465","0.68817204"
"96.82338","29.593273","1304482","0.6852395"
"97.273445","29.323242","1304498","0.686217"
"97.38345","28.9632","1304532","0.6911046"
"97.15343","28.803183","1304548","0.6901271"
"96.52334","28.643167","1304565","0.68817204"
"96.08328","28.59316","1304582","0.6920821"
"96.07328","28.433146","1304615","0.6783969"
"96.49333","28.323132","1304632","0.6686217"
"97.06341","28.053102","1304648","0.6666667"
"97.16343","27.973093","1304665","0.6686217"
"97.06341","27.583048","1304682","0.6686217"
"96.803375","27.303017","1304698","0.6930596"
"96.45333","27.223007","1304715","0.71847504"
"95.753235","27.183002","1304732","0.71847504"
"95.63321","27.183002","1304748","0.7174975"
"95.63321","27.082994","1304765","0.7106549"
"96.11327","26.802963","1304782","0.7038123"
"96.64335","26.532934","1304798","0.70185727"
"96.67336","26.31291","1304815","0.70674485"
"96.53334","26.122887","1304832","0.7106549"
"96.09327","26.002872","1304848","0.71358746"
"95.51321","25.942865","1304865","0.7155425"
"94.98312","25.722841","1304882","0.71163243"
"95.00313","25.632833","1304898","0.7038123"
"95.413185","25.51282","1304915","0.6959922"
"96.08328","25.182783","1304932","0.68914956"
"96.81338","24.832745","1304948","0.68914956"
"96.84338","24.602718","1304965","0.6959922"
"96.633354","24.442703","1304982","0.70185727"
"95.99327","24.422699","1304998","0.7038123"
"95.163155","24.422699","1305015","0.70576733"
"94.43305","24.35269","1305032","0.70185727"
"94.43305","24.33269","1305048","0.69501466"
"94.86311","24.192675","1305065","0.686217"
"95.5032","23.96265","1305082","0.684262"
"96.163284","23.672615","1305098","0.68230695"
"96.463326","23.552605","1305115","0.6871945"
"96.2233","23.472597","1305132","0.6920821"
"95.52319","23.492598","1305148","0.69501466"
"94.75309","23.612612","1305165","0.68817204"
"94.11301","23.562605","1305182","0.67741936"
"94.11301","23.552605","1305198","0.67057675"
"94.42304","23.44259","1305215","0.66471165"
"94.85311","23.292574","1305232","0.6783969"
"95.13315","23.162561","1305248","0.69403714"
"95.113144","23.022545","1305265","0.7047898"
"94.68308","22.932535","1305282","0.7086999"
"93.95299","22.912533","1305298","0.70772237"
"93.20289","22.912533","1305315","0.7047898"
"92.82283","22.89253","1305332","0.70185727"
"93.002846","22.782518","1305348","0.6920821"
"93.57293","22.642502","1305365","0.68817204"
"94.25303","22.462484","1305382","0.68914956"
"94.63307","22.332468","1305398","0.6930596"
"94.663086","22.202454","1305415","0.7038123"
"94.20302","22.102446","1305432","0.70576733"
"93.47292","22.09244","1305448","0.7047898"
"92.802826","22.09244","1305465","0.7028348"
"92.61279","22.09244","1305482","0.6959922"
"92.87283","21.96243","1305498","0.6901271"
"93.49292","21.772406","1305515","0.68817204"
"94.103","21.582386","1305532","0.68914956"
"94.363045","21.502377","1305548","0.69501466"
"94.26302","21.392365","1305565","0.69990224"
"93.4129","21.362362","1305582","0.70185727"
"92.5828","21.362362","1305598","0.70087975"
"91.9327","21.412367","1305615","0.69990224"
"91.65266","21.412367","1305632","0.6989247"
"91.65266","21.412367","1305648","0.6930596"
"91.962715","21.212345","1305665","0.6930596"
"92.15273","20.98232","1305682","0.69403714"
"92.17274","20.882309","1305698","0.6969697"
"91.80269","20.772295","1305715","0.70087975"
"91.2026","20.742292","1305732","0.70087975"
"90.61252","20.692287","1305748","0.70185727"
"90.31248","20.572273","1305765","0.69990224"
"90.34248","20.372253","1305782","0.69403714"
"91.21261","19.902199","1305798","0.6852395"
"91.98271","19.54216","1305815","0.684262"
"92.51279","19.292131","1305832","0.6901271"
"92.6628","19.202122","1305848","0.6989247"
"92.51279","19.102112","1305865","0.7028348"
"91.39263","19.112112","1305882","0.7047898"
"90.4125","19.212124","1305898","0.70674485"
"89.7424","19.212124","1305915","0.7028348"
"89.552376","19.212124","1305932","0.6989247"
"89.7424","19.09211","1305948","0.6969697"
"90.92256","18.672062","1305965","0.66471165"
"91.742676","18.402033","1305982","0.65884656"
"92.17274","18.202013","1305998","0.6617791"
"92.17274","18.112001","1306015","0.66959924"
"91.24261","18.081999","1306032","0.6725318"
"90.12245","18.081999","1306048","0.67155427"
"89.0023","18.142004","1306065","0.6735093"
"88.20219","18.162008","1306082","0.6744868"
"88.02216","18.162008","1306098","0.67155427"
"88.61224","17.74196","1306115","0.6598241"
"89.462364","17.27191","1306132","0.65884656"
"90.21246","16.791857","1306148","0.6608016"
"90.65253","16.441816","1306165","0.66471165"
"90.732544","16.211792","1306182","0.67057675"
"90.022446","15.991767","1306198","0.67546433"
"89.162315","15.9717655","1306215","0.67644185"
"88.33221","15.951763","1306232","0.67741936"
"87.912155","15.901757","1306248","0.67741936"
"88.122185","15.621727","1306265","0.66959924"
"88.73226","15.321693","1306282","0.6666667"
"89.37235","15.001659","1306298","0.6666667"
"89.7024","14.791635","1306315","0.67057675"
"89.69239","14.6816225","1306332","0.67644185"
"88.95229","14.591613","1306348","0.6783969"
"88.10217","14.57161","1306365","0.6793744"
"87.37207","14.531606","1306382","0.684262"
"86.97202","14.351587","1306396","0.68914956"
"87.03202","14.051554","1306415","0.686217"
"87.38207","13.811526","1306432","0.6920821"
"87.77213","13.511494","1306448","0.69990224"
"88.02216","13.221461","1306465","0.70185727"
"88.02216","13.041441","1306482","0.7047898"
"87.5821","12.941431","1306498","0.6725318"
"87.002014","12.891424","1306515","0.6725318"
"86.44195","12.84142","1306532","0.6735093"
"86.07189","12.721406","1306548","0.6686217"
"85.98188","12.611394","1306565","0.66373414"
"86.28192","12.231352","1306582","0.6627566"
"86.59197","11.971323","1306598","0.6676442"
"86.79199","11.771301","1306615","0.6686217"
"86.79199","11.651288","1306632","0.67057675"
"86.42194","11.581281","1306648","0.67155427"
"85.89187","11.531275","1306665","0.66373414"
"85.36179","11.491269","1306682","0.65591395"
"85.08176","11.421262","1306698","0.65591395"
"85.071754","11.291248","1306715","0.6539589"
"85.34179","11.041221","1306732","0.65102637"
"85.59183","10.821197","1306748","0.65004885"
"85.67184","10.721185","1306765","0.65102637"
"85.69183","10.59117","1306782","0.6529814"
"85.461815","10.511162","1306798","0.6539589"
"84.76172","10.411151","1306815","0.6529814"
"84.20164","10.381147","1306832","0.6539589"
"83.811584","10.361145","1306848","0.6539589"
"83.71157","10.331141","1306865","0.6520039"
"83.83158","10.13112","1306882","0.65004885"
"83.99161","10.021108","1306898","0.64907134"
"84.12163","9.911096","1306915","0.64907134"
"84.12163","9.911096","1306948","0.65004885"
"84.101616","9.821086","1306965","0.6480938"
"83.981606","9.851089","1306982","0.6471163"
"83.981606","9.871091","1306998","0.6451613"
"84.01161","10.0111065","1307015","0.64320624"
"84.351654","10.141121","1307032","0.64418375"
"84.351654","10.141121","1307041","0.6461388"
"84.351654","10.141121","1307065","0.65004885"
"84.351654","10.04111","1307082","0.6529814"
"84.25164","9.951099","1307098","0.65689147"
"83.82159","9.481049","1307115","0.6627566"
"83.381516","9.151012","1307132","0.6686217"
"82.94147","8.910985","1307148","0.6676442"
"82.461395","8.740967","1307165","0.68328446"
"82.461395","8.740967","1307182","0.6803519"
"82.461395","8.740967","1307198","0.6920821"
"82.461395","8.740967","1307215","0.68914956"
"82.461395","8.740967","1307232","0.66959924"
"82.461395","8.740967","1307248","0.67057675"
"82.961464","8.570948","1307265","0.6930596"
"82.961464","8.570948","1307282","0.69990224"
"82.56141","8.350924","1307298","0.70087975"
"81.90132","8.340922","1307315","0.70185727"
"81.0712","8.370925","1307332","0.6979472"
"80.39111","8.480937","1307342","0.6930596"
"80.39111","8.480937","1307365","0.6871945"
"80.39111","8.480937","1307382","0.68328446"
"81.68129","8.230909","1307398","0.684262"
"82.73143","8.040889","1307415","0.68230695"
"83.74158","7.9908834","1307432","0.6871945"
"83.74158","7.970881","1307448","0.69501466"
"83.2215","7.9408774","1307465","0.70185727"
"80.3811","8.110896","1307498","0.70185727"
"79.96105","8.200907","1307515","0.6989247"
"79.96105","8.200907","1307532","0.6656892"
"80.81117","8.040889","1307565","0.67644185"
"81.71129","7.9008737","1307582","0.66959924"
"82.27137","7.760858","1307598","0.67155427"
"82.27137","7.760858","1307615","0.6744868"
"81.85131","7.760858","1307632","0.6783969"
"80.95119","7.970881","1307648","0.686217"
"79.56099","8.280915","1307665","0.69501466"
"79.06093","8.390927","1307682","0.6930596"
"79.06093","8.390927","1307698","0.68914956"
"79.06093","8.390927","1307715","0.6852395"
"79.06093","8.390927","1307720","0.684262"
"79.33096","8.810974","1307765","0.65884656"
"79.33096","8.810974","1307776","0.6334311"
"79.25095","9.241021","1307798","0.6334311"
"79.24095","9.521052","1307815","0.6353861"
"79.38097","9.871091","1307831","0.6353861"
"79.65101","10.13112","1307848","0.6353861"
"79.931046","10.321141","1307865","0.6353861"
"80.191086","10.571168","1307881","0.63734114"
"80.191086","10.711184","1307898","0.6402737"
"79.99106","10.881204","1307915","0.64320624"
"79.48098","11.051223","1307931","0.6471163"
"78.73088","11.221241","1307948","0.65004885"
"77.63073","11.371257","1307965","0.6529814"
"77.13066","11.391259","1307981","0.65493643"
"76.98064","11.391259","1307998","0.65493643"
"76.98064","11.391259","1308015","0.65102637"
"77.16067","11.281246","1308031","0.6480938"
"77.65073","11.181236","1308048","0.64907134"
"77.76074","11.141231","1308065","0.65004885"
"77.76074","11.141231","1308081","0.6520039"
"77.270676","11.161234","1308098","0.6539589"
"75.960495","11.281246","1308115","0.627566"
"74.96036","11.341253","1308131","0.62463343"
"74.13025","11.391259","1308148","0.62658846"
"73.73019","11.391259","1308165","0.62561095"
"73.87021","11.391259","1308181","0.61974585"
"75.02036","11.381258","1308198","0.61290324"
"76.07051","11.331253","1308215","0.61485827"
"77.03064","11.291248","1308231","0.63147604"
"77.70074","11.291248","1308248","0.64320624"
"77.87076","11.31125","1308265","0.6480938"
"77.66073","11.591281","1308281","0.6529814"
"77.12065","11.981325","1308298","0.6539589"
"76.52058","12.4813795","1308315","0.6422287"
"76.11052","12.921429","1308331","0.62463343"
"75.9805","13.361477","1308348","0.6392962"
"76.15052","13.591501","1308365","0.66373414"
"76.470566","13.781523","1308381","0.6783969"
"76.83062","13.941541","1308398","0.684262"
"77.11066","14.081556","1308415","0.67546433"
"77.24068","14.371588","1308431","0.686217"
"77.12065","14.6816225","1308448","0.6959922"
"76.90063","14.961653","1308465","0.69990224"
"76.7106","15.191679","1308481","0.70087975"
"76.7106","15.511713","1308498","0.6969697"
"77.050644","15.741739","1308515","0.6969697"
"77.65073","15.961763","1308531","0.6959922"
"78.44084","16.141785","1308548","0.6959922"
"79.18094","16.301802","1308565","0.6969697"
"79.73102","16.521826","1308581","0.69990224"
"79.64101","16.74185","1308598","0.70576733"
"79.160934","17.021881","1308615","0.7106549"
"78.36083","17.411924","1308631","0.71260995"
"77.600716","17.811968","1308648","0.71358746"
"77.16067","18.27202","1308665","0.70772237"
"77.26068","18.492044","1308681","0.7038123"
"77.68073","18.622059","1308698","0.70185727"
"78.32082","18.752073","1308715","0.71163243"
"79.25095","18.842081","1308731","0.72140765"
"79.54099","18.952093","1308748","0.7086999"
"79.53099","19.042105","1308765","0.6989247"
"79.14094","19.252129","1308781","0.7253177"
"78.47085","19.572165","1308798","0.7497556"
"77.58072","19.942204","1308815","0.7487781"
"77.4307","20.132225","1308831","0.74486804"
"77.58072","20.322245","1308848","0.742913"
"78.070786","20.572273","1308865","0.73998046"
"79.20095","20.902311","1308881","0.740958"
"79.81103","21.07233","1308898","0.742913"
"80.08107","21.17234","1308915","0.74486804"
"80.08107","21.17234","1308931","0.7487781"
"79.79103","21.362362","1308948","0.75171065"
"79.130936","21.81241","1308965","0.75171065"
"78.8509","22.102446","1308981","0.75073314"
"78.86089","22.392475","1308998","0.7487781"
"79.20095","22.662506","1309015","0.74486804"
"79.74102","22.872528","1309031","0.7438905"
"80.58113","23.012545","1309048","0.74486804"
"80.941185","23.122555","1309065","0.74584556"
"81.0612","23.26257","1309081","0.7487781"
"81.0412","23.352581","1309098","0.75268817"
"80.79117","23.482595","1309115","0.7546432"
"80.68115","23.652613","1309131","0.7536657"
"80.70115","23.852636","1309148","0.7536657"
"81.0412","24.08266","1309165","0.7360704"
"81.59128","24.282684","1309181","0.73313785"
"82.411385","24.502707","1309198","0.75073314"
"82.76143","24.62272","1309215","0.75171065"
"82.851456","24.642725","1309231","0.7536657"
"82.73143","24.892752","1309248","0.75855327"
"82.32138","25.202787","1309265","0.76441836"
"81.43126","25.50282","1309281","0.76441836"
"81.0612","25.632833","1309298","0.76344085"
"81.16122","25.832855","1309315","0.7595308"
"81.691284","26.222898","1309331","0.75757575"
"83.06148","26.532934","1309348","0.75855327"
"84.04162","26.562935","1309365","0.75855327"
"84.6617","26.622942","1309381","0.7605083"
"84.781715","26.642946","1309398","0.7663734"
"84.6317","26.762959","1309415","0.7771261"
"83.76157","27.05299","1309431","0.78494626"
"83.1915","27.363026","1309448","0.78494626"
"83.051476","27.52304","1309465","0.77028346"
"83.33151","27.703062","1309481","0.7487781"
"84.64169","27.913086","1309498","0.7380254"
"85.51182","28.003094","1309515","0.7380254"
"86.091896","28.0331","1309531","0.73900294"
"86.22192","28.053102","1309548","0.7438905"
"85.51182","28.293127","1309565","0.76344085"
"84.651695","28.543156","1309581","0.7683284"
"83.83158","28.833187","1309598","0.7673509"
"83.56155","29.073214","1309615","0.76246333"
"83.9716","29.303238","1309631","0.75659823"
"84.98174","29.41325","1309648","0.7556207"
"86.801994","29.423252","1309665","0.7546432"
"87.45209","29.383251","1309681","0.75659823"
"87.55209","29.373245","1309698","0.76246333"
"87.12204","29.40325","1309715","0.7722385"
"85.631836","29.753288","1309731","0.78299123"
"84.79172","30.053322","1309748","0.78201365"
"84.531685","30.293348","1309765","0.7790811"
"84.81172","30.483372","1309781","0.77517104"
"85.631836","30.693394","1309798","0.77028346"
"87.02203","30.84341","1309815","0.7673509"
"87.42208","30.84341","1309831","0.77028346"
"87.42208","30.84341","1309848","0.7781036"
"87.15205","30.923418","1309865","0.78103614"
"86.551956","31.083435","1309881","0.78299123"
"85.76185","31.333464","1309898","0.7859238"
"85.72184","31.423471","1309915","0.78299123"
"86.18191","31.643496","1309931","0.7771261"
"86.98202","31.703503","1309948","0.77517104"
"88.19219","31.743507","1309965","0.7790811"
"88.662254","31.793516","1309981","0.78201365"
"88.662254","31.793516","1309998","0.78494626"
"88.53224","31.873524","1310015","0.7878788"
"88.10217","31.903526","1310031","0.78983384"
"87.6221","32.143555","1310048","0.7859238"
"87.64212","32.253563","1310065","0.78494626"
"88.072174","32.40358","1310081","0.7859238"
"88.77226","32.533592","1310098","0.7869013"
"89.62238","32.67361","1310115","0.79081136"
"89.752396","32.813625","1310131","0.799609"
"89.6524","33.04365","1310148","0.78396875"
"89.26234","33.063656","1310165","0.7859238"
"88.88228","33.12366","1310181","0.78103614"
"88.872284","33.4437","1310198","0.75171065"
"89.452354","33.603714","1310215","0.75073314"
"90.272484","33.713726","1310231","0.7536657"
"91.03258","33.84374","1310248","0.75268817"
"91.45264","33.943752","1310261","0.75268817"
"91.1826","33.963753","1310281","0.75855327"
"90.552505","34.003757","1310298","0.76246333"
"90.03244","34.11377","1310315","0.7468231"
"89.87242","34.32379","1310331","0.5542522"
"90.78254","34.62383","1310344","0.060606062"
"92.322754","34.83385","1310394","0.060606062"
"92.322754","34.83385","1310394","0.060606062"
