"74.85035","10.651177","257577","0.0342131"
"74.58031","10.051111","257606","0.08993158"
"74.21026","9.020997","257656","0.15347019"
"73.89021","8.150901","257689","0.20039101"
"73.89021","7.700851","257723","0.18475074"
"73.89021","7.700851","257739","0.18084067"
"74.150246","7.2708035","257756","0.18768328"
"74.150246","7.2708035","257773","0.17204301"
"74.700325","7.1307883","257789","0.16715543"
"74.700325","7.1307883","257806","0.16324535"
"75.240395","7.110786","257823","0.15738025"
"75.68046","7.1007843","257839","0.1603128"
"76.090515","7.120787","257856","0.1652004"
"76.6906","7.290806","257873","0.1710655"
"77.13066","7.290806","257889","0.16911046"
"79.37097","7.880871","257939","0.18572825"
"79.831024","8.040889","257956","0.18670577"
"80.29109","8.200907","257973","0.19061583"
"80.731155","8.4009285","257989","0.19843598"
"81.14121","8.630954","258006","0.20723362"
"81.581276","8.880981","258023","0.2111437"
"82.06134","9.040999","258039","0.21603128"
"82.77144","9.531054","258056","0.21994135"
"83.181496","10.0111065","258073","0.21603128"
"83.811584","10.6011715","258089","0.21603128"
"84.26164","11.011217","258106","0.22482893"
"84.7217","11.40126","258123","0.2346041"
"85.23178","11.861311","258139","0.24633431"
"85.95188","12.731407","258156","0.26979473"
"86.381935","13.39148","258173","0.27859238"
"86.832","14.041553","258189","0.285435"
"87.302055","14.561609","258206","0.2913001"
"87.79213","15.001659","258223","0.29521015"
"88.51224","15.75174","258239","0.30107528"
"88.93229","16.251797","258256","0.30498534"
"89.34234","16.781855","258273","0.31280547"
"89.7424","17.321915","258289","0.32258064"
"90.21246","17.90198","258306","0.32942328"
"90.99258","18.662064","258323","0.34506354"
"91.46265","19.152117","258339","0.3597263"
"91.952705","19.61217","258356","0.3655914"
"92.40277","20.072218","258373","0.3714565"
"93.06286","20.752295","258389","0.3841642"
"93.50293","21.242348","258406","0.3929619"
"93.92298","21.7224","258423","0.40078202"
"94.313034","22.212456","258439","0.40469208"
"94.663086","22.752514","258456","0.40860215"
"95.27316","23.322577","258473","0.4173998"
"95.52319","23.812632","258489","0.427175"
"95.73323","24.23268","258506","0.4467253"
"96.44332","25.572826","258539","0.48289344"
"96.74337","26.082882","258556","0.49266863"
"96.963394","26.69295","258573","0.47214076"
"97.213425","27.263016","258589","0.45552298"
"97.53347","27.823078","258606","0.48387095"
"97.74351","28.623161","258623","0.51710653"
"97.99354","29.13322","258639","0.5288367"
"98.30359","29.743288","258656","0.5415445"
"98.60363","30.363356","258673","0.5542522"
"98.873665","30.95342","258689","0.5669599"
"99.28372","31.76351","258706","0.5904203"
"99.503746","32.18356","258723","0.6060606"
"99.69377","32.5836","258739","0.61974585"
"99.883804","33.163666","258756","0.6119257"
"100.093834","33.963753","258773","0.6041056"
"100.343864","34.3938","258789","0.6109482"
"100.5539","34.85385","258806","0.61876833"
"100.78392","35.36391","258823","0.62561095"
"101.00396","35.91397","258839","0.629521"
"101.324005","36.63405","258856","0.6344086"
"101.55403","37.054096","258873","0.6363636"
"101.80407","37.47414","258889","0.6402737"
"102.0541","37.974197","258906","0.6304985"
"102.424164","38.44425","258923","0.61974585"
"102.86421","39.054317","258939","0.6226784"
"103.16425","39.45436","258956","0.6236559"
"103.5043","39.864407","258973","0.62561095"
"103.84435","40.274452","258989","0.627566"
"104.34441","40.834515","259006","0.63147604"
"104.624466","41.24456","259023","0.63245356"
"104.88449","41.654602","259039","0.6344086"
"105.07452","42.034645","259056","0.6334311"
"105.21455","42.394688","259073","0.63147604"
"105.534584","42.934746","259089","0.629521"
"105.77461","43.284786","259106","0.61974585"
"106.00465","43.64482","259123","0.61974585"
"106.22468","44.024864","259139","0.6217009"
"106.54473","44.644936","259156","0.62463343"
"106.77476","44.934967","259173","0.62463343"
"107.02479","45.265003","259189","0.62463343"
"107.26482","45.75506","259206","0.62561095"
"107.50486","46.205105","259223","0.62561095"
"107.88491","46.875183","259239","0.62463343"
"108.12494","47.185215","259256","0.63147604"
"108.34497","47.39524","259273","0.6334311"
"108.555","47.68527","259289","0.62658846"
"108.75503","48.075314","259306","0.62658846"
"109.05507","48.605373","259323","0.62561095"
"109.27511","48.94541","259339","0.62561095"
"109.50513","49.125427","259356","0.62561095"
"109.74516","49.30545","259372","0.62561095"
"110.095215","49.7755","259389","0.62561095"
"110.31525","50.075535","259406","0.62463343"
"110.515274","50.345562","259422","0.6236559"
"110.71531","50.575592","259439","0.6236559"
"110.93533","50.775608","259456","0.6226784"
"111.26538","51.02564","259472","0.6226784"
"111.45541","51.215664","259489","0.6217009"
"111.63542","51.39568","259506","0.61974585"
"111.85546","51.5957","259522","0.61974585"
"112.09548","51.845734","259539","0.61876833"
"112.46554","52.215775","259556","0.6158358"
"112.73557","52.42579","259572","0.61485827"
"112.99562","52.535805","259589","0.61388075"
"113.24565","52.725834","259606","0.61388075"
"113.6057","52.99586","259622","0.61290324"
"113.85573","53.19588","259639","0.6109482"
"114.105774","53.425903","259656","0.6089932"
"114.35581","53.64593","259672","0.60801566"
"114.68585","53.92596","259689","0.6109482"
"115.23592","54.346004","259706","0.6158358"
"115.55597","54.596035","259722","0.6177908"
"115.776","54.776054","259739","0.6158358"
"116.006035","54.986076","259756","0.61388075"
"116.35607","55.276108","259772","0.6099707"
"116.596115","55.446125","259789","0.60801566"
"116.82615","55.606148","259806","0.60703814"
"117.03618","55.71616","259822","0.6050831"
"117.27621","55.896183","259839","0.6031281"
"117.686264","56.17621","259856","0.6001955"
"117.986305","56.336227","259872","0.599218"
"118.29634","56.44624","259889","0.5982405"
"118.576385","56.556248","259906","0.597263"
"118.826416","56.766277","259922","0.6041056"
"119.22648","56.976295","259939","0.6285435"
"119.46651","57.206326","259956","0.6177908"
"119.70655","57.40635","259972","0.60703814"
"119.92657","57.53636","259989","0.6050831"
"120.1366","57.64637","260006","0.60703814"
"120.336624","57.776382","260022","0.6099707"
"120.61667","57.9264","260039","0.61290324"
"120.78669","58.096424","260056","0.6168133"
"120.98672","58.26644","260072","0.61485827"
"121.34677","58.53647","260089","0.6119257"
"121.5868","58.696487","260106","0.6099707"
"121.71682","58.8165","260122","0.6089932"
"121.81683","59.02652","260139","0.60703814"
"121.93685","59.206547","260156","0.6060606"
"122.16688","59.53658","260172","0.6031281"
"122.36691","59.746605","260189","0.60215056"
"122.57694","59.98663","260206","0.6001955"
"122.73696","60.236656","260222","0.599218"
"122.94699","60.616703","260239","0.5982405"
"123.08701","60.856724","260256","0.59628546"
"123.177025","61.10676","260272","0.60215056"
"123.27704","61.35678","260289","0.60703814"
"123.467064","61.606808","260306","0.6050831"
"123.70709","62.046852","260322","0.6304985"
"123.85712","62.31689","260339","0.6334311"
"123.99713","62.566917","260356","0.62463343"
"124.11714","62.806946","260372","0.62463343"
"124.24718","63.14698","260389","0.6236559"
"124.34718","63.337","260406","0.6217009"
"124.4472","63.52702","260422","0.62072337"
"124.49721","63.73705","260439","0.62072337"
"124.53722","63.98707","260456","0.61974585"
"124.57722","64.387115","260472","0.61974585"
"124.59721","64.60714","260489","0.61876833"
"124.617226","64.70715","260506","0.61876833"
"124.617226","64.86717","260522","0.6177908"
"124.607216","65.00719","260539","0.61876833"
"124.477196","65.28722","260556","0.61876833"
"124.387184","65.41724","260572","0.61876833"
"124.34718","65.527245","260589","0.6168133"
"124.23717","65.62725","260606","0.61290324"
"124.11714","65.73727","260622","0.6099707"
"123.98714","65.82728","260639","0.60703814"
"123.85712","65.87728","260656","0.6001955"
"123.73711","65.87728","260672","0.5894428"
"123.65708","65.77727","260689","0.57380253"
"123.28703","65.38723","260706","0.56891495"
"123.027","65.1772","260722","0.56402737"
"122.72695","64.92718","260739","0.55718476"
"122.43693","64.60714","260756","0.5532747"
"122.17688","64.2471","260772","0.55034214"
"121.70681","63.667038","260789","0.5542522"
"121.39678","63.36701","260806","0.5601173"
"121.00672","63.116974","260822","0.56402737"
"120.67667","62.866947","260839","0.56793743"
"120.336624","62.436897","260856","0.5659824"
"120.01658","62.116867","260872","0.56891495"
"119.68654","61.736824","260889","0.55718476"
"119.3865","61.29678","260906","0.5483871"
"119.12646","60.88673","260922","0.55034214"
"118.74641","60.42668","260939","0.55718476"
"118.50638","60.186653","260956","0.5601173"
"118.29634","59.966625","260972","0.5601173"
"118.09631","59.746605","260989","0.5601173"
"117.82629","59.49658","261006","0.5610948"
"117.70626","59.46657","261022","0.5601173"
"117.70626","59.44657","261039","0.5581623"
"117.61626","59.586582","261056","0.55620724"
"117.596245","59.84661","261072","0.5552297"
"117.57625","60.306667","261089","0.5552297"
"117.606255","60.606697","261106","0.5542522"
"117.71628","60.88673","261122","0.5542522"
"117.9163","61.176765","261139","0.5532747"
"118.026306","61.496796","261156","0.5581623"
"118.326355","61.956852","261172","0.57087"
"118.446365","62.23688","261189","0.56402737"
"118.55637","62.49691","261206","0.5601173"
"118.71641","62.706932","261222","0.5610948"
"119.06646","63.01696","261239","0.5591398"
"119.30649","63.216988","261256","0.5581623"
"119.52652","63.41701","261272","0.55718476"
"119.75655","63.60703","261289","0.5552297"
"119.89657","63.807053","261306","0.5581623"
"120.22661","64.147095","261322","0.56304985"
"120.43664","64.43712","261339","0.56304985"
"120.636665","64.717155","261356","0.56793743"
"120.79669","64.98718","261372","0.57087"
"121.06673","65.26722","261389","0.57087"
"121.37677","65.68726","261406","0.5718475"
"121.45678","65.92729","261422","0.56989247"
"121.5568","66.15731","261439","0.56891495"
"121.68681","66.41734","261456","0.572825"
"121.98686","66.83739","261472","0.58064514"
"122.046875","67.13741","261489","0.57575756"
"122.12687","67.44746","261506","0.56891495"
"122.13689","67.70749","261522","0.56989247"
"122.13689","67.93751","261539","0.57087"
"122.09687","68.257545","261556","0.572825"
"122.05686","68.40756","261572","0.5767351"
"121.956856","68.507576","261589","0.5796676"
"121.80683","68.53758","261606","0.58162266"
"121.51679","68.55758","261622","0.5796676"
"121.34677","68.38756","261639","0.57575756"
"121.12674","68.11753","261656","0.5767351"
"120.78669","67.76749","261672","0.58064514"
"120.51665","67.36745","261689","0.5845552"
"120.086586","66.67737","261706","0.57478005"
"119.69653","66.21732","261722","0.572825"
"119.31649","65.79727","261739","0.5767351"
"118.96644","65.41724","261756","0.58162266"
"118.626396","65.01718","261772","0.5845552"
"118.15633","64.29711","261789","0.5845552"
"117.906296","63.827057","261806","0.5845552"
"117.62626","63.447018","261822","0.5884653"
"117.316216","63.08697","261839","0.5913978"
"116.87616","62.63693","261856","0.59530795"
"116.61611","62.376896","261872","0.5982405"
"116.35607","62.10687","261889","0.6060606"
"116.10604","61.836838","261906","0.60801566"
"115.86601","61.646812","261922","0.6001955"
"115.51596","61.496796","261939","0.599218"
"115.21592","61.37678","261956","0.59530795"
"114.90588","61.32678","261972","0.59237534"
"114.60584","61.266773","261989","0.58748776"
"114.43582","61.236767","262006","0.5826002"
"114.19579","61.216763","262022","0.58162266"
"114.19579","61.216763","262039","0.5796676"
"114.105774","61.32678","262055","0.5786901"
"114.105774","61.43679","262072","0.5777126"
"114.185776","61.846836","262089","0.58748776"
"114.37581","62.23688","262106","0.5894428"
"114.725845","62.606915","262122","0.58748776"
"115.16591","62.946957","262139","0.59530795"
"115.50596","63.296997","262156","0.5982405"
"115.846016","63.86706","262172","0.59433043"
"116.05603","64.2271","262189","0.59237534"
"116.22607","64.55714","262206","0.5913978"
"116.36608","64.877174","262222","0.5913978"
"116.5061","65.34722","262239","0.5913978"
"116.63612","65.657265","262256","0.5894428"
"116.82615","65.94729","262272","0.58748776"
"116.936165","66.227325","262289","0.5855327"
"117.136185","66.53735","262306","0.5913978"
"117.41623","66.9674","262322","0.59530795"
"117.62626","67.22743","262339","0.5894428"
"117.806274","67.487465","262356","0.5845552"
"117.936295","67.71748","262372","0.5845552"
"117.986305","67.967514","262389","0.5845552"
"118.20632","68.32755","262406","0.5835777"
"118.31636","68.56758","262422","0.58162266"
"118.45637","68.79761","262439","0.58064514"
"118.59638","69.03763","262456","0.58064514"
"118.736404","69.44767","262472","0.5786901"
"118.826416","69.74771","262489","0.5786901"
"118.86643","70.047745","262506","0.58064514"
"118.86643","70.327774","262522","0.58064514"
"118.85643","70.577805","262539","0.5826002"
"118.786415","70.76782","262556","0.5855327"
"118.68639","70.90784","262572","0.58748776"
"118.59638","70.95784","262589","0.5904203"
"118.496376","70.977844","262606","0.5913978"
"118.366356","70.977844","262622","0.5894428"
"118.116325","70.697815","262639","0.5884653"
"117.936295","70.43778","262656","0.5894428"
"117.696266","70.087746","262672","0.59237534"
"117.38622","69.6577","262689","0.59628546"
"116.91615","69.09764","262706","0.60215056"
"116.346085","68.38756","262739","0.60703814"
"116.03603","67.977516","262756","0.60801566"
"115.72599","67.58747","262772","0.6119257"
"115.20592","67.03741","262789","0.6177908"
"114.78587","66.69737","262806","0.6089932"
"114.48582","66.387344","262822","0.5982405"
"114.2958","66.03729","262839","0.599218"
"114.01575","65.45723","262856","0.60117304"
"113.81573","65.1372","262872","0.6031281"
"113.6057","64.84717","262889","0.6050831"
"113.40567","64.59714","262906","0.6060606"
"113.20565","64.387115","262922","0.60801566"
"113.01562","64.2171","262935","0.60801566"
"112.8556","64.07708","262956","0.60703814"
"112.59556","63.947063","262972","0.60801566"
"112.38553","63.887062","262989","0.6089932"
"112.18549","63.847054","263006","0.6089932"
"112.075485","63.837055","263022","0.60703814"
"111.96548","63.967068","263039","0.6041056"
"111.93546","64.147095","263056","0.60215056"
"111.92547","64.40712","263072","0.6001955"
"112.14549","65.00719","263089","0.59628546"
"112.46554","65.487236","263106","0.59433043"
"112.795586","65.94729","263122","0.5913978"
"113.11564","66.39734","263139","0.59433043"
"113.40567","66.827385","263156","0.597263"
"113.75572","67.45746","263172","0.5913978"
"113.925735","67.847496","263189","0.59237534"
"114.08577","68.22754","263206","0.59237534"
"114.26579","68.59758","263222","0.59237534"
"114.475815","68.95763","263239","0.5913978"
"114.81587","69.477684","263256","0.59433043"
"115.00589","69.81772","263272","0.60117304"
"115.0559","70.14775","263289","0.60117304"
"115.16591","70.457794","263306","0.6001955"
"115.31593","70.89784","263322","0.60703814"
"115.42595","71.147865","263339","0.6109482"
"115.46595","71.40789","263356","0.6168133"
"115.51596","71.63792","263371","0.6226784"
"115.51596","71.81794","263389","0.61974585"
"115.42595","71.99796","263406","0.61388075"
"115.25592","72.11797","263422","0.6119257"
"114.98589","72.21798","263439","0.60801566"
"114.75586","72.247986","263456","0.6041056"
"114.50582","72.25799","263472","0.60215056"
"114.2958","72.09797","263489","0.60215056"
"114.04576","71.81794","263506","0.6089932"
"113.74572","71.39789","263522","0.6099707"
"113.42567","70.96784","263539","0.60801566"
"112.8456","70.37778","263556","0.61388075"
"112.35553","69.94773","263572","0.6177908"
"111.895454","69.477684","263589","0.62072337"
"111.565414","68.97762","263606","0.6217009"
"111.28538","68.44756","263622","0.62561095"
"110.945335","67.67748","263639","0.63147604"
"110.735306","67.197426","263656","0.63831866"
"110.57529","66.707375","263672","0.63734114"
"110.435265","66.21732","263689","0.63245356"
"110.175224","65.49724","263706","0.6353861"
"109.87518","65.04719","263722","0.6363636"
"109.56514","64.61714","263739","0.63831866"
"109.36511","64.2171","263756","0.6422287"
"109.14508","63.847054","263772","0.6422287"
"108.80503","63.296997","263789","0.6422287"
"108.575","62.946957","263806","0.64418375"
"108.31496","62.606915","263822","0.6451613"
"108.05493","62.176872","263839","0.65102637"
"107.8049","61.66682","263856","0.6471163"
"107.43485","60.996742","263872","0.6412512"
"107.174805","60.616703","263889","0.6412512"
"106.92477","60.226658","263906","0.64320624"
"106.70475","59.806606","263922","0.64418375"
"106.49472","58.956512","263939","0.64418375"
"106.3847","58.45646","263956","0.6451613"
"106.26469","58.066418","263972","0.6461388"
"106.14467","57.72638","263989","0.6461388"
"106.06466","57.42635","264006","0.6471163"
"105.98464","56.726273","264022","0.64907134"
"105.97465","56.17621","264039","0.6412512"
"105.964645","55.866177","264056","0.6334311"
"105.93463","55.55614","264072","0.6344086"
"105.85463","55.076088","264089","0.6353861"
"105.77461","54.69605","264106","0.6363636"
"105.68459","54.236","264122","0.63734114"
"105.55459","53.72594","264139","0.6392962"
"105.414566","53.285892","264156","0.6412512"
"105.10453","52.755833","264172","0.6480938"
"104.8745","52.41579","264189","0.6539589"
"104.734474","52.02575","264206","0.6539589"
"104.55444","51.655712","264222","0.65493643"
"104.364426","51.275665","264239","0.65004885"
"104.104385","50.675602","264256","0.65591395"
"103.90435","50.245556","264272","0.65689147"
"103.70433","49.755497","264289","0.65689147"
"103.514305","49.365456","264306","0.65786904"
"103.20426","48.975414","264322","0.6598241"
"102.95423","48.575367","264339","0.6608016"
"102.70419","48.20533","264356","0.6617791"
"102.46416","47.84529","264372","0.6627566"
"102.24413","47.60526","264389","0.6656892"
"101.92408","47.265224","264406","0.6598241"
"101.68405","46.96519","264422","0.6608016"
"101.45402","46.615154","264439","0.6617791"
"101.20399","46.205105","264456","0.6608016"
"100.933945","45.79506","264472","0.6617791"
"100.49389","45.174995","264489","0.6627566"
"100.17384","44.854958","264506","0.6686217"
"99.82379","44.464912","264522","0.67546433"
"99.463745","44.034866","264539","0.67644185"
"98.913666","43.474804","264556","0.67644185"
"98.69364","43.13477","264572","0.68230695"
"98.283585","42.834732","264589","0.6871945"
"97.77351","42.5247","264606","0.6852395"
"97.40346","42.14466","264622","0.684262"
"96.853386","41.484585","264639","0.684262"
"96.39332","41.064537","264656","0.6901271"
"95.94326","40.7045","264672","0.6989247"
"95.59321","40.414467","264689","0.6979472"
"95.09314","39.994423","264706","0.6930596"
"94.75309","39.69439","264722","0.6920821"
"94.38304","39.36435","264739","0.6920821"
"93.99299","39.024315","264756","0.68914956"
"93.52293","38.704277","264772","0.6871945"
"92.88284","37.9842","264789","0.69403714"
"92.53279","37.574154","264806","0.7038123"
"92.19274","37.224113","264822","0.7028348"
"91.85269","36.874077","264839","0.69990224"
"90.84256","35.843964","264872","0.69403714"
"90.08245","34.77384","264906","0.6911046"
"89.722404","34.3938","264922","0.6871945"
"89.172325","33.873745","264939","0.68328446"
"88.81227","33.533707","264956","0.67741936"
"88.402214","32.93364","264972","0.6666667"
"88.00216","32.353577","264989","0.68230695"
"87.64212","32.03354","265006","0.70576733"
"87.09204","31.50348","265022","0.70185727"
"86.73199","31.10344","265039","0.69990224"
"86.39194","30.623384","265056","0.69501466"
"85.99188","30.093327","265072","0.6920821"
"85.531815","29.603273","265089","0.6930596"
"84.941734","28.933199","265106","0.69403714"
"84.56168","28.483149","265122","0.6901271"
"84.15163","28.0331","265139","0.686217"
"83.681564","27.653057","265156","0.68230695"
"83.03147","27.022987","265172","0.71847504"
"82.671425","26.472927","265189","0.7174975"
"82.291374","25.962872","265206","0.71652"
"81.89131","25.562826","265222","0.71652"
"81.48126","25.012766","265239","0.714565"
"80.88118","24.162672","265256","0.71358746"
"80.53113","23.652613","265272","0.71260995"
"80.20108","23.042545","265289","0.71260995"
"79.86103","22.392475","265306","0.71163243"
"79.51098","21.742403","265322","0.7106549"
"78.960915","20.862307","265339","0.7096774"
"78.66087","20.35225","265356","0.70772237"
"78.40083","19.802189","265372","0.70576733"
"78.1708","19.242126","265389","0.6979472"
"77.80075","18.46204","265406","0.68230695"
"77.530716","17.931982","265422","0.6744868"
"77.270676","17.331915","265439","0.6744868"
"77.04064","16.64184","265455","0.6735093"
"76.86063","16.051775","265472","0.6725318"
"76.560585","15.311692","265489","0.66471165"
"76.340546","14.781634","265505","0.65786904"
"76.20053","14.211572","265522","0.65004885"
"75.9905","13.711516","265539","0.6402737"
"75.74046","13.011439","265555","0.59433043"
"75.580444","12.4813795","265572","0.59433043"
"75.44042","11.931318","265589","0.59433043"
"75.2804","11.381258","265605","0.59433043"
"75.080376","10.881204","265622","0.59335285"
"74.80034","10.111117","265639","0.59237534"
"74.61031","9.631064","265655","0.59237534"
"74.48029","9.23102","265672","0.5913978"
"74.48029","9.23102","265689","0.62561095"
"74.34027","8.680959","265705","0.6520039"
"74.100235","8.180904","265722","0.40860215"
"74.100235","8.180904","265739","0.17693059"
"73.36014","7.880871","265789","0.17693059"
"73.36014","7.880871","265790","0.17693059"
