"115.52596","72.02796","380021","0.025415445"
"115.385956","71.77793","380049","0.08504399"
"114.93588","71.177864","380083","0.22189638"
"113.625694","70.29777","380133","0.31769305"
"112.695564","69.6977","380149","0.37243402"
"112.09548","69.25765","380166","0.40371457"
"111.46541","68.80761","380183","0.42619747"
"110.895325","68.36755","380199","0.43890518"
"110.36526","67.89751","380216","0.4516129"
"109.61514","67.09742","380233","0.48387095"
"109.15508","66.58736","380249","0.4975562"
"108.75503","66.12731","380266","0.5024438"
"108.37497","65.657265","380283","0.5073314"
"108.04493","65.1372","380299","0.5092864"
"107.65488","64.347115","380316","0.516129"
"107.424835","63.79705","380333","0.52297163"
"107.25482","63.236988","380349","0.5259042"
"107.0948","62.71693","380366","0.5278592"
"106.75476","61.946846","380383","0.5366569"
"106.54473","61.416786","380399","0.542522"
"106.3647","60.996742","380416","0.5474096"
"106.214676","60.536686","380433","0.55131966"
"106.084656","59.95663","380449","0.5522972"
"105.93463","58.906513","380466","0.5522972"
"105.81463","58.326447","380483","0.55620724"
"105.47458","56.726273","380533","0.57380253"
"105.31456","56.116203","380549","0.56891495"
"105.13452","55.71616","380566","0.56402737"
"104.92451","55.316113","380583","0.57087"
"104.734474","54.926075","380599","0.58162266"
"104.58444","54.286003","380616","0.5894428"
"104.51445","53.76594","380632","0.5913978"
"104.37443","53.27589","380649","0.5913978"
"104.234406","52.83584","380666","0.59335285"
"104.064384","52.435795","380682","0.599218"
"103.824356","51.855732","380699","0.6089932"
"103.68433","51.445683","380716","0.6109482"
"103.57432","51.00564","380732","0.6217009"
"103.4643","50.535587","380749","0.6236559"
"103.29427","49.87551","380766","0.61876833"
"103.15425","49.515472","380782","0.6217009"
"103.02425","49.205437","380799","0.6236559"
"102.82421","48.795395","380816","0.62561095"
"102.634186","48.325344","380832","0.6285435"
"102.29413","47.775284","380849","0.6363636"
"102.114105","47.58526","380866","0.63831866"
"101.95409","47.355232","380882","0.6363636"
"101.72406","47.005196","380899","0.6344086"
"101.484024","46.625153","380916","0.6363636"
"101.14398","45.97508","380932","0.63831866"
"100.91395","45.525032","380949","0.6402737"
"100.72392","45.164993","380966","0.64320624"
"100.473885","44.854958","380982","0.64907134"
"99.99381","44.324898","380999","0.6617791"
"99.713776","43.99486","381016","0.6627566"
"99.413734","43.68483","381032","0.66373414"
"99.11369","43.364796","381049","0.66373414"
"98.93367","43.014755","381066","0.66471165"
"98.24357","42.58471","381082","0.67546433"
"97.93353","42.294674","381099","0.67546433"
"97.57349","41.98464","381116","0.67546433"
"97.263435","41.634605","381132","0.6744868"
"96.81338","41.10454","381149","0.6744868"
"96.433334","40.7045","381166","0.68230695"
"96.043274","40.26445","381182","0.68817204"
"95.72323","39.864407","381199","0.6871945"
"95.37318","39.484364","381216","0.684262"
"94.7831","38.894302","381232","0.6803519"
"94.37305","38.464252","381249","0.6735093"
"93.94298","37.974197","381266","0.684262"
"93.48291","37.514145","381282","0.6979472"
"93.04286","37.074097","381299","0.69501466"
"92.44277","36.344017","381316","0.6911046"
"92.02271","35.693943","381332","0.686217"
"91.522644","34.973866","381349","0.684262"
"90.93256","34.333797","381366","0.684262"
"90.132454","33.56371","381382","0.6744868"
"89.56238","32.973644","381399","0.6608016"
"88.92229","32.30357","381416","0.67741936"
"88.26219","31.683504","381432","0.70185727"
"87.63211","31.123442","381449","0.6979472"
"86.801994","30.253344","381466","0.6969697"
"86.26192","29.633274","381482","0.6989247"
"85.69183","29.003204","381499","0.69990224"
"85.18177","28.353134","381516","0.6969697"
"84.701706","27.693062","381532","0.69403714"
"83.931595","26.78296","381549","0.6979472"
"83.40153","26.202896","381566","0.7302053"
"82.90146","25.642836","381582","0.7302053"
"82.421394","24.942757","381599","0.7311828"
"81.7713","23.862637","381616","0.7292278"
"81.30123","23.022545","381632","0.7292278"
"80.83117","22.002432","381649","0.73313785"
"80.42111","21.26235","381666","0.73216033"
"80.011055","20.662283","381682","0.73216033"
"79.340965","19.752184","381699","0.72825027"
"78.8709","19.102112","381716","0.7194526"
"78.42084","18.482042","381732","0.7038123"
"78.04079","17.861975","381749","0.6959922"
"77.55071","16.82186","381766","0.6959922"
"77.22067","16.111782","381782","0.69501466"
"76.92063","15.461709","381799","0.6959922"
"76.7006","14.851642","381816","0.69403714"
"76.510574","14.241574","381832","0.686217"
"76.33054","13.401482","381849","0.6608016"
"76.220535","12.791414","381866","0.6412512"
"76.15052","12.141342","381882","0.6168133"
"76.13052","11.481269","381899","0.6158358"
"76.13052","10.8712015","381916","0.61974585"
"76.170525","10.31114","381932","0.6158358"
"76.19054","9.77108","381949","0.6041056"
"76.270546","9.341033","381966","0.62658846"
"76.29054","8.830976","381982","0.6334311"
"76.29054","8.830976","381999","0.6334311"
"76.29054","8.370925","382016","0.60215056"
"76.29054","7.930877","382032","0.6050831"
"76.29054","7.930877","382049","0.60703814"
"76.45056","7.4808264","382066","0.62561095"
"76.7006","7.0207763","382082","0.6285435"
"76.7006","7.0207763","382099","0.61485827"
"76.7006","7.0207763","382116","0.6119257"
"77.19067","6.7307444","382132","0.6168133"
"77.19067","6.7307444","382149","0.6236559"
"77.70074","6.7207427","382166","0.60215056"
"78.200806","6.9107637","382182","0.60117304"
"78.61086","7.010775","382199","0.599218"
"79.03092","7.110786","382216","0.59530795"
"79.45098","7.2708035","382232","0.5982405"
"79.87104","7.460825","382249","0.599218"
"80.301094","7.6408453","382266","0.60801566"
"80.77116","7.7808604","382282","0.61485827"
"81.27123","7.9508786","382299","0.6344086"
"82.24136","8.280915","382316","0.65689147"
"82.791435","8.580948","382332","0.65689147"
"83.37152","8.880981","382349","0.6402737"
"83.96161","9.191016","382366","0.62561095"
"84.50167","9.59106","382382","0.6285435"
"85.17177","10.421152","382399","0.63147604"
"85.631836","10.971212","382416","0.6353861"
"86.131905","11.591281","382432","0.64418375"
"86.60197","12.391371","382449","0.6686217"
"87.22205","13.471489","382466","0.6686217"
"87.692116","14.121561","382482","0.67155427"
"88.17218","14.761632","382499","0.67546433"
"88.64225","15.351697","382516","0.67546433"
"89.13231","16.00177","382532","0.67644185"
"89.812416","17.161896","382549","0.6783969"
"90.22247","17.921982","382566","0.6871945"
"90.66253","18.602057","382582","0.69403714"
"91.09259","19.272131","382599","0.6989247"
"91.77268","20.102222","382616","0.7096774"
"92.212746","20.702288","382632","0.71163243"
"92.65281","21.282352","382649","0.714565"
"93.10287","21.872417","382666","0.7174975"
"93.602936","22.602499","382682","0.70185727"
"94.353035","23.44259","382699","0.69501466"
"95.573204","25.40281","382749","0.71652"
"95.97327","26.012875","382766","0.7194526"
"96.683365","27.173002","382782","0.7047898"
"97.06341","27.983093","382799","0.68817204"
"97.36346","28.603163","382816","0.6959922"
"97.71351","29.203228","382832","0.7038123"
"98.29358","30.443365","382849","0.714565"
"98.68364","31.253454","382866","0.72238517"
"99.073685","31.873524","382882","0.7311828"
"99.45374","32.443584","382899","0.73900294"
"99.8738","33.163666","382916","0.7546432"
"100.40388","34.183777","382932","0.714565"
"100.72392","34.783844","382949","0.72043014"
"101.033966","35.513927","382966","0.7243402"
"101.334","36.284008","382982","0.72238517"
"101.82407","37.234116","382999","0.72238517"
"102.18412","37.874187","383016","0.7370479"
"102.61418","38.51426","383032","0.7243402"
"103.07424","39.104324","383049","0.69990224"
"103.5543","39.7744","383066","0.70185727"
"104.32442","40.694496","383082","0.70185727"
"104.774475","41.314564","383099","0.70185727"
"105.15454","41.874626","383116","0.70185727"
"105.51459","42.41469","383132","0.70674485"
"105.95465","42.96475","383149","0.69990224"
"106.624725","43.86485","383166","0.6852395"
"107.0748","44.49492","383182","0.684262"
"107.51485","44.98497","383199","0.68328446"
"107.94492","45.505028","383216","0.68328446"
"108.565","46.565147","383232","0.6852395"
"108.95506","47.12521","383249","0.68914956"
"109.3151","47.495255","383266","0.68817204"
"109.65515","47.9653","383282","0.68230695"
"110.015205","48.625378","383299","0.68328446"
"110.53527","49.295452","383316","0.68230695"
"110.82532","49.695496","383332","0.6813294"
"111.12536","50.105534","383349","0.6793744"
"111.4154","50.47558","383366","0.6783969"
"111.735435","50.84562","383382","0.6725318"
"112.24551","51.345676","383399","0.6735093"
"112.625565","51.6157","383416","0.6725318"
"113.01562","51.815727","383432","0.67057675"
"113.385666","52.005745","383449","0.6686217"
"113.87574","52.39579","383466","0.6656892"
"114.20578","52.705826","383482","0.66373414"
"114.53583","53.035862","383499","0.6617791"
"115.01589","53.485912","383516","0.6686217"
"115.68598","54.16599","383532","0.6744868"
"116.04604","54.53603","383549","0.67155427"
"116.35607","54.89607","383566","0.66959924"
"116.676125","55.25611","383582","0.6666667"
"116.98617","55.63615","383599","0.66471165"
"117.556244","56.256218","383616","0.6598241"
"117.9763","56.666264","383632","0.66471165"
"118.42637","57.08631","383649","0.67057675"
"118.84641","57.416348","383666","0.6686217"
"119.22648","57.686375","383682","0.6656892"
"119.746544","58.126423","383699","0.6627566"
"120.086586","58.42646","383716","0.6608016"
"120.426636","58.71649","383732","0.65884656"
"120.65667","59.02652","383749","0.6666667"
"120.90671","59.356564","383766","0.6744868"
"121.43678","59.806606","383782","0.67155427"
"121.74683","60.116642","383799","0.66959924"
"121.996864","60.466682","383816","0.6676442"
"122.196884","60.78672","383832","0.6656892"
"122.636955","61.24677","383849","0.66373414"
"122.98701","61.556805","383866","0.6617791"
"123.24703","61.89684","383882","0.66959924"
"123.477066","62.216877","383899","0.6871945"
"123.76709","62.476902","383916","0.69403714"
"124.19717","62.926952","383932","0.6901271"
"124.45719","63.246994","383949","0.6871945"
"124.67724","63.577023","383966","0.6871945"
"124.867256","63.907066","383982","0.6871945"
"125.027275","64.257095","383999","0.6871945"
"125.197296","64.68716","384016","0.6852395"
"125.30731","64.89717","384032","0.6852395"
"125.36733","65.077194","384049","0.684262"
"125.447334","65.277214","384066","0.68328446"
"125.487335","65.59725","384082","0.68328446"
"125.487335","65.68726","384099","0.6813294"
"125.487335","65.817276","384116","0.67741936"
"125.45734","65.91729","384132","0.67644185"
"125.357315","65.94729","384149","0.67644185"
"125.06729","66.0473","384166","0.6744868"
"124.897255","66.0673","384182","0.6744868"
"124.71724","66.0673","384199","0.6725318"
"124.5472","66.0473","384216","0.66959924"
"124.277176","65.82728","384232","0.6666667"
"124.047134","65.66726","384249","0.6676442"
"123.77711","65.49724","384266","0.66959924"
"123.52708","65.33723","384282","0.66471165"
"123.347046","65.1572","384299","0.65102637"
"122.926994","64.77716","384316","0.64418375"
"122.56693","64.41712","384332","0.6451613"
"122.1869","64.03708","384349","0.6471163"
"121.89684","63.697037","384366","0.64907134"
"121.71682","63.407005","384382","0.65102637"
"121.31677","62.896954","384399","0.6539589"
"121.02672","62.526913","384416","0.65493643"
"120.76669","62.18687","384432","0.65689147"
"120.606674","61.816833","384449","0.6480938"
"120.22661","61.276775","384466","0.63147604"
"119.96658","60.876728","384482","0.6334311"
"119.72655","60.456684","384499","0.6353861"
"119.46651","60.156654","384516","0.63734114"
"119.21648","59.95663","384532","0.6392962"
"118.84641","59.7166","384549","0.6402737"
"118.56639","59.49658","384566","0.6412512"
"118.29634","59.296555","384582","0.6422287"
"118.09631","59.23655","384599","0.64320624"
"117.9763","59.22655","384616","0.64320624"
"117.9763","59.22655","384632","0.6402737"
"117.9463","59.356564","384649","0.63831866"
"117.936295","59.54658","384665","0.63734114"
"117.936295","59.746605","384682","0.63734114"
"117.96631","60.106644","384699","0.6353861"
"118.106316","60.386673","384716","0.63245356"
"118.28635","60.676704","384732","0.6304985"
"118.53638","60.94673","384749","0.627566"
"118.80642","61.196766","384766","0.62561095"
"119.196465","61.566807","384782","0.6226784"
"119.43651","61.936848","384799","0.62463343"
"119.69653","62.306885","384816","0.62658846"
"119.96658","62.596916","384832","0.62463343"
"120.29663","62.98696","384849","0.62658846"
"120.44664","63.256992","384866","0.629521"
"120.65667","63.52702","384882","0.6334311"
"120.8067","63.767048","384899","0.63734114"
"120.996735","63.997074","384916","0.63734114"
"121.25676","64.427124","384932","0.6363636"
"121.406784","64.76716","384949","0.6363636"
"121.53679","65.08719","384966","0.6363636"
"121.656815","65.39723","384982","0.6353861"
"121.79684","65.657265","384999","0.6353861"
"121.80683","66.07731","385016","0.6353861"
"121.91684","66.39734","385032","0.6402737"
"122.02686","66.72738","385049","0.6461388"
"122.12687","67.08741","385066","0.6422287"
"122.25689","67.52746","385082","0.63734114"
"122.27689","67.62747","385099","0.63734114"
"122.35691","67.7775","385116","0.6392962"
"122.35691","67.89751","385132","0.6402737"
"122.35691","68.01752","385149","0.6412512"
"122.3169","68.12753","385166","0.64320624"
"122.1869","68.12753","385182","0.6451613"
"122.05686","68.12753","385199","0.6461388"
"121.86684","68.09753","385216","0.6480938"
"121.70681","67.94751","385232","0.64907134"
"121.13674","67.68748","385249","0.6520039"
"120.696686","67.567474","385266","0.65591395"
"120.336624","67.407455","385282","0.6529814"
"120.0766","67.17743","385299","0.64418375"
"119.69653","66.667366","385316","0.6412512"
"119.40651","66.20732","385332","0.6402737"
"119.146454","65.78728","385349","0.6402737"
"118.916435","65.34722","385366","0.6422287"
"118.6664","64.917175","385382","0.64418375"
"118.186325","64.2371","385399","0.6471163"
"117.856285","63.68704","385416","0.6480938"
"117.566246","63.186985","385432","0.65102637"
"117.27621","62.79694","385449","0.6529814"
"116.886154","62.31689","385466","0.65689147"
"116.646126","61.936848","385482","0.65884656"
"116.40608","61.556805","385499","0.65689147"
"116.15605","61.24677","385516","0.65493643"
"115.89601","60.956738","385532","0.65689147"
"115.50596","60.606697","385549","0.6598241"
"115.18592","60.43668","385566","0.65591395"
"114.79586","60.376675","385582","0.6471163"
"114.52582","60.36667","385597","0.6422287"
"114.3658","60.36667","385616","0.6422287"
"114.23578","60.396675","385631","0.64320624"
"114.105774","60.49669","385649","0.64418375"
"113.99575","60.606697","385666","0.64418375"
"113.895744","60.836727","385682","0.64418375"
"113.885735","61.216763","385699","0.6422287"
"113.99575","61.526802","385716","0.6402737"
"114.16578","61.936848","385732","0.6412512"
"114.38581","62.336887","385749","0.64320624"
"114.60584","62.666927","385766","0.6412512"
"115.20592","63.216988","385782","0.6539589"
"115.53597","63.587032","385799","0.65786904"
"115.786","63.95707","385816","0.65493643"
"116.03603","64.37711","385832","0.6529814"
"116.26606","64.84717","385849","0.6520039"
"116.596115","65.447235","385866","0.65004885"
"116.82615","65.77727","385882","0.6480938"
"117.03618","66.0873","385899","0.6471163"
"117.236206","66.41734","385916","0.6471163"
"117.566246","67.02741","385932","0.6520039"
"117.8763","67.397446","385949","0.6471163"
"118.146324","67.73749","385966","0.6451613"
"118.406364","68.02752","385982","0.64320624"
"118.656395","68.337555","385999","0.6422287"
"118.97645","68.7776","386016","0.6402737"
"119.146454","69.05763","386032","0.6392962"
"119.286476","69.347664","386049","0.6402737"
"119.33649","69.6277","386066","0.64320624"
"119.3865","70.01774","386082","0.64418375"
"119.3865","70.11775","386099","0.6461388"
"119.34649","70.27776","386116","0.65102637"
"119.18647","70.51779","386132","0.65493643"
"119.00645","70.71781","386149","0.65689147"
"118.75641","70.88783","386166","0.65884656"
"118.606384","70.88783","386182","0.65884656"
"118.42637","70.78783","386199","0.65884656"
"118.15633","70.647804","386216","0.6598241"
"117.816284","70.457794","386232","0.6617791"
"117.316216","70.047745","386249","0.66471165"
"117.016174","69.6977","386266","0.6656892"
"116.71612","69.33766","386282","0.6676442"
"116.44609","68.937614","386299","0.67057675"
"116.05603","68.24754","386316","0.67155427"
"115.776","67.78749","386332","0.6735093"
"115.42595","67.317444","386349","0.67057675"
"115.01589","66.83739","386366","0.66471165"
"114.67585","66.347336","386382","0.6598241"
"114.27579","65.66726","386399","0.65884656"
"114.00576","65.23721","386416","0.6608016"
"113.74572","64.837166","386432","0.6627566"
"113.44568","64.48713","386449","0.66373414"
"113.11564","64.187096","386466","0.66471165"
"112.55556","63.807053","386482","0.6666667"
"112.1655","63.617035","386499","0.6666667"
"111.865456","63.50702","386516","0.6676442"
"111.665436","63.387005","386532","0.6676442"
"111.4154","63.357002","386549","0.66471165"
"111.275375","63.347004","386566","0.66373414"
"111.16537","63.457016","386582","0.66373414"
"111.12536","63.59703","386599","0.66373414"
"111.09535","63.837055","386616","0.66373414"
"111.195366","64.37711","386632","0.6617791"
"111.355385","64.78716","386649","0.6608016"
"111.565414","65.1772","386665","0.65884656"
"111.80546","65.55724","386682","0.65786904"
"112.255516","66.10731","386699","0.65493643"
"112.59556","66.52735","386715","0.65786904"
"112.925606","66.9674","386732","0.65786904"
"113.24565","67.407455","386749","0.6520039"
"113.515686","67.8275","386765","0.65004885"
"113.885735","68.45757","386782","0.65004885"
"114.12577","68.88761","386799","0.64907134"
"114.3658","69.267654","386815","0.64907134"
"114.58583","69.58769","386832","0.6471163"
"114.75586","69.90773","386849","0.6461388"
"115.01589","70.37778","386865","0.6520039"
"115.24593","70.75782","386882","0.66471165"
"115.36594","71.15787","386899","0.67057675"
"115.46595","71.5179","386915","0.6744868"
"115.60597","72.01796","386932","0.6744868"
"115.62597","72.30799","386949","0.67644185"
"115.62597","72.53802","386965","0.6783969"
"115.61598","72.74804","386982","0.6793744"
"115.57597","72.90806","386999","0.68230695"
"115.52596","73.03807","387015","0.6852395"
"115.37594","73.12808","387032","0.6803519"
"115.0559","73.10808","387049","0.66959924"
"114.81587","72.99807","387065","0.6656892"
"114.60584","72.88806","387082","0.6686217"
"114.22578","72.70804","387099","0.6520039"
"113.91574","72.58802","387115","0.44477028"
"113.72571","72.41801","387132","9.775171E-4"
"113.32566","72.11797","387135","9.775171E-4"
"113.32566","72.11797","387142","9.775171E-4"
