"114.85587","72.338","822763","0.10068426"
"114.76586","72.31799","822792","0.14956012"
"114.37581","72.31799","822842","0.34506354"
"113.91574","71.76793","822875","0.41544476"
"113.68571","71.507904","822892","0.4516129"
"113.44568","71.19787","822908","0.47898337"
"113.18564","70.867836","822925","0.5083089"
"112.91561","70.567795","822942","0.5366569"
"112.575554","70.26777","822958","0.55620724"
"112.01549","69.73771","822975","0.5777126"
"111.645424","69.33766","822991","0.5894428"
"111.325386","68.937614","823008","0.6001955"
"111.01535","68.52757","823025","0.60703814"
"110.635284","67.93751","823041","0.61290324"
"110.42526","67.57747","823058","0.6177908"
"110.18523","67.20743","823075","0.62463343"
"109.81517","66.787384","823091","0.629521"
"109.40512","66.32733","823108","0.63245356"
"108.95506","65.58725","823125","0.63734114"
"108.66501","65.067184","823141","0.6392962"
"108.37497","64.547134","823158","0.6422287"
"108.084946","64.05708","823175","0.64418375"
"107.814896","63.567024","823191","0.6451613"
"107.424835","62.836945","823208","0.6461388"
"107.15481","62.296886","823225","0.6412512"
"106.91478","61.72682","823241","0.63734114"
"106.73475","61.256775","823258","0.6392962"
"106.53471","60.5967","823275","0.6392962"
"105.914635","58.466457","823341","0.6402737"
"105.784615","57.946407","823358","0.6422287"
"105.6646","57.636368","823375","0.64320624"
"105.56459","57.306335","823391","0.64418375"
"105.524574","56.73627","823408","0.64320624"
"105.43456","56.0662","823425","0.6285435"
"105.284546","55.82617","823441","0.63147604"
"105.15454","55.56614","823458","0.6344086"
"105.04451","55.28611","823475","0.63734114"
"104.92451","55.036083","823491","0.6412512"
"104.84448","54.666042","823508","0.6422287"
"104.774475","54.406017","823525","0.64320624"
"104.72447","54.10598","823541","0.64320624"
"104.72447","53.795948","823558","0.64418375"
"104.71448","53.51591","823575","0.64418375"
"104.654465","53.155876","823591","0.6451613"
"104.59445","52.90585","823608","0.6461388"
"104.524445","52.655823","823625","0.6471163"
"104.45444","52.42579","823641","0.6471163"
"104.34441","52.10576","823658","0.64907134"
"104.274414","51.90574","823675","0.65004885"
"104.17439","51.74572","823691","0.65004885"
"104.144394","51.605705","823708","0.65004885"
"104.05438","51.475685","823722","0.65004885"
"104.01437","51.355675","823741","0.65004885"
"103.974365","51.245667","823758","0.66471165"
"103.974365","51.125652","823775","0.6656892"
"103.96438","51.00564","823791","0.65102637"
"103.91437","50.905624","823808","0.65102637"
"103.83434","50.705605","823825","0.65102637"
"103.81435","50.705605","823841","0.65102637"
"103.76434","50.585594","823858","0.65102637"
"103.71433","50.47558","823875","0.65102637"
"103.62432","50.38557","823891","0.6520039"
"103.594315","50.29556","823908","0.6520039"
"103.5543","50.185547","823925","0.65102637"
"103.5343","50.185547","823941","0.6520039"
"103.48431","50.085537","823958","0.6520039"
"103.44429","49.985527","823975","0.6520039"
"103.434296","49.985527","823991","0.6520039"
"103.35428","49.885513","824008","0.6529814"
"103.25427","49.7955","824034","0.6529814"
"103.14425","49.715496","824058","0.6529814"
"103.03424","49.625484","824101","0.6529814"
"102.934235","49.58548","824125","0.6520039"
"102.82421","49.495472","824141","0.6529814"
"102.82421","49.495472","824158","0.6539589"
"102.70419","49.39546","824175","0.6539589"
"102.61418","49.355457","824191","0.6539589"
"102.37415","49.26544","824208","0.65884656"
"102.18412","49.255444","824225","0.6617791"
"102.084114","49.255444","824241","0.66373414"
"101.96409","49.30545","824258","0.66471165"
"101.70405","49.235443","824275","0.6656892"
"101.54403","49.13543","824291","0.6676442"
"101.374016","49.04542","824308","0.67057675"
"101.19399","48.995415","824325","0.6725318"
"101.013954","48.925407","824341","0.6735093"
"100.853935","48.825394","824358","0.6744868"
"100.5939","48.685383","824375","0.6744868"
"100.38387","48.555367","824391","0.67546433"
"100.12383","48.48536","824408","0.684262"
"99.90381","48.435352","824425","0.6930596"
"99.76379","48.34535","824435","0.6911046"
"99.63377","48.255333","824458","0.6901271"
"99.40374","48.135323","824475","0.68914956"
"99.21371","48.075314","824491","0.68817204"
"98.93367","47.9253","824508","0.686217"
"98.75364","47.885292","824525","0.6871945"
"98.60363","47.84529","824541","0.686217"
"98.42361","47.785286","824558","0.686217"
"97.44347","47.635265","824625","0.68230695"
"97.25344","47.635265","824641","0.68328446"
"96.84338","47.60526","824658","0.67155427"
"96.59335","47.535255","824675","0.66959924"
"96.37332","47.475246","824691","0.6686217"
"96.14328","47.41524","824708","0.6676442"
"95.90325","47.355232","824725","0.67155427"
"95.703224","47.295227","824741","0.6783969"
"95.5432","47.255222","824758","0.6783969"
"95.413185","47.225224","824775","0.6783969"
"95.413185","47.225224","824791","0.6744868"
"95.30317","47.225224","824808","0.6119257"
"95.44319","47.355232","824825","0.26490712"
"95.63321","47.475246","824838","9.775171E-4"
"95.63321","47.475246","824846","9.775171E-4"
"101.013954","48.325344","825553","0.109481916"
"101.013954","48.325344","825558","0.109481916"
"101.013954","48.325344","825575","0.12707722"
"101.013954","48.325344","825591","0.14173998"
"101.013954","48.325344","825608","0.19843598"
"101.013954","48.325344","825625","0.2746823"
"101.013954","48.185326","825641","0.3304008"
"100.99396","48.065315","825658","0.37927663"
"100.81393","47.715275","825675","0.46529815"
"100.683914","47.475246","825691","0.516129"
"100.49389","47.185215","825708","0.55131966"
"100.213844","46.88518","825725","0.58064514"
"99.78379","46.31512","825741","0.60703814"
"99.48375","45.885075","825758","0.61876833"
"99.1837","45.465027","825775","0.629521"
"98.90367","45.094986","825791","0.63734114"
"98.613625","44.69494","825808","0.6422287"
"98.09356","44.064873","825825","0.6461388"
"97.80352","43.704834","825841","0.6471163"
"97.55348","43.374794","825858","0.65102637"
"97.44347","43.044758","825875","0.65493643"
"97.04341","42.554703","825891","0.6686217"
"96.84338","42.24467","825908","0.67057675"
"96.62335","41.96464","825925","0.6744868"
"96.33331","41.644604","825941","0.6813294"
"96.03327","41.284565","825958","0.68817204"
"95.59321","40.784508","825975","0.6969697"
"95.34317","40.514477","825991","0.70087975"
"95.123146","40.24445","826008","0.70087975"
"94.90311","40.00442","826025","0.69990224"
"94.67308","39.804398","826041","0.6989247"
"94.30304","39.52437","826058","0.6959922"
"94.022995","39.324345","826075","0.6959922"
"93.69295","39.114323","826091","0.69403714"
"93.3529","38.894302","826108","0.6959922"
"92.962845","38.57426","826125","0.69990224"
"92.77282","38.25423","826141","0.69501466"
"92.6028","37.944195","826158","0.70576733"
"92.412766","37.74417","826175","0.71847504"
"92.20274","37.49415","826191","0.71652"
"91.872696","37.0841","826208","0.71358746"
"91.53265","36.774067","826225","0.71260995"
"91.112595","36.43403","826241","0.714565"
"90.74254","36.063988","826258","0.71358746"
"90.42249","35.72395","826275","0.71163243"
"89.92243","35.19389","826291","0.7086999"
"89.57238","34.77384","826308","0.70576733"
"89.23233","34.473812","826325","0.70185727"
"88.89228","34.143776","826341","0.6989247"
"88.26219","33.553707","826358","0.6930596"
"87.852135","33.12366","826375","0.6803519"
"87.5021","32.65361","826391","0.6979472"
"87.19205","32.253563","826408","0.7243402"
"86.88201","31.903526","826425","0.72238517"
"86.42194","31.313461","826441","0.72238517"
"86.001884","30.823406","826458","0.72629523"
"85.57182","30.333353","826475","0.7311828"
"85.24178","29.903303","826491","0.73216033"
"84.75171","29.253235","826508","0.7302053"
"84.45167","28.78318","826525","0.7292278"
"84.15163","28.293127","826541","0.72727275"
"83.87159","27.853077","826558","0.71260995"
"83.45153","27.253014","826575","0.742913"
"83.2015","26.762959","826591","0.7653959"
"82.94147","26.272902","826608","0.7673509"
"82.65142","25.812853","826625","0.7683284"
"82.381386","25.482817","826641","0.76930594"
"82.11134","25.092773","826658","0.76930594"
"81.751305","24.4327","826675","0.7683284"
"81.49126","24.042658","826691","0.7683284"
"81.24123","23.582607","826708","0.7683284"
"81.00119","23.042545","826725","0.7673509"
"80.66115","22.25246","826741","0.7673509"
"80.47112","21.782408","826758","0.7683284"
"80.271095","21.372362","826775","0.7683284"
"80.07107","21.022324","826791","0.7683284"
"79.87104","20.63228","826808","0.7683284"
"79.520996","20.08222","826825","0.7673509"
"79.26095","19.71218","826841","0.7673509"
"79.000916","19.302134","826858","0.74584556"
"78.750885","18.942095","826875","0.7380254"
"78.53085","18.622059","826891","0.742913"
"78.1908","18.081999","826908","0.7380254"
"77.96078","17.651953","826925","0.7380254"
"77.740746","17.171898","826941","0.73900294"
"77.51071","16.651842","826958","0.73900294"
"77.20066","15.941762","826975","0.7380254"
"77.03064","15.561721","826991","0.7380254"
"76.83062","15.111671","827008","0.7380254"
"76.580574","14.641618","827025","0.73313785"
"76.31054","14.181568","827041","0.7086999"
"75.910484","13.541497","827058","0.6744868"
"75.670456","13.12145","827075","0.65786904"
"75.47043","12.691402","827091","0.65786904"
"75.36041","12.251353","827108","0.65591395"
"75.240395","11.541276","827125","0.65493643"
"75.18039","11.12123","827141","0.65591395"
"75.14038","10.711184","827158","0.65493643"
"75.11038","10.271135","827175","0.6539589"
"75.09038","10.04111","827191","0.6529814"
"75.07037","9.581059","827208","0.6471163"
"75.09038","9.040999","827225","0.6676442"
"75.11038","8.600951","827241","0.65004885"
"75.11038","8.600951","827258","0.6871945"
"75.2704","8.120897","827275","0.6813294"
"75.2704","8.120897","827291","0.63245356"
"75.59045","7.620843","827308","0.6285435"
"75.59045","7.620843","827325","0.64418375"
"75.86048","7.1307883","827341","0.6422287"
"75.86048","7.1307883","827358","0.6520039"
"76.31054","6.6807384","827375","0.6744868"
"76.80061","6.3106976","827391","0.67546433"
"77.32069","6.070671","827408","0.66959924"
"77.740746","6.040668","827425","0.6676442"
"78.23081","6.0306664","827441","0.66471165"
"78.76088","6.0306664","827458","0.6617791"
"79.32096","6.1406784","827475","0.65102637"
"79.92104","6.3106976","827491","0.65004885"
"80.49113","6.5307217","827508","0.64907134"
"81.65128","6.9407673","827525","0.6783969"
"82.24136","7.170792","827541","0.68914956"
"82.851456","7.4908276","827558","0.6920821"
"83.50154","7.8108635","827575","0.69403714"
"84.14163","8.160902","827591","0.67741936"
"84.7217","8.580948","827608","0.6803519"
"85.4418","9.351033","827625","0.684262"
"85.86187","9.951099","827641","0.68914956"
"86.31192","10.651177","827658","0.69990224"
"86.932014","11.981325","827675","0.7028348"
"87.362076","12.93143","827691","0.72238517"
"87.80214","13.751519","827708","0.73313785"
"88.26219","14.531606","827725","0.72629523"
"88.97229","15.651729","827741","0.7292278"
"89.422356","16.521826","827758","0.7311828"
"89.85242","17.511936","827775","0.73313785"
"90.272484","18.44204","827791","0.72825027"
"90.732544","19.292131","827808","0.73998046"
"91.38263","20.412256","827825","0.75855327"
"91.79268","21.022324","827841","0.7605083"
"92.17274","21.7024","827858","0.76246333"
"92.5628","22.542492","827875","0.76246333"
"93.012856","23.25257","827891","0.7468231"
"93.64294","24.06266","827908","0.7556207"
"94.022995","24.782742","827925","0.75855327"
"94.403046","25.412811","827941","0.76344085"
"94.75309","26.012875","827958","0.7673509"
"95.23316","27.04299","827975","0.7614858"
"95.5432","27.703062","827991","0.74486804"
"95.79323","28.283123","828008","0.7370479"
"96.13329","28.78318","828025","0.740958"
"96.513336","29.263235","828041","0.740958"
"96.973404","30.063324","828058","0.7478006"
"97.24344","30.643387","828075","0.7536657"
"97.53347","31.13344","828091","0.75855327"
"97.853516","31.56349","828108","0.76441836"
"98.20357","32.03354","828125","0.77028346"
"98.84366","32.883633","828141","0.77517104"
"99.21371","33.453697","828158","0.75855327"
"99.513756","33.93375","828175","0.74584556"
"99.8538","34.353798","828191","0.7497556"
"100.32387","35.01387","828208","0.7546432"
"100.66391","35.513927","828225","0.75855327"
"101.00396","36.043983","828241","0.7614858"
"101.284","36.474033","828258","0.76246333"
"101.524025","36.90408","828275","0.7595308"
"102.00409","37.56415","828291","0.76344085"
"102.35414","38.064205","828308","0.77614856"
"102.69419","38.584263","828325","0.7614858"
"103.11425","39.024315","828341","0.73411536"
"103.79434","39.744392","828358","0.7360704"
"104.234406","40.16444","828375","0.7380254"
"104.71448","40.584488","828391","0.73900294"
"105.15454","41.064537","828408","0.73998046"
"105.55459","41.554596","828425","0.7370479"
"106.22468","42.394688","828441","0.7370479"
"106.72475","42.97475","828458","0.7302053"
"107.20482","43.564816","828475","0.72043014"
"107.68488","44.15488","828491","0.72043014"
"108.20495","44.75495","828508","0.72043014"
"108.97506","45.69505","828525","0.72140765"
"109.51513","46.375126","828541","0.72043014"
"110.02521","46.88518","828558","0.72043014"
"110.45526","47.265224","828575","0.72238517"
"111.05534","48.005306","828591","0.7194526"
"111.445404","48.555367","828608","0.71847504"
"111.84545","48.965412","828625","0.71652"
"112.26552","49.455467","828641","0.714565"
"112.67557","50.085537","828658","0.71260995"
"113.25566","50.76561","828675","0.7028348"
"113.6057","51.125652","828691","0.70087975"
"113.925735","51.45569","828708","0.70772237"
"114.21578","51.775726","828725","0.70674485"
"114.58583","52.12576","828741","0.7086999"
"115.1159","52.66582","828758","0.714565"
"115.41594","53.015865","828775","0.71847504"
"115.65598","53.30589","828791","0.71652"
"115.91601","53.555923","828808","0.7155425"
"116.30607","53.92596","828825","0.71358746"
"116.5561","54.22599","828841","0.71260995"
"116.78613","54.48602","828858","0.7106549"
"116.99616","54.706047","828875","0.7096774"
"117.236206","54.946075","828891","0.7086999"
"117.63625","55.34612","828908","0.70576733"
"117.9263","55.536137","828925","0.7047898"
"118.21634","55.706154","828941","0.7028348"
"118.486374","55.876175","828958","0.70185727"
"118.85643","56.186214","828975","0.69990224"
"119.08646","56.376232","828991","0.6989247"
"119.34649","56.65626","829008","0.6871945"
"119.67654","57.0063","829025","0.69403714"
"119.99659","57.306335","829041","0.7106549"
"120.39664","57.70638","829058","0.70772237"
"120.56666","58.026413","829074","0.71652"
"120.72668","58.36645","829091","0.7253177"
"120.996735","58.686485","829108","0.7233627"
"121.33677","58.99652","829124","0.72140765"
"121.87684","59.44657","829141","0.7194526"
"122.16688","59.726597","829158","0.71847504"
"122.46692","60.016636","829174","0.71652"
"122.82697","60.35667","829191","0.7155425"
"123.31703","60.88673","829208","0.71260995"
"123.477066","61.216763","829224","0.72140765"
"123.587074","61.516804","829241","0.7302053"
"123.807106","61.786827","829258","0.7370479"
"124.057144","62.076866","829274","0.74584556"
"124.4472","62.516914","829291","0.7478006"
"124.647224","62.87695","829308","0.74584556"
"124.81726","63.276993","829324","0.74486804"
"124.93726","63.697037","829341","0.74486804"
"125.04728","64.097084","829358","0.74486804"
"125.1273","64.59714","829374","0.742913"
"125.147285","64.90717","829391","0.742913"
"125.147285","65.247215","829408","0.7438905"
"125.107285","65.57725","829424","0.7419355"
"125.01728","65.93729","829441","0.73900294"
"124.90726","66.0873","829458","0.7360704"
"124.79724","66.20732","829474","0.73411536"
"124.66723","66.28733","829491","0.73216033"
"124.52721","66.28733","829505","0.7292278"
"124.28718","66.18731","829524","0.72727275"
"124.00713","65.95729","829541","0.72629523"
"123.66708","65.55724","829558","0.7194526"
"123.32705","65.037186","829574","0.70576733"
"122.636955","64.2271","829591","0.70087975"
"122.1869","63.717045","829608","0.7028348"
"121.90685","63.20699","829624","0.7047898"
"121.5668","62.656925","829641","0.70674485"
"121.05673","62.066864","829658","0.714565"
"120.41664","61.176765","829674","0.6969697"
"119.99659","60.746716","829691","0.6901271"
"119.57653","60.36667","829708","0.6930596"
"119.15647","60.03664","829724","0.69501466"
"118.76642","59.78661","829741","0.6979472"
"118.30634","59.566586","829758","0.69990224"
"118.106316","59.52658","829774","0.70087975"
"117.9763","59.516575","829790","0.70087975"
"117.9463","59.656593","829808","0.70185727"
"117.96631","59.946625","829824","0.69990224"
"118.22635","60.236656","829841","0.6979472"
"118.51638","60.5667","829858","0.69501466"
"118.83642","60.906734","829874","0.6930596"
"119.146454","61.29678","829891","0.6911046"
"119.626526","61.97685","829908","0.6920821"
"120.01658","62.486908","829924","0.69403714"
"120.346634","62.98696","829941","0.6969697"
"120.55666","63.537025","829958","0.70576733"
"120.836685","64.08708","829974","0.7086999"
"121.34677","64.88717","829991","0.70576733"
"121.67681","65.37723","830008","0.7047898"
"121.86684","65.817276","830024","0.7028348"
"121.96685","66.24732","830041","0.70087975"
"122.22689","66.9274","830058","0.69501466"
"122.44692","67.327446","830074","0.7038123"
"122.55693","67.64748","830091","0.7038123"
"122.57694","67.90751","830108","0.7047898"
"122.57694","68.12753","830124","0.70576733"
"122.546936","68.32755","830141","0.70674485"
"122.43693","68.45757","830158","0.70772237"
"122.336914","68.45757","830174","0.70772237"
"122.07686","68.29755","830191","0.7086999"
"121.72682","67.78749","830208","0.7106549"
"121.28676","67.30744","830224","0.71260995"
"120.836685","66.77738","830241","0.7086999"
"120.426636","66.347336","830258","0.69990224"
"120.02659","66.00729","830274","0.6979472"
"119.4865","65.35722","830291","0.70087975"
"119.11647","64.84717","830308","0.7028348"
"118.706406","64.35711","830324","0.70576733"
"118.28635","63.917065","830341","0.7086999"
"117.8763","63.547024","830358","0.7106549"
"117.30621","63.09697","830374","0.71358746"
"116.976166","62.846943","830391","0.7155425"
"116.676125","62.55691","830408","0.7174975"
"116.386086","62.286884","830424","0.71847504"
"116.01603","61.89684","830441","0.72043014"
"115.786","61.656815","830458","0.71847504"
"115.68598","61.61681","830474","0.7155425"
"115.52596","61.506794","830491","0.71652"
"115.23592","61.45679","830508","0.71163243"
"114.775856","61.386787","830524","0.6979472"
"114.66584","61.35678","830541","0.6989247"
"114.66584","61.346783","830550","0.6989247"
"114.56583","61.37678","830574","0.69990224"
"114.55583","61.546806","830591","0.6989247"
"114.53583","61.91684","830608","0.69403714"
"114.53583","62.216877","830624","0.6979472"
"114.57583","62.446903","830641","0.70576733"
"114.695854","62.746933","830658","0.7038123"
"115.20592","63.347004","830674","0.71847504"
"115.48596","63.787052","830691","0.72238517"
"115.68598","64.2071","830708","0.72140765"
"115.91601","64.60714","830724","0.7194526"
"116.16605","64.98718","830741","0.71847504"
"116.596115","65.55724","830758","0.7155425"
"116.89616","65.90728","830774","0.71358746"
"117.20619","66.257324","830791","0.71163243"
"117.526245","66.69737","830808","0.71358746"
"118.0463","67.42745","830824","0.7086999"
"118.346344","67.89751","830841","0.7096774"
"118.606384","68.377556","830858","0.7086999"
"118.81643","68.907616","830874","0.70772237"
"118.97645","69.42767","830891","0.70772237"
"119.05646","70.047745","830908","0.70674485"
"119.076454","70.29777","830924","0.70772237"
"119.05646","70.40778","830941","0.7096774"
"118.93644","70.54779","830958","0.7106549"
"118.696396","70.62781","830974","0.71163243"
"118.276344","70.54779","830991","0.71358746"
"117.8763","70.31777","831008","0.714565"
"117.41623","69.997734","831024","0.7174975"
"116.976166","69.6577","831041","0.7194526"
"116.4761","69.187645","831058","0.72238517"
"116.176056","68.7576","831074","0.7233627"
"115.86601","68.207535","831091","0.72629523"
"115.55597","67.637474","831108","0.72727275"
"115.14591","67.13741","831124","0.7174975"
"114.57583","66.41734","831141","0.7106549"
"114.22578","65.94729","831158","0.70772237"
"113.87574","65.50724","831174","0.7096774"
"113.52569","65.077194","831191","0.71163243"
"113.16564","64.67715","831208","0.71260995"
"112.61557","64.2471","831224","0.71652"
"112.27551","64.107086","831241","0.71652"
"112.00548","64.03708","831258","0.7174975"
"111.80546","63.97707","831274","0.71847504"
"111.655426","63.967068","831287","0.71847504"
"111.55541","63.967068","831308","0.7174975"
"111.46541","63.967068","831324","0.7174975"
"111.445404","64.07708","831358","0.7174975"
"111.4754","64.41712","831374","0.7174975"
"111.655426","64.717155","831391","0.71652"
"111.85546","65.117195","831408","0.7155425"
"112.09548","65.59725","831424","0.714565"
"112.60557","66.457344","831441","0.70772237"
"112.8956","67.06741","831458","0.70772237"
"113.14564","67.61748","831474","0.714565"
"113.335655","68.09753","831491","0.71358746"
"113.45568","68.55758","831508","0.714565"
"113.78573","69.29766","831524","0.714565"
"114.00576","69.767715","831541","0.71358746"
"114.11577","70.22776","831558","0.71358746"
"114.24579","70.657814","831574","0.71358746"
"114.3458","70.977844","831591","0.71358746"
"114.40581","71.21787","831608","0.71260995"
"114.42581","71.21787","831624","0.7028348"
"114.3458","71.24787","831641","0.61974585"
"114.3458","71.13786","831658","0.15347019"
"114.23578","71.13786","831659","9.775171E-4"
"114.23578","71.13786","831667","9.775171E-4"
