"104.9145","50.76561","706163","0.20136853"
"104.9145","50.76561","706165","0.20136853"
"104.30441","50.78561","706198","0.30107528"
"104.41444","50.815617","706231","0.3655914"
"105.18453","50.80562","706281","0.48289344"
"105.27454","50.885624","706298","0.53861195"
"105.27454","51.01564","706315","0.59335285"
"105.29454","51.28567","706331","0.6001955"
"105.46458","51.525692","706348","0.6099707"
"105.734604","51.82573","706365","0.61290324"
"106.124664","52.365788","706381","0.6168133"
"106.4147","52.76583","706398","0.61876833"
"106.68474","53.21588","706415","0.6236559"
"106.90478","53.805946","706431","0.6334311"
"107.0948","54.39601","706448","0.64320624"
"107.40484","55.036083","706465","0.6480938"
"107.64488","55.396122","706481","0.64907134"
"107.85491","55.686153","706498","0.64907134"
"108.02492","55.946186","706515","0.64907134"
"108.17495","56.586254","706531","0.65689147"
"108.224945","57.126316","706548","0.66471165"
"108.244965","57.476353","706565","0.6656892"
"108.244965","57.846397","706581","0.6656892"
"108.224945","58.21644","706598","0.6656892"
"108.23496","60.35667","706665","0.6656892"
"108.40498","60.79672","706681","0.66471165"
"108.67502","61.466797","706698","0.66373414"
"108.84504","62.02686","706715","0.6666667"
"108.95506","62.566917","706731","0.66959924"
"109.08508","63.00696","706748","0.66959924"
"109.35511","63.727043","706765","0.6686217"
"109.53513","64.2171","706781","0.6676442"
"109.71515","64.717155","706798","0.6656892"
"109.95519","65.25722","706815","0.6656892"
"110.28523","65.817276","706831","0.6676442"
"110.735306","66.72738","706848","0.6666667"
"111.05534","67.327446","706865","0.6656892"
"111.39539","67.8675","706881","0.66373414"
"111.775444","68.417564","706898","0.6617791"
"112.24551","68.96762","706915","0.6598241"
"112.9856","69.767715","706931","0.65591395"
"113.39567","70.30777","706948","0.6529814"
"113.77572","70.82783","706965","0.65004885"
"114.15577","71.29788","706981","0.6520039"
"114.70585","71.91795","706998","0.64320624"
"115.035904","72.157974","707015","0.6392962"
"115.50596","72.34799","707031","0.6480938"
"115.956024","72.45801","707048","0.65591395"
"116.22607","72.53802","707065","0.6529814"
"116.58611","72.50801","707081","0.65004885"
"116.70612","72.327995","707098","0.64907134"
"116.82615","72.157974","707115","0.65004885"
"116.82615","71.96796","707131","0.6520039"
"116.71612","71.4979","707148","0.6598241"
"116.44609","70.95784","707165","0.6627566"
"116.01603","70.23776","707181","0.66471165"
"115.36594","69.467674","707198","0.6598241"
"114.67585","68.7576","707215","0.65493643"
"113.87574","67.89751","707231","0.66373414"
"113.40567","67.43746","707248","0.6666667"
"112.9856","66.9474","707265","0.66471165"
"112.60557","66.457344","707281","0.6666667"
"112.235504","66.057304","707298","0.67155427"
"111.95547","65.58725","707315","0.67155427"
"111.88547","65.29722","707331","0.67057675"
"111.84545","65.01718","707348","0.67057675"
"111.84545","64.79716","707362","0.66959924"
"111.865456","64.64714","707381","0.6676442"
"111.97548","64.52713","707398","0.6656892"
"112.20551","64.467125","707415","0.6627566"
"112.47555","64.48713","707431","0.6598241"
"112.76559","64.67715","707448","0.65786904"
"113.19565","64.98718","707465","0.6539589"
"113.47568","65.22721","707481","0.6520039"
"113.75572","65.477234","707498","0.65004885"
"114.01575","65.74726","707515","0.6480938"
"114.26579","66.0473","707531","0.6461388"
"114.65584","66.63737","707548","0.63831866"
"115.00589","67.05741","707565","0.6422287"
"115.43595","67.397446","707581","0.6529814"
"115.75599","67.70749","707598","0.65591395"
"116.09605","68.11753","707615","0.6539589"
"116.28607","68.377556","707631","0.6520039"
"116.44609","68.63759","707648","0.65004885"
"116.61611","68.87762","707665","0.64907134"
"116.776146","69.107635","707681","0.6480938"
"117.04617","69.437675","707698","0.6451613"
"117.226204","69.61769","707715","0.64320624"
"117.41623","69.79772","707731","0.6402737"
"117.61626","69.94773","707748","0.6392962"
"117.9463","70.09775","707765","0.63831866"
"118.186325","70.207756","707781","0.6363636"
"118.986435","70.39778","707831","0.6285435"
"119.376495","70.40778","707848","0.62561095"
"119.626526","70.337776","707864","0.6226784"
"119.86657","70.217766","707881","0.61974585"
"120.086586","70.087746","707898","0.6177908"
"120.176605","69.997734","707914","0.6226784"
"120.31663","69.767715","707931","0.627566"
"120.346634","69.6577","707948","0.62658846"
"120.36663","69.49768","707964","0.6285435"
"120.26662","69.24766","707981","0.6304985"
"120.18661","68.747604","707998","0.6236559"
"119.95658","68.35756","708014","0.62561095"
"119.69653","67.94751","708031","0.627566"
"119.3665","67.49746","708048","0.63147604"
"118.956436","67.01741","708064","0.6344086"
"118.31636","66.24732","708081","0.64320624"
"117.9163","65.817276","708098","0.6412512"
"117.62626","65.40723","708114","0.64320624"
"117.38622","64.98718","708131","0.6451613"
"117.15618","64.52713","708148","0.6471163"
"116.82615","63.87706","708164","0.65102637"
"116.60611","63.51702","708181","0.6539589"
"116.40608","63.19699","708198","0.65591395"
"116.22607","62.896954","708214","0.65689147"
"116.02603","62.4269","708231","0.65786904"
"115.97602","62.066864","708248","0.66373414"
"115.91601","61.706818","708264","0.6608016"
"115.85601","61.426792","708281","0.6520039"
"115.83601","61.216763","708298","0.6520039"
"115.83601","61.036747","708314","0.65004885"
"115.91601","60.876728","708331","0.6480938"
"116.02603","60.756714","708348","0.6451613"
"116.27608","60.72671","708364","0.6412512"
"116.66612","60.846725","708381","0.6344086"
"117.006165","61.036747","708398","0.629521"
"117.396225","61.306778","708414","0.62561095"
"117.79627","61.706818","708431","0.62463343"
"118.196335","62.18687","708448","0.62561095"
"118.6364","62.85695","708464","0.6217009"
"118.84641","63.337","708481","0.62072337"
"119.05646","63.837055","708498","0.61876833"
"119.27649","64.347115","708514","0.6168133"
"119.50652","64.84717","708531","0.61388075"
"119.82656","65.50724","708548","0.6119257"
"120.0566","65.85728","708564","0.6089932"
"120.29663","66.14731","708581","0.60703814"
"120.46665","66.42734","708598","0.62072337"
"120.78669","66.79738","708614","0.62658846"
"121.08673","66.987404","708631","0.61876833"
"121.406784","67.11742","708648","0.6168133"
"121.67681","67.24743","708664","0.61388075"
"121.96685","67.37744","708681","0.6109482"
"122.35691","67.477455","708698","0.60703814"
"122.69695","67.49746","708714","0.6041056"
"122.977","67.397446","708731","0.6001955"
"123.18703","67.197426","708748","0.599218"
"123.36704","66.867386","708764","0.6031281"
"123.437065","66.21732","708781","0.5982405"
"123.427055","65.83728","708798","0.597263"
"123.26703","65.42723","708814","0.6001955"
"123.007","64.88717","708831","0.6031281"
"122.41691","63.777046","708848","0.6060606"
"122.00686","63.01696","708864","0.6089932"
"121.656815","62.356895","708881","0.61876833"
"121.31677","61.796833","708898","0.6285435"
"120.93671","61.266773","708914","0.6168133"
"120.50666","60.49669","708931","0.6031281"
"120.21662","59.976624","708948","0.60215056"
"119.886566","59.486576","708964","0.6050831"
"119.65654","59.116535","708981","0.60703814"
"119.51652","58.8065","708998","0.6060606"
"119.496506","58.646484","709014","0.6031281"
"119.52652","58.48646","709031","0.599218"
"119.68654","58.386456","709048","0.59530795"
"119.77655","58.376457","709064","0.5894428"
"120.21662","58.516468","709081","0.5845552"
"120.57666","58.7965","709098","0.58162266"
"121.03672","59.23655","709114","0.5796676"
"121.446785","59.776608","709131","0.5786901"
"121.85684","60.33667","709148","0.57380253"
"122.3069","61.186764","709164","0.56989247"
"122.61694","61.816833","709181","0.57087"
"122.90698","62.4569","709198","0.5718475"
"123.20702","63.046967","709214","0.56989247"
"123.48707","63.887062","709231","0.58162266"
"123.797104","64.36712","709248","0.5786901"
"124.08716","64.73716","709264","0.58162266"
"124.39719","64.957184","709281","0.5855327"
"124.947266","65.1672","709298","0.5796676"
"125.33732","65.1872","709314","0.57575756"
"125.737366","65.20721","709331","0.572825"
"126.08742","65.20721","709348","0.56989247"
"126.34746","65.1672","709364","0.56793743"
"126.557495","65.0972","709381","0.5669599"
"126.73751","65.00719","709398","0.56793743"
"126.85753","64.76716","709414","0.56891495"
"126.87754","64.49713","709431","0.5718475"
"126.78752","64.07708","709448","0.5767351"
"126.40747","63.236988","709464","0.5826002"
"126.04742","62.596916","709481","0.59530795"
"125.55735","61.89684","709498","0.60801566"
"125.00726","61.216763","709514","0.5982405"
"124.477196","60.586697","709531","0.5884653"
"123.717094","59.60659","709548","0.5884653"
"123.217026","58.946518","709564","0.5845552"
"122.636955","58.416454","709581","0.5894428"
"122.17688","57.936405","709598","0.59433043"
"121.606804","57.19632","709614","0.60801566"
"121.18674","56.60626","709631","0.6041056"
"120.72668","56.0762","709648","0.58748776"
"120.346634","55.596146","709664","0.5855327"
"119.93657","55.196102","709681","0.5904203"
"119.26648","54.656044","709698","0.60703814"
"118.76642","54.266","709714","0.61388075"
"118.276344","53.86595","709731","0.61974585"
"117.82629","53.485912","709748","0.62561095"
"117.38622","53.055862","709764","0.63147604"
"116.806145","52.4758","709781","0.63831866"
"116.44609","52.145763","709798","0.64418375"
"116.086044","51.845734","709814","0.6529814"
"115.71599","51.555702","709831","0.6608016"
"115.0559","51.00564","709848","0.65493643"
"114.58583","50.595592","709864","0.6520039"
"114.24579","50.225548","709881","0.6617791"
"113.87574","49.825504","709898","0.66471165"
"113.45568","49.44547","709914","0.6686217"
"112.715576","48.995415","709931","0.67546433"
"112.20551","48.515366","709948","0.6803519"
"111.735435","47.89529","709964","0.684262"
"111.24536","47.38524","709981","0.6959922"
"110.7553","46.985195","709998","0.6979472"
"109.975204","46.145103","710014","0.6901271"
"109.475136","45.51503","710031","0.6930596"
"108.96505","45.03498","710048","0.6959922"
"108.43498","44.52492","710064","0.6969697"
"107.59487","43.54481","710081","0.6969697"
"107.0748","42.934746","710098","0.7028348"
"106.59474","42.324677","710114","0.7096774"
"106.10467","41.70461","710131","0.71260995"
"105.6646","41.014534","710148","0.7174975"
"104.934494","39.98442","710164","0.72238517"
"104.37443","39.284344","710181","0.72043014"
"103.774345","38.604267","710198","0.71847504"
"103.24426","37.924194","710214","0.71847504"
"102.45416","36.804066","710231","0.7419355"
"101.92408","36.103992","710248","0.73900294"
"101.51403","35.40391","710264","0.7380254"
"101.19399","34.70384","710281","0.73998046"
"100.91395","34.063766","710298","0.740958"
"100.43388","33.093655","710314","0.7233627"
"100.11384","32.363575","710331","0.7370479"
"99.77379","31.76351","710348","0.75659823"
"99.34372","31.153442","710364","0.7497556"
"98.84366","30.39336","710381","0.7438905"
"98.19357","29.253235","710398","0.7302053"
"97.83351","28.59316","710414","0.72140765"
"97.44347","27.86308","710431","0.69990224"
"97.13342","27.002985","710448","0.7174975"
"96.79337","25.852858","710464","0.7478006"
"96.58335","25.132778","710481","0.7419355"
"96.37332","24.362692","710498","0.7380254"
"96.043274","23.68262","710514","0.7350929"
"95.69322","23.042545","710531","0.74486804"
"95.29317","21.682398","710548","0.7497556"
"95.06313","20.98232","710564","0.7478006"
"94.823105","20.342249","710581","0.74486804"
"94.49306","19.572165","710598","0.742913"
"94.20302","18.792078","710614","0.7311828"
"93.69295","17.581944","710631","0.72238517"
"93.302895","16.781855","710648","0.72238517"
"92.98285","16.09178","710664","0.72140765"
"92.672806","15.531717","710681","0.7194526"
"92.15273","14.551608","710698","0.71847504"
"91.822685","13.911539","710714","0.71847504"
"91.48264","13.30147","710731","0.7233627"
"91.112595","12.681401","710748","0.7292278"
"90.70254","12.051332","710764","0.71260995"
"90.08245","11.12123","710781","0.6989247"
"89.61237","10.551166","710798","0.6969697"
"89.34234","10.221129","710814","0.69501466"
"88.742256","9.551056","710831","0.69403714"
"88.08217","9.061001","710848","0.6901271"
"86.841995","8.270914","710864","0.6969697"
"86.22192","7.96088","710881","0.6979472"
"85.541824","7.750857","710898","0.6813294"
"84.84173","7.4808264","710914","0.67644185"
"83.69157","6.960769","710931","0.67057675"
"82.91145","6.650735","710948","0.6686217"
"82.26137","6.3106976","710964","0.6686217"
"81.64128","6.090673","710981","0.65591395"
"80.98119","5.9406567","710998","0.63245356"
"80.3311","5.7206326","711014","0.62463343"
"79.671005","5.4906073","711031","0.62561095"
"78.98092","5.4105983","711048","0.62658846"
"78.37083","5.5206103","711064","0.627566"
"77.91077","5.7306337","711081","0.6285435"
"77.400696","6.2406898","711098","0.6353861"
"77.12065","6.7307444","711114","0.6402737"
"76.87062","7.2808046","711131","0.65591395"
"76.6906","7.840866","711148","0.68230695"
"76.630585","9.341033","711164","0.6735093"
"76.630585","10.531164","711181","0.6529814"
"76.7406","11.771301","711198","0.65591395"
"77.03064","12.981436","711214","0.6656892"
"77.39069","14.231573","711231","0.686217"
"78.1008","16.071777","711248","0.69501466"
"78.72088","17.501934","711264","0.7028348"
"79.45098","19.132114","711281","0.6959922"
"80.191086","20.692287","711298","0.70674485"
"81.231224","23.102552","711314","0.7233627"
"81.93132","24.752735","711331","0.7253177"
"82.65142","26.252903","711348","0.7380254"
"83.521545","27.833075","711364","0.72238517"
"84.37166","29.283236","711381","0.71358746"
"85.29179","30.803404","711398","0.72238517"
"85.84186","31.713505","711414","0.7243402"
"86.40194","32.613605","711431","0.70185727"
"86.94202","33.393692","711448","0.6871945"
"87.89215","34.493813","711464","0.70185727"
"88.662254","35.40391","711481","0.7086999"
"89.36234","36.163998","711498","0.71358746"
"89.90243","36.694057","711514","0.7194526"
"90.36249","37.204113","711531","0.7253177"
"91.08259","38.10421","711548","0.742913"
"91.71268","38.8843","711564","0.7302053"
"92.412766","39.71439","711581","0.70772237"
"93.212875","40.594486","711598","0.71358746"
"94.01299","41.34457","711614","0.7174975"
"94.90311","42.15466","711631","0.72140765"
"95.27316","42.60471","711648","0.72727275"
"95.65322","43.064762","711664","0.72043014"
"96.08328","43.534813","711681","0.7038123"
"96.71336","44.294895","711698","0.70087975"
"97.17343","44.824955","711714","0.70185727"
"97.51347","45.194996","711731","0.70087975"
"97.76351","45.51503","711748","0.70185727"
"98.06355","45.855072","711764","0.7028348"
"98.62363","46.365124","711781","0.70674485"
"99.003685","46.665157","711798","0.70576733"
"99.35373","46.955193","711814","0.7047898"
"99.59376","47.14521","711831","0.7086999"
"99.8138","47.355232","711848","0.71260995"
"100.28385","47.815285","711864","0.7038123"
"100.61391","48.105316","711881","0.6969697"
"100.87395","48.42535","711898","0.6979472"
"101.13397","48.71538","711914","0.6989247"
"101.49402","49.085426","711931","0.70087975"
"101.71405","49.28545","711948","0.70087975"
"101.89408","49.32545","711964","0.70087975"
"102.10411","49.345455","711981","0.70087975"
"102.37415","49.46547","711998","0.70185727"
"102.7642","49.68549","712014","0.70185727"
"102.974236","49.815506","712031","0.70185727"
"103.15425","49.935516","712048","0.7028348"
"103.344284","50.085537","712064","0.7028348"
"103.62432","50.245556","712081","0.7028348"
"103.71433","50.32556","712098","0.7038123"
"103.96438","50.50558","712114","0.7038123"
"104.09438","50.705605","712131","0.69501466"
"104.20439","50.885624","712148","0.69403714"
"104.33441","51.035637","712158","0.7028348"
"104.50443","51.145653","712181","0.7028348"
"104.66447","51.255665","712198","0.7028348"
"104.81448","51.345676","712214","0.7028348"
"104.9445","51.425682","712231","0.7028348"
"105.20454","51.525692","712248","0.70185727"
"105.324554","51.555702","712264","0.69990224"
"105.324554","51.555702","712281","0.70087975"
"105.43456","51.655712","712298","0.6989247"
"105.64459","51.835728","712314","0.6959922"
"105.77461","51.95574","712331","0.69501466"
"105.89464","52.085754","712348","0.6744868"
"105.82462","52.12576","712364","0.34604105"
"105.27454","52.74583","712378","9.775171E-4"
"104.35442","53.475906","712428","9.775171E-4"
"104.35442","53.475906","712428","9.775171E-4"
