"102.25413","47.295227","1264143","0.05083089"
"102.25413","47.295227","1264151","0.05083089"
"102.25413","47.38524","1264184","0.24437928"
"102.25413","47.38524","1264217","0.36656892"
"101.82407","47.43524","1264251","0.45845553"
"101.55403","47.425243","1264267","0.4848485"
"101.25399","47.28523","1264284","0.5102639"
"100.94395","47.095207","1264301","0.5278592"
"100.50389","46.80517","1264317","0.5288367"
"100.24385","46.63515","1264334","0.5219941"
"99.973816","46.39513","1264351","0.5278592"
"99.683784","46.1251","1264367","0.5366569"
"99.23371","45.57504","1264384","0.5483871"
"98.96368","45.184994","1264401","0.55620724"
"98.72363","44.864956","1264417","0.56207234"
"98.483604","44.52492","1264434","0.56402737"
"98.24357","44.15488","1264451","0.5650049"
"97.97353","43.654827","1264467","0.5650049"
"97.7235","43.34479","1264484","0.5659824"
"97.63349","43.054756","1264501","0.57478005"
"97.46347","42.814735","1264517","0.5826002"
"97.13342","42.594707","1264534","0.5855327"
"96.9834","42.26467","1264551","0.5826002"
"96.73336","42.064648","1264567","0.58748776"
"96.53334","41.874626","1264584","0.5904203"
"95.833244","40.64449","1264667","0.59530795"
"95.753235","40.55448","1264684","0.59530795"
"95.5332","40.204445","1264701","0.59335285"
"95.42319","40.024426","1264717","0.59237534"
"95.31316","39.834404","1264734","0.5913978"
"95.27316","39.744392","1264751","0.5904203"
"95.14315","39.584373","1264767","0.5904203"
"94.93312","39.36435","1264784","0.5913978"
"94.8331","39.244335","1264801","0.59237534"
"94.75309","39.154327","1264816","0.5913978"
"94.75309","39.154327","1264834","0.5904203"
"94.55307","38.964306","1264851","0.5894428"
"94.55307","38.964306","1264867","0.5894428"
"94.45305","38.8743","1264876","0.5894428"
"94.37305","38.784286","1264911","0.5884653"
"94.28302","38.74428","1264951","0.5904203"
"94.183014","38.73428","1264967","0.59237534"
"94.05299","38.764286","1264984","0.59433043"
"93.78295","38.9143","1265001","0.59628546"
"93.56293","39.034313","1265017","0.5982405"
"93.3329","39.154327","1265034","0.597263"
"93.092865","39.304344","1265051","0.59628546"
"92.85284","39.464363","1265067","0.59530795"
"92.502785","39.75439","1265084","0.59530795"
"92.27274","39.964417","1265101","0.59530795"
"92.04272","40.16444","1265117","0.59433043"
"91.83269","40.374462","1265134","0.59335285"
"91.64267","40.60449","1265147","0.59335285"
"91.42263","40.764503","1265166","0.59433043"
"91.102585","40.914524","1265184","0.5982405"
"90.90256","41.094543","1265200","0.60117304"
"90.79255","41.194553","1265217","0.6001955"
"90.69253","41.24456","1265234","0.599218"
"90.58251","41.324566","1265251","0.5982405"
"90.58251","41.324566","1265267","0.599218"
"90.58251","41.324566","1265283","0.597263"
"90.49251","41.42458","1265301","0.59628546"
"90.49251","41.42458","1265317","0.59530795"
"90.4725","41.53459","1265334","0.59433043"
"90.4625","41.53459","1265351","0.59433043"
"90.4325","41.654602","1265367","0.59335285"
"90.36249","41.864628","1265384","0.59335285"
"90.31248","41.99464","1265400","0.59433043"
"90.272484","42.084652","1265417","0.59433043"
"90.25248","42.084652","1265434","0.59433043"
"90.21246","42.174664","1265450","0.5913978"
"90.19247","42.174664","1265467","0.59335285"
"90.19247","42.174664","1265484","0.5913978"
"90.19247","42.174664","1265500","0.58651024"
"90.19247","42.174664","1265517","0.50635386"
"90.092445","41.844627","1265534","0.11730205"
"90.092445","41.654602","1265534","9.775171E-4"
"90.092445","41.654602","1265542","9.775171E-4"
"96.413315","39.904415","1265864","0.18084067"
"96.413315","39.904415","1265864","0.18084067"
"96.09327","39.944416","1265884","0.15933529"
"95.99327","39.944416","1265900","0.15640274"
"95.883255","39.89441","1265917","0.21309873"
"95.78324","39.7744","1265934","0.3304008"
"95.703224","39.684387","1265950","0.38709676"
"95.60321","39.51437","1265967","0.42619747"
"95.52319","39.36435","1265984","0.4525904"
"95.40319","39.16433","1266000","0.4799609"
"95.27316","38.954308","1266017","0.5288367"
"95.033134","38.67428","1266034","0.55034214"
"94.823105","38.474255","1266050","0.5591398"
"94.613075","38.224224","1266067","0.5591398"
"93.12287","36.874077","1266134","0.60801566"
"92.752815","36.594044","1266150","0.6041056"
"92.24275","36.08399","1266167","0.599218"
"91.912704","35.703945","1266184","0.59335285"
"91.54265","35.303905","1266200","0.5894428"
"91.1826","34.883858","1266217","0.58651024"
"90.822556","34.453808","1266234","0.5826002"
"90.29248","33.883743","1266250","0.5767351"
"89.93242","33.513706","1266267","0.5718475"
"89.52237","33.143665","1266284","0.5669599"
"89.09231","32.713615","1266300","0.55620724"
"88.42221","31.973532","1266317","0.56989247"
"87.99216","31.523483","1266334","0.5913978"
"87.59211","31.173449","1266350","0.5884653"
"87.22205","30.84341","1266367","0.5845552"
"86.91201","30.493372","1266384","0.58162266"
"86.54196","29.993315","1266400","0.5767351"
"86.28192","29.673279","1266417","0.57478005"
"86.06189","29.363245","1266434","0.572825"
"85.89187","29.053213","1266450","0.5718475"
"85.631836","28.66317","1266467","0.56891495"
"85.4418","28.423143","1266484","0.56793743"
"85.32179","28.183115","1266500","0.5650049"
"85.201775","27.993095","1266517","0.56207234"
"85.16177","27.903084","1266534","0.5610948"
"84.951744","27.59305","1266550","0.5493646"
"84.84173","27.463037","1266567","0.53763443"
"84.80171","27.373026","1266584","0.53763443"
"84.651695","27.203009","1266600","0.53763443"
"84.41167","27.022987","1266617","0.54545456"
"84.13162","26.762959","1266634","0.5913978"
"83.92159","26.542934","1266650","0.5913978"
"83.71157","26.322908","1266667","0.5913978"
"83.50154","26.082882","1266684","0.5904203"
"83.15149","25.852858","1266700","0.5894428"
"82.94147","25.722841","1266717","0.5894428"
"82.74143","25.472818","1266734","0.5894428"
"82.5214","25.332802","1266750","0.5884653"
"82.32138","25.15278","1266767","0.58748776"
"82.121346","24.762737","1266784","0.5826002"
"81.99133","24.562714","1266800","0.5826002"
"81.86131","24.372694","1266817","0.5826002"
"81.7713","24.272682","1266834","0.58064514"
"81.451256","23.932644","1266850","0.58064514"
"81.26123","23.742622","1266867","0.5796676"
"81.21123","23.652613","1266884","0.5786901"
"81.0712","23.502598","1266900","0.5777126"
"80.98119","23.34258","1266917","0.57575756"
"80.87118","23.112555","1266934","0.5777126"
"80.76116","22.80252","1266950","0.57478005"
"80.66115","22.472483","1266967","0.57380253"
"80.601135","22.192453","1266984","0.5718475"
"80.54113","21.872417","1267000","0.57087"
"80.431114","21.312355","1267017","0.56891495"
"80.3211","20.932314","1267034","0.56793743"
"80.21108","20.55227","1267050","0.5659824"
"80.061066","20.17223","1267067","0.56402737"
"79.74102","19.552162","1267084","0.5601173"
"79.550995","19.112112","1267100","0.5650049"
"79.37097","18.662064","1267117","0.5581623"
"79.20095","18.19201","1267134","0.5434995"
"79.03092","17.761963","1267150","0.5347019"
"78.77089","17.071888","1267167","0.5268817"
"78.54085","16.571833","1267184","0.5259042"
"78.26082","16.071777","1267200","0.52394915"
"77.980774","15.581722","1267217","0.5210166"
"77.72074","15.131672","1267234","0.51906157"
"77.32069","14.401591","1267250","0.5073314"
"77.07065","14.03155","1267267","0.51906157"
"76.80061","13.711516","1267284","0.53079176"
"76.560585","13.381479","1267300","0.4975562"
"76.28054","12.831417","1267317","0.46432063"
"76.16052","12.391371","1267334","0.44868034"
"76.04051","11.901315","1267350","0.43206257"
"75.920494","11.411262","1267367","0.42619747"
"75.86048","11.011217","1267384","0.4222874"
"75.750465","10.49116","1267400","0.4125122"
"75.71046","10.321141","1267417","0.4056696"
"75.66045","9.851089","1267434","0.427175"
"75.65046","9.371036","1267450","0.44770283"
"75.65046","9.371036","1267467","0.44281524"
"75.68046","8.970991","1267484","0.43304008"
"75.87049","8.510941","1267500","0.42521995"
"75.87049","8.510941","1267517","0.4183773"
"75.87049","8.510941","1267534","0.4115347"
"76.18053","8.080893","1267550","0.3714565"
"76.640594","7.7308545","1267567","0.37927663"
"76.640594","7.7308545","1267584","0.37927663"
"77.050644","7.2708035","1267600","0.37438905"
"77.48071","7.1907945","1267617","0.35874876"
"78.04079","7.1807933","1267634","0.34701857"
"78.490845","7.170792","1267650","0.3431085"
"78.99091","7.170792","1267667","0.33431086"
"79.500984","7.170792","1267684","0.32942328"
"80.00106","7.2708035","1267700","0.3304008"
"80.521126","7.3508124","1267717","0.33333334"
"81.0712","7.4308214","1267734","0.34506354"
"81.65128","7.42082","1267750","0.34604105"
"82.251366","7.42082","1267767","0.34506354"
"83.45153","7.7308545","1267784","0.34604105"
"84.05161","7.880871","1267800","0.35190615"
"84.60169","8.040889","1267817","0.35092863"
"85.15177","8.190906","1267834","0.3548387"
"85.68184","8.390927","1267850","0.3655914"
"86.1619","8.660957","1267867","0.37438905"
"86.641975","8.800973","1267884","0.38220918"
"87.28206","9.211018","1267900","0.3900293"
"87.68211","9.701073","1267917","0.38514173"
"88.2522","10.421152","1267934","0.3841642"
"88.61224","10.811195","1267950","0.39100683"
"88.95229","11.221241","1267967","0.39589444"
"89.28234","11.6212845","1267984","0.40469208"
"89.59238","12.04133","1268000","0.41544476"
"89.99243","12.761411","1268017","0.4222874"
"90.26247","13.241464","1268034","0.4183773"
"90.50251","13.771523","1268050","0.41642228"
"90.642525","14.261577","1268067","0.42130986"
"90.88255","15.031662","1268084","0.42913002"
"91.00258","15.531717","1268100","0.43304008"
"91.13259","15.9717655","1268117","0.43695015"
"91.25261","16.401814","1268134","0.4398827"
"91.39263","16.851864","1268150","0.44379276"
"91.60266","17.641949","1268167","0.45063537"
"91.73268","18.132006","1268184","0.4633431"
"91.8927","18.552052","1268200","0.4750733"
"92.03272","18.942095","1268217","0.47898337"
"92.25275","19.312134","1268234","0.47800586"
"92.372765","19.822191","1268250","0.4799609"
"92.502785","20.18223","1268267","0.48191592"
"92.65281","20.492264","1268284","0.48582602"
"92.802826","20.782297","1268300","0.48875856"
"93.04286","21.252348","1268317","0.49462366"
"93.162865","21.482374","1268334","0.4975562"
"93.28289","21.7324","1268350","0.50048876"
"93.42291","22.07244","1268367","0.5024438"
"93.53292","22.432478","1268384","0.5034213"
"93.84297","22.80252","1268400","0.5043988"
"93.972984","23.012545","1268417","0.49951124"
"93.99299","23.25257","1268434","0.4975562"
"94.103","23.44259","1268450","0.5034213"
"94.16301","23.642614","1268467","0.5073314"
"94.38304","23.862637","1268484","0.51124144"
"94.47305","24.012653","1268500","0.51319647"
"94.49306","24.262682","1268517","0.5151515"
"94.55307","24.442703","1268534","0.51808405"
"94.69309","24.62272","1268550","0.5210166"
"94.69309","24.62272","1268567","0.52297163"
"94.823105","24.712732","1268584","0.52297163"
"94.92311","24.812742","1268600","0.52297163"
"95.02313","24.832745","1268617","0.52394915"
"95.20315","24.87275","1268634","0.5259042"
"95.32317","24.87275","1268650","0.52394915"
"95.52319","24.87275","1268667","0.5200391"
"95.77323","24.812742","1268684","0.51710653"
"96.02327","24.692728","1268700","0.5151515"
"96.56335","24.51271","1268717","0.51124144"
"97.00341","24.202675","1268734","0.5092864"
"97.42346","23.942646","1268750","0.5073314"
"97.88352","23.69262","1268767","0.50537634"
"98.57362","23.34258","1268784","0.5043988"
"98.98368","23.242569","1268800","0.5034213"
"99.45374","23.15256","1268817","0.5024438"
"99.963806","23.002542","1268834","0.49951124"
"100.6339","22.732513","1268850","0.4965787"
"101.08396","22.632502","1268867","0.49462366"
"101.574036","22.542492","1268884","0.49951124"
"102.084114","22.452482","1268900","0.5073314"
"102.59417","22.342468","1268917","0.50635386"
"103.33428","22.24246","1268934","0.50537634"
"103.81435","22.132446","1268950","0.50537634"
"104.2244","22.082441","1268967","0.5043988"
"104.564445","22.012432","1268984","0.50537634"
"104.8745","21.882418","1269000","0.50537634"
"105.244545","21.782408","1269017","0.50537634"
"105.33456","21.81241","1269034","0.5073314"
"105.5946","21.932425","1269050","0.5083089"
"105.834625","21.942425","1269067","0.48680353"
"106.09466","21.862415","1269084","0.30596286"
"106.70475","21.842415","1269100","9.775171E-4"
"106.70475","21.842415","1269107","9.775171E-4"
"94.92311","26.06288","1269995","0.086021505"
"94.92311","26.06288","1270000","0.086021505"
"94.92311","26.06288","1270017","0.18084067"
"94.873116","25.962872","1270034","0.25415444"
"94.86311","25.86286","1270050","0.27272728"
"94.86311","25.86286","1270067","0.28152493"
"95.00313","25.882862","1270084","0.28445747"
"95.113144","25.87286","1270100","0.28445747"
"95.22315","25.79285","1270117","0.28739002"
"95.35318","25.642836","1270134","0.28836754"
"95.45319","25.532822","1270150","0.30498534"
"95.5332","25.42281","1270167","0.34408602"
"95.5332","25.42281","1270184","0.41348973"
"95.5332","25.42281","1270200","0.4623656"
"95.63321","25.50282","1270217","0.4975562"
"95.68322","25.602827","1270234","0.51808405"
"95.93325","26.042877","1270250","0.5366569"
"96.10329","26.392918","1270267","0.55131966"
"96.29331","26.88297","1270284","0.53958946"
"96.64335","27.51304","1270300","0.540567"
"96.89339","28.083105","1270317","0.5718475"
"97.12342","28.833187","1270334","0.59530795"
"97.323456","29.323242","1270350","0.6050831"
"97.50348","29.783293","1270367","0.6119257"
"97.67349","30.183334","1270384","0.61876833"
"97.853516","30.58338","1270400","0.62463343"
"98.15356","31.253454","1270417","0.6353861"
"98.3736","31.683504","1270434","0.6422287"
"98.62363","32.053543","1270450","0.64907134"
"98.873665","32.373577","1270467","0.6539589"
"99.09369","32.73362","1270484","0.629521"
"99.42374","33.243675","1270500","0.6168133"
"99.65378","33.56371","1270517","0.6304985"
"99.8638","33.77373","1270534","0.6334311"
"100.06383","33.983757","1270550","0.63831866"
"100.35387","34.293793","1270567","0.64418375"
"100.49389","34.443806","1270584","0.6461388"
"100.6039","34.573822","1270600","0.6480938"
"100.683914","34.683834","1270617","0.64907134"
"100.71392","34.793846","1270634","0.6520039"
"100.80393","34.93386","1270650","0.65591395"
"100.82394","35.073875","1270667","0.65786904"
"100.88394","35.323902","1270683","0.65884656"
"100.91395","35.473923","1270700","0.6598241"
"100.94395","35.56393","1270717","0.6617791"
"101.05397","35.893967","1270734","0.66373414"
"101.08396","36.043983","1270750","0.6656892"
"101.103966","36.133995","1270767","0.66373414"
"101.19399","36.27401","1270784","0.6617791"
"101.294","36.504032","1270800","0.6608016"
"101.294","36.504032","1270811","0.65884656"
"101.324005","36.614048","1270834","0.65884656"
"101.364006","36.704056","1270850","0.6608016"
"101.364006","36.81407","1270867","0.6627566"
"101.39401","36.92408","1270884","0.66471165"
"101.44402","37.044094","1270900","0.66373414"
"101.46402","37.174107","1270917","0.6656892"
"101.51403","37.284122","1270934","0.6666667"
"101.574036","37.504147","1270950","0.6666667"
"101.574036","37.654163","1270967","0.6686217"
"101.59404","37.82418","1270984","0.65102637"
"101.61404","37.914192","1271000","0.6353861"
"101.69406","38.04421","1271014","0.63831866"
"101.78407","38.144215","1271034","0.63831866"
"101.78407","38.144215","1271050","0.6392962"
"101.78407","38.244225","1271067","0.6402737"
"101.78407","38.244225","1271084","0.6412512"
"101.81406","38.34424","1271100","0.6412512"
"101.83408","38.34424","1271112","0.63831866"
"101.94409","38.36424","1271131","0.63831866"
"102.0341","38.384243","1271150","0.63831866"
"102.0341","38.384243","1271167","0.63734114"
"102.21412","38.37424","1271184","0.6344086"
"102.34414","38.33424","1271200","0.6304985"
"102.44416","38.284233","1271217","0.627566"
"102.62418","38.154217","1271234","0.62561095"
"102.82421","37.9942","1271250","0.6236559"
"102.90422","37.864185","1271262","0.6217009"
"102.90422","37.774178","1271300","0.6226784"
"102.90422","37.774178","1271334","0.6236559"
"102.99423","37.684162","1271350","0.65786904"
"103.10424","37.70417","1271367","0.6402737"
"103.23426","37.804176","1271384","0.62463343"
"103.25427","37.904186","1271400","0.62561095"
"103.524315","38.134216","1271417","0.62658846"
"103.62432","38.26423","1271434","0.6285435"
"103.76434","38.404243","1271450","0.6285435"
"103.90435","38.51426","1271465","0.6285435"
"104.03437","38.544262","1271483","0.627566"
"104.15439","38.544262","1271500","0.6236559"
"104.2444","38.544262","1271517","0.62072337"
"104.2444","38.544262","1271533","0.6168133"
"104.2444","38.544262","1271550","0.6168133"
"104.15439","38.544262","1271567","0.62072337"
"104.01437","38.624268","1271583","0.6168133"
"103.92436","38.64427","1271600","0.6119257"
"103.75433","38.934303","1271617","0.6041056"
"103.69432","39.14433","1271633","0.597263"
"103.63432","39.484364","1271650","0.59237534"
"103.61433","39.764397","1271667","0.59530795"
"103.60431","40.114437","1271683","0.6041056"
"103.594315","40.40447","1271700","0.61290324"
"103.63432","40.724503","1271717","0.61974585"
"103.84435","41.174553","1271733","0.62072337"
"104.04437","41.464584","1271750","0.62072337"
"104.2444","41.71461","1271767","0.62072337"
"104.45444","41.934635","1271783","0.62072337"
"104.71448","42.214664","1271800","0.6226784"
"104.84448","42.384686","1271817","0.6217009"
"104.934494","42.5247","1271833","0.6217009"
"104.904495","42.70472","1271850","0.6168133"
"104.864494","42.88474","1271867","0.61388075"
"104.89449","43.124763","1271883","0.62072337"
"104.934494","43.33479","1271900","0.62561095"
"104.984505","43.534813","1271917","0.629521"
"105.12453","43.734833","1271933","0.6304985"
"105.30456","43.96486","1271950","0.6285435"
"105.6046","44.324898","1271967","0.6285435"
"105.834625","44.564922","1271983","0.6285435"
"106.06466","44.73494","1272000","0.6285435"
"106.164665","44.78495","1272017","0.6285435"
"106.44471","44.994972","1272033","0.627566"
"106.53471","45.07498","1272050","0.627566"
"106.56473","45.164993","1272067","0.6304985"
"106.60473","45.285004","1272083","0.6344086"
"106.624725","45.69505","1272100","0.65004885"
"106.624725","45.97508","1272117","0.65786904"
"106.60473","46.27512","1272133","0.6627566"
"106.624725","46.565147","1272150","0.66373414"
"106.73475","46.83518","1272167","0.66373414"
"107.0648","47.075203","1272183","0.6686217"
"107.28483","47.075203","1272200","0.6666667"
"107.49486","47.185215","1272217","0.6598241"
"107.70488","47.36524","1272233","0.6598241"
"107.93492","47.60526","1272250","0.6608016"
"108.02492","47.755276","1272267","0.6598241"
"108.05493","47.9153","1272283","0.6598241"
"108.194954","48.075314","1272300","0.6608016"
"108.30497","48.30534","1272317","0.6617791"
"108.40498","48.56537","1272333","0.6627566"
"108.545","48.94541","1272350","0.6627566"
"108.62501","49.04542","1272367","0.6627566"
"108.70502","49.18544","1272375","0.6627566"
"108.795044","49.04542","1272400","0.6617791"
"108.885056","49.005413","1272417","0.6617791"
"108.885056","48.985413","1272433","0.6617791"
"108.97506","48.985413","1272450","0.6627566"
"108.97506","48.985413","1272467","0.66373414"
"109.06507","49.075424","1272483","0.66373414"
"109.15508","49.095425","1272500","0.6656892"
"109.25509","49.125427","1272517","0.6666667"
"109.25509","49.125427","1272533","0.6676442"
"109.36511","49.175438","1272550","0.6676442"
"109.475136","49.26544","1272567","0.6666667"
"109.885185","49.28545","1272583","0.6656892"
"110.18523","49.275444","1272600","0.6666667"
"110.45526","49.13543","1272617","0.6656892"
"110.685295","49.13543","1272633","0.6656892"
"110.975334","49.145435","1272650","0.6666667"
"111.065346","49.105427","1272667","0.6666667"
"111.20536","49.065426","1272683","0.6666667"
"111.305374","49.055424","1272700","0.6666667"
"111.405396","49.055424","1272717","0.6676442"
"111.72545","49.055424","1272733","0.6686217"
"111.96548","49.055424","1272750","0.6676442"
"112.22551","49.015423","1272767","0.6656892"
"112.875595","48.745388","1272800","0.66373414"
"113.10563","48.625378","1272817","0.66373414"
"113.335655","48.49536","1272833","0.6627566"
"113.56569","48.38535","1272850","0.6627566"
"113.76572","48.31534","1272867","0.6627566"
"113.90574","48.22533","1272879","0.6627566"
"113.99575","48.215332","1272900","0.66373414"
"113.99575","48.215332","1272917","0.6686217"
"113.99575","48.215332","1272933","0.6725318"
"113.99575","48.215332","1272950","0.67546433"
"114.04576","48.295338","1272967","0.67644185"
"114.04576","48.295338","1272983","0.67546433"
"114.15577","48.295338","1273000","0.66959924"
"114.35581","48.185326","1273017","0.65591395"
"114.63584","47.705273","1273033","0.57380253"
"115.18592","47.11521","1273050","0.2228739"
"115.24593","46.005085","1273063","9.775171E-4"
"115.24593","46.005085","1273071","9.775171E-4"
"111.745445","49.48547","1274179","0.121212125"
"111.745445","49.48547","1274183","0.121212125"
"111.535416","49.655487","1274200","0.14565004"
"111.39539","49.655487","1274217","0.16422287"
"111.29537","49.655487","1274233","0.24340177"
"111.08534","49.705494","1274250","0.31867057"
"110.98534","49.805504","1274267","0.3890518"
"110.98534","49.805504","1274283","0.4349951"
"110.96534","49.895515","1274300","0.4692082"
"110.96534","49.895515","1274317","0.49462366"
"110.96534","49.895515","1274333","0.53274685"
"110.96534","49.895515","1274350","0.5659824"
"111.08534","50.01553","1274367","0.58748776"
"111.11536","50.115543","1274383","0.6089932"
"111.16537","50.23555","1274400","0.61974585"
"111.21538","50.50558","1274417","0.627566"
"111.275375","50.725605","1274433","0.63831866"
"111.52541","51.115654","1274450","0.6334311"
"111.71544","51.355675","1274467","0.6344086"
"111.88547","51.565697","1274483","0.6344086"
"112.00548","51.74572","1274500","0.6344086"
"112.14549","51.95574","1274517","0.6344086"
"112.30552","52.145763","1274533","0.6353861"
"112.485535","52.265778","1274550","0.6353861"
"112.73557","52.375786","1274567","0.6353861"
"112.925606","52.435795","1274583","0.63734114"
"113.01562","52.515804","1274600","0.6392962"
"113.30566","52.63582","1274617","0.6471163"
"113.41568","52.725834","1274633","0.6539589"
"113.515686","52.83584","1274650","0.65884656"
"113.6057","52.98585","1274664","0.6608016"
"113.835724","53.22588","1274683","0.6598241"
"114.06576","53.395897","1274700","0.65786904"
"114.3658","53.555923","1274717","0.65591395"
"114.78587","53.73594","1274733","0.65689147"
"115.50596","54.02597","1274750","0.6656892"
"115.826004","54.135986","1274767","0.66373414"
"116.12605","54.266","1274783","0.6617791"
"116.35607","54.366005","1274800","0.6608016"
"116.546104","54.416016","1274817","0.65884656"
"116.646126","54.46602","1274833","0.65786904"
"116.96616","54.586033","1274850","0.65591395"
"117.10617","54.706047","1274867","0.65689147"
"117.236206","54.82606","1274883","0.65884656"
"117.41623","55.056087","1274900","0.6608016"
"117.76628","55.42613","1274917","0.6598241"
"118.07632","55.616146","1274933","0.65689147"
"118.406364","55.77617","1274950","0.6529814"
"118.76642","55.886177","1274967","0.65004885"
"119.11647","56.006187","1274983","0.6471163"
"119.57653","56.16621","1275000","0.64320624"
"119.886566","56.46624","1275017","0.64907134"
"120.24662","56.856285","1275033","0.65884656"
"120.55666","57.18632","1275050","0.6656892"
"120.98672","57.53636","1275067","0.6686217"
"121.28676","57.756382","1275083","0.6666667"
"121.606804","57.986412","1275100","0.6656892"
"121.76683","58.276443","1275117","0.66373414"
"121.92685","58.58647","1275133","0.6617791"
"122.41691","59.046528","1275150","0.65884656"
"122.74696","59.33656","1275167","0.65689147"
"123.097015","59.646595","1275183","0.65591395"
"123.377045","59.976624","1275200","0.65591395"
"123.49706","60.306667","1275217","0.6627566"
"123.57709","60.856724","1275233","0.6793744"
"123.847115","61.29678","1275250","0.6793744"
"124.147156","61.836838","1275267","0.6871945"
"124.53722","62.376896","1275283","0.6930596"
"125.157295","62.976963","1275300","0.686217"
"125.46734","63.22699","1275317","0.68230695"
"125.667366","63.41701","1275333","0.6813294"
"125.72738","63.637035","1275350","0.6803519"
"125.737366","64.097084","1275367","0.68328446"
"125.62736","64.49713","1275383","0.6852395"
"125.50735","64.877174","1275400","0.6871945"
"125.36733","65.1472","1275417","0.6871945"
"125.287315","65.23721","1275433","0.6871945"
"125.03728","65.33723","1275450","0.686217"
"124.62723","65.32722","1275467","0.6803519"
"124.257164","65.25722","1275483","0.6735093"
"123.847115","65.1072","1275500","0.66373414"
"123.49706","64.88717","1275517","0.64907134"
"122.926994","64.387115","1275533","0.6177908"
"122.47692","63.79705","1275550","0.6031281"
"121.85684","63.06697","1275567","0.6031281"
"121.26676","62.436897","1275583","0.60801566"
"120.79669","61.97685","1275600","0.6177908"
"119.94658","61.546806","1275617","0.61974585"
"119.33649","61.37678","1275633","0.6217009"
"118.75641","61.22677","1275650","0.6226784"
"118.29634","61.046745","1275667","0.62658846"
"117.83629","60.836727","1275683","0.629521"
"117.61626","60.72671","1275700","0.6304985"
"117.526245","60.696712","1275717","0.6304985"
"117.40622","60.6567","1275732","0.629521"
"117.40622","60.6567","1275750","0.6285435"
"117.40622","60.6567","1275767","0.62658846"
"117.396225","60.78672","1275783","0.62658846"
"117.42622","61.046745","1275800","0.629521"
"117.61626","61.506794","1275817","0.63734114"
"117.95629","62.10687","1275833","0.6451613"
"118.58639","63.15698","1275850","0.64907134"
"119.04645","63.927067","1275867","0.64907134"
"119.56653","64.65715","1275883","0.6461388"
"120.0766","65.26722","1275900","0.64418375"
"120.57666","65.85728","1275917","0.64907134"
"120.76669","66.1173","1275933","0.6529814"
"120.8767","66.387344","1275950","0.6617791"
"121.06673","66.68737","1275967","0.6617791"
"121.27676","66.987404","1275983","0.65689147"
"121.406784","67.36745","1276000","0.65786904"
"121.42678","67.607475","1276017","0.6598241"
"121.406784","67.857506","1276033","0.6617791"
"121.27676","68.087524","1276050","0.66373414"
"121.23675","68.177536","1276067","0.6627566"
"120.93671","68.31755","1276083","0.64907134"
"120.71668","68.21754","1276100","0.6363636"
"120.46665","67.857506","1276117","0.6236559"
"120.176605","67.28744","1276133","0.60801566"
"119.446495","66.0873","1276150","0.599218"
"118.81643","65.30722","1276167","0.59433043"
"118.25633","64.68716","1276183","0.599218"
"117.696266","64.1571","1276200","0.6050831"
"117.15618","63.60703","1276217","0.6099707"
"116.51609","62.79694","1276233","0.6177908"
"116.20606","62.356895","1276250","0.62072337"
"115.926025","61.89684","1276267","0.62561095"
"115.65598","61.506794","1276283","0.62561095"
"115.085915","61.14676","1276300","0.6168133"
"114.75586","60.916733","1276317","0.61388075"
"114.48582","60.72671","1276333","0.6099707"
"114.37581","60.616703","1276350","0.6109482"
"114.37581","60.616703","1276367","0.6099707"
"114.37581","60.616703","1276383","0.60703814"
"114.28579","60.756714","1276400","0.6060606"
"114.28579","60.936733","1276417","0.6060606"
"114.28579","61.186764","1276433","0.60703814"
"114.39581","61.59681","1276450","0.61290324"
"114.88588","62.4569","1276467","0.61876833"
"115.36594","62.976963","1276483","0.627566"
"115.796005","63.46702","1276500","0.63245356"
"116.12605","63.917065","1276517","0.63147604"
"116.61611","64.53713","1276533","0.6285435"
"116.90615","64.92718","1276550","0.62658846"
"117.16618","65.26722","1276567","0.62561095"
"117.436226","65.527245","1276583","0.6217009"
"117.75626","65.767265","1276600","0.61974585"
"118.17634","66.15731","1276617","0.6177908"
"118.406364","66.52735","1276633","0.6158358"
"118.656395","66.9474","1276650","0.6158358"
"118.916435","67.36745","1276667","0.61485827"
"119.13647","67.8275","1276683","0.61290324"
"119.4865","68.62759","1276700","0.6099707"
"119.72655","69.147644","1276717","0.60801566"
"119.92657","69.6077","1276733","0.60703814"
"120.036575","69.967735","1276750","0.60801566"
"120.0766","70.657814","1276783","0.61876833"
"119.86657","70.82783","1276800","0.62463343"
"119.626526","70.87784","1276817","0.627566"
"119.376495","70.91784","1276833","0.6285435"
"118.996445","70.867836","1276850","0.627566"
"118.68639","70.63781","1276867","0.62658846"
"118.24634","70.29777","1276883","0.62561095"
"117.65625","69.757706","1276900","0.62561095"
"116.66612","68.49757","1276917","0.6217009"
"116.05603","67.607475","1276933","0.6217009"
"115.46595","66.79738","1276950","0.62463343"
"114.91588","66.13731","1276967","0.6158358"
"114.56583","65.63725","1276983","0.60801566"
"114.25579","64.93717","1277000","0.6089932"
"114.02576","64.427124","1277017","0.6089932"
"113.76572","63.927067","1277033","0.6099707"
"113.47568","63.487015","1277050","0.6119257"
"113.16564","63.176987","1277067","0.61485827"
"112.625565","62.886948","1277083","0.61876833"
"112.1955","62.77694","1277100","0.62072337"
"111.85546","62.71693","1277117","0.6226784"
"111.645424","62.71693","1277131","0.62463343"
"111.52541","62.746933","1277150","0.6236559"
"111.49541","62.866947","1277167","0.6217009"
"111.51542","63.166985","1277183","0.61876833"
"111.735435","63.537025","1277200","0.6168133"
"112.1055","64.08708","1277217","0.61485827"
"112.90561","65.0972","1277233","0.61485827"
"113.37566","65.77727","1277250","0.6158358"
"113.80573","66.43735","1277267","0.61485827"
"114.175766","66.997406","1277283","0.61388075"
"114.45582","67.407455","1277300","0.61290324"
"114.83588","68.05752","1277317","0.6158358"
"115.1159","68.59758","1277333","0.62072337"
"115.40595","69.237656","1277350","0.62561095"
"115.66598","69.89773","1277367","0.6304985"
"115.86601","70.78783","1277383","0.63147604"
"115.98602","71.39789","1277400","0.6344086"
"116.03603","72.00796","1277417","0.63734114"
"116.086044","72.59803","1277433","0.6422287"
"116.086044","73.2381","1277450","0.6471163"
"116.086044","74.02818","1277467","0.64907134"
"115.98602","74.33822","1277483","0.65004885"
"115.826004","74.46823","1277500","0.65102637"
"115.52596","74.52824","1277516","0.6480938"
"114.995895","74.57825","1277533","0.6402737"
"114.62584","74.54824","1277550","0.6363636"
"114.3058","74.38822","1277566","0.63734114"
"113.93574","74.13819","1277583","0.63734114"
"113.48568","73.79816","1277600","0.6392962"
"112.68558","73.14809","1277616","0.64320624"
"112.06549","72.688034","1277633","0.64418375"
"111.5454","72.22798","1277650","0.6451613"
"111.17537","71.82794","1277666","0.6451613"
"110.895325","71.35789","1277683","0.6461388"
"110.565285","70.62781","1277700","0.64418375"
"110.44526","70.18776","1277716","0.64320624"
"110.32526","69.78771","1277733","0.64418375"
"110.12521","69.45768","1277750","0.6422287"
"109.845184","68.96762","1277766","0.63734114"
"109.67516","68.53758","1277783","0.6334311"
"109.55513","68.11753","1277800","0.63245356"
"109.41511","67.79749","1277816","0.63245356"
"109.27511","67.477455","1277833","0.63147604"
"109.21509","67.29744","1277850","0.6304985"
"109.11508","67.09742","1277866","0.6304985"
"109.00506","66.827385","1277883","0.6334311"
"108.885056","66.47735","1277900","0.627566"
"108.74503","66.10731","1277916","0.61485827"
"108.585014","65.59725","1277933","0.6089932"
"108.47499","65.32722","1277950","0.60801566"
"108.35497","65.067184","1277966","0.60801566"
"108.30497","64.77716","1277983","0.6089932"
"108.21495","64.33711","1278000","0.60801566"
"108.09494","64.017075","1278016","0.60801566"
"107.974915","63.677036","1278033","0.60801566"
"107.8649","63.387005","1278050","0.6089932"
"107.7949","63.15698","1278066","0.6099707"
"107.65488","62.866947","1278083","0.6109482"
"107.58487","62.676926","1278100","0.6119257"
"107.51485","62.436897","1278116","0.6119257"
"107.43485","62.15687","1278133","0.6119257"
"107.28483","61.606808","1278150","0.61485827"
"107.18481","61.32678","1278166","0.60801566"
"107.1048","61.22677","1278183","0.6099707"
"106.98479","61.066746","1278200","0.6109482"
"106.86477","60.80672","1278216","0.6119257"
"106.73475","60.51669","1278233","0.61290324"
"106.66474","60.316666","1278250","0.61290324"
"106.60473","60.106644","1278266","0.6119257"
"106.56473","59.886623","1278283","0.61290324"
"106.52472","59.646595","1278300","0.61290324"
"106.47472","59.126537","1278316","0.61290324"
"106.424706","58.8165","1278333","0.61290324"
"106.374695","58.546474","1278350","0.6119257"
"106.324684","58.306446","1278366","0.6119257"
"106.28468","57.986412","1278383","0.6119257"
"106.26469","57.826393","1278400","0.6119257"
"106.24469","57.686375","1278416","0.6119257"
"106.23467","57.576366","1278432","0.6109482"
"106.23467","57.456352","1278450","0.6109482"
"106.25468","57.336338","1278466","0.6099707"
"106.3847","56.976295","1278483","0.6168133"
"106.51472","56.65626","1278500","0.62463343"
"106.66474","56.336227","1278516","0.6089932"
"106.784744","56.01619","1278533","0.59433043"
"106.964775","55.766163","1278550","0.59530795"
"107.0648","55.646156","1278566","0.59530795"
"107.16481","55.55614","1278583","0.59530795"
"107.29483","55.446125","1278600","0.59530795"
"107.59487","55.236107","1278616","0.59433043"
"107.8249","55.04608","1278633","0.59433043"
"108.04493","54.846066","1278650","0.59433043"
"108.244965","54.656044","1278666","0.59433043"
"108.34497","54.576035","1278683","0.59433043"
"108.62501","54.306004","1278700","0.59530795"
"108.72502","54.195988","1278716","0.59628546"
"108.72502","54.09598","1278733","0.597263"
"108.77503","53.975967","1278748","0.597263"
"108.77503","53.975967","1278766","0.599218"
"108.80503","53.875957","1278776","0.6001955"
"108.80503","53.875957","1278800","0.60215056"
"108.80503","53.875957","1278808","0.6031281"
"108.80503","53.875957","1278833","0.6041056"
"108.92506","53.795948","1278883","0.6041056"
"108.94505","53.685936","1278900","0.6031281"
"109.03507","53.56592","1278913","0.6041056"
"109.125084","53.475906","1278947","0.6041056"
"109.125084","53.475906","1278992","0.6050831"
"109.125084","53.475906","1279033","0.6060606"
"109.125084","53.475906","1279050","0.6050831"
"109.125084","53.475906","1279060","0.6060606"
"109.21509","53.425903","1279116","0.6060606"
"109.21509","53.415905","1279133","0.6060606"
"109.21509","53.415905","1279142","0.60703814"
"109.21509","53.415905","1279166","0.60703814"
"109.21509","53.415905","1279216","0.6041056"
"109.21509","53.415905","1279233","0.5884653"
"109.3051","53.375896","1279250","0.56989247"
"109.32511","53.19588","1279266","0.516129"
"109.52515","53.27589","1279283","0.27077225"
"109.61514","52.99586","1279293","9.775171E-4"
"109.61514","52.99586","1279300","9.775171E-4"
"108.11494","56.39623","1279823","0.1202346"
"107.98493","56.39623","1279833","0.15249267"
"107.87491","56.426235","1279850","0.16422287"
"107.77489","56.46624","1279866","0.19843598"
"107.77489","56.46624","1279883","0.2746823"
"107.65488","56.486244","1279900","0.39100683"
"107.52486","56.406235","1279916","0.4349951"
"107.38484","56.186214","1279933","0.4565005"
"107.20482","55.92618","1279950","0.4633431"
"107.03479","55.766163","1279966","0.47702834"
"106.86477","55.466125","1279983","0.48387095"
"106.73475","55.2061","1280000","0.4907136"
"106.60473","54.926075","1280016","0.49951124"
"106.47472","54.61603","1280033","0.5073314"
"106.20468","54.09598","1280050","0.5259042"
"106.09466","53.70594","1280066","0.5347019"
"106.034645","53.3559","1280083","0.53763443"
"105.914635","53.025864","1280100","0.53861195"
"105.754616","52.4958","1280116","0.53958946"
"105.55459","52.12576","1280133","0.542522"
"105.31456","51.795723","1280150","0.55131966"
"105.064514","51.465687","1280166","0.56207234"
"104.79447","51.105648","1280183","0.5894428"
"104.42442","50.50558","1280200","0.597263"
"104.1644","50.115543","1280216","0.5913978"
"103.86436","49.695496","1280233","0.59433043"
"103.564316","49.39546","1280250","0.59628546"
"103.264275","49.015423","1280266","0.599218"
"102.73419","48.185326","1280283","0.60215056"
"102.28414","47.67527","1280300","0.60801566"
"101.79407","47.195213","1280316","0.62561095"
"101.314","46.78517","1280333","0.6304985"
"100.6239","46.1351","1280350","0.6304985"
"100.223854","45.825066","1280366","0.6461388"
"99.883804","45.53503","1280383","0.6539589"
"99.63377","45.215","1280400","0.6520039"
"99.503746","44.92497","1280416","0.63734114"
"99.02368","43.62482","1280433","0.119257085"
"98.81366","43.014755","1280443","9.775171E-4"
"98.65363","42.36468","1280493","9.775171E-4"
"98.65363","42.36468","1280494","9.775171E-4"
