"94.94312","23.752626","1735513","0.11730205"
"94.92311","23.882639","1735541","0.25024438"
"94.92311","23.98265","1735575","0.40273705"
"94.92311","23.98265","1735625","0.52981424"
"95.05314","24.032658","1735658","0.5904203"
"95.05314","24.032658","1735675","0.6168133"
"95.05314","24.032658","1735691","0.6353861"
"95.05314","24.032658","1735708","0.65004885"
"95.05314","24.032658","1735725","0.67057675"
"95.05314","24.032658","1735741","0.68328446"
"95.05314","24.032658","1735758","0.6979472"
"95.05314","24.032658","1735775","0.7106549"
"95.073135","23.952646","1735791","0.72140765"
"95.073135","23.952646","1735808","0.73411536"
"95.073135","23.952646","1735825","0.7438905"
"95.073135","23.952646","1735841","0.7536657"
"94.98312","23.952646","1735858","0.76246333"
"94.873116","23.952646","1735875","0.773216"
"94.873116","23.952646","1735891","0.77614856"
"94.7831","24.002653","1735908","0.7771261"
"94.75309","24.122665","1735941","0.7771261"
"94.74309","24.212675","1735958","0.7790811"
"94.74309","24.32269","1735975","0.7790811"
"94.74309","24.452703","1735991","0.7800586"
"94.74309","24.562714","1735998","0.7800586"
"94.773094","24.652725","1736025","0.7800586"
"94.773094","24.652725","1736041","0.7790811"
"94.89312","24.61272","1736058","0.7800586"
"94.91312","24.492706","1736074","0.7800586"
"94.94312","24.362692","1736091","0.7790811"
"94.97312","24.222675","1736108","0.7790811"
"94.993126","24.112665","1736125","0.7800586"
"94.993126","24.022657","1736141","0.7800586"
"94.993126","24.022657","1736158","0.78103614"
"94.97312","23.932644","1736171","0.78201365"
"94.873116","24.012653","1736191","0.78299123"
"94.873116","24.33269","1736269","0.78299123"
"95.01314","24.33269","1736291","0.78201365"
"95.10314","24.302687","1736308","0.78299123"
"95.19316","24.162672","1736325","0.78201365"
"95.19316","24.162672","1736336","0.78103614"
"95.27316","24.042658","1736358","0.7800586"
"95.27316","23.952646","1736375","0.7790811"
"95.27316","23.952646","1736388","0.78103614"
"95.23316","23.942646","1736425","0.78201365"
"95.21316","23.942646","1736441","0.78103614"
"95.163155","24.042658","1736458","0.78201365"
"95.13315","24.172674","1736475","0.78299123"
"95.13315","24.392696","1736491","0.78299123"
"95.21316","24.502707","1736525","0.78396875"
"95.30317","24.532713","1736541","0.78494626"
"95.30317","24.552713","1736547","0.7859238"
"95.30317","24.552713","1736574","0.78494626"
"95.30317","24.552713","1736591","0.7859238"
"95.33318","24.682728","1736608","0.7859238"
"95.35318","24.802742","1736623","0.7859238"
"95.35318","24.932756","1736641","0.7869013"
"95.34317","25.06277","1736658","0.7859238"
"95.32317","25.192785","1736675","0.7878788"
"95.30317","25.292797","1736691","0.7888563"
"95.30317","25.292797","1736705","0.7878788"
"95.30317","25.412811","1736725","0.7888563"
"95.30317","25.522821","1736741","0.7888563"
"95.30317","25.652834","1736758","0.78983384"
"95.32317","25.75285","1736775","0.79081136"
"95.34317","25.86286","1736788","0.79081136"
"95.39318","25.972872","1736808","0.7917889"
"95.47318","26.102884","1736825","0.7927664"
"95.4932","26.202896","1736841","0.7937439"
"95.4932","26.202896","1736858","0.7937439"
"95.59321","26.33291","1736875","0.79569894"
"95.673225","26.442923","1736891","0.79667646"
"95.753235","26.562935","1736908","0.79569894"
"95.753235","26.562935","1736925","0.79667646"
"95.85325","26.662947","1736941","0.797654"
"95.96326","26.762959","1736975","0.79569894"
"96.053276","26.752956","1736991","0.7917889"
"96.15329","26.742956","1737008","0.79081136"
"96.15329","26.742956","1737025","0.79081136"
"96.15329","26.742956","1737036","0.7927664"
"96.2433","26.722954","1737058","0.7927664"
"96.2433","26.722954","1737075","0.7937439"
"96.2433","26.722954","1737091","0.79667646"
"96.2233","26.61294","1737108","0.80254155"
"96.18329","26.492926","1737125","0.80840665"
"96.053276","26.452925","1737141","0.81329423"
"95.60321","25.832855","1737208","0.82111436"
"95.56321","25.69284","1737225","0.82111436"
"95.47318","25.582829","1737239","0.82111436"
"95.44319","25.43281","1737258","0.82013685"
"95.363174","25.202787","1737275","0.8191593"
"95.34317","25.202787","1737291","0.8181818"
"95.23316","25.222788","1737307","0.8172043"
"95.22315","25.112774","1737325","0.8172043"
"95.20315","24.97276","1737341","0.8172043"
"95.19316","24.852747","1737358","0.81524926"
"95.19316","24.762737","1737375","0.81524926"
"95.19316","24.672728","1737391","0.81329423"
"95.19316","24.582718","1737408","0.8113392"
"95.22315","24.452703","1737425","0.81427175"
"95.27316","24.35269","1737441","0.81427175"
"95.38318","24.23268","1737457","0.81427175"
"95.38318","24.23268","1737475","0.81329423"
"95.4932","24.15267","1737491","0.8123167"
"95.60321","24.112665","1737508","0.8113392"
"95.69322","24.07266","1737525","0.8113392"
"95.81325","24.042658","1737541","0.8113392"
"96.08328","23.97265","1737558","0.8054741"
"96.32331","23.832636","1737575","0.80254155"
"96.47333","23.80263","1737591","0.80254155"
"96.61336","23.722622","1737608","0.80156404"
"96.74337","23.68262","1737625","0.80156404"
"96.83338","23.642614","1737641","0.80156404"
"96.9434","23.542603","1737658","0.80156404"
"96.9434","23.542603","1737675","0.80156404"
"96.9434","23.542603","1737691","0.80254155"
"96.9434","23.44259","1737708","0.80254155"
"96.86339","23.44259","1737725","0.80156404"
"96.86339","23.44259","1737741","0.80254155"
"96.73336","23.44259","1737758","0.80351907"
"96.633354","23.472597","1737775","0.8044966"
"96.513336","23.552605","1737791","0.8054741"
"96.2833","23.742622","1737808","0.8044966"
"96.09327","23.862637","1737825","0.80938417"
"95.90325","24.012653","1737841","0.8123167"
"95.80324","24.172674","1737858","0.8113392"
"95.753235","24.272682","1737875","0.8113392"
"95.703224","24.362692","1737891","0.81329423"
"95.673225","24.472706","1737908","0.81427175"
"95.65322","24.582718","1737925","0.8123167"
"95.65322","24.712732","1737941","0.81329423"
"95.65322","24.98276","1737958","0.81524926"
"95.673225","25.132778","1737975","0.81524926"
"95.76324","25.262794","1738008","0.8172043"
"95.76324","25.492817","1738025","0.8172043"
"95.823235","25.812853","1738041","0.8172043"
"95.84324","26.022879","1738058","0.8181818"
"95.86324","26.2329","1738075","0.8191593"
"95.883255","26.462925","1738091","0.8191593"
"95.923256","26.672947","1738108","0.82013685"
"96.03327","26.822966","1738119","0.82013685"
"96.2333","27.133","1738141","0.8181818"
"96.253296","27.40303","1738158","0.79667646"
"96.27331","27.553045","1738174","0.7771261"
"96.513336","27.823078","1738191","0.7673509"
"96.54334","27.95309","1738208","0.76930594"
"96.66335","28.053102","1738224","0.771261"
"96.75338","28.153114","1738241","0.773216"
"96.84338","28.263124","1738254","0.773216"
"96.933395","28.373138","1738274","0.7741935"
"97.023415","28.463146","1738291","0.77517104"
"97.11342","28.58316","1738308","0.77517104"
"97.213425","28.713175","1738324","0.7781036"
"97.41346","28.9632","1738341","0.7790811"
"97.523476","29.103216","1738358","0.7800586"
"97.603485","29.22323","1738374","0.78299123"
"97.6935","29.353243","1738391","0.78299123"
"97.77351","29.493261","1738408","0.78201365"
"97.823524","29.623274","1738424","0.7869013"
"97.93353","29.76329","1738441","0.7869013"
"97.99354","29.973312","1738458","0.7878788"
"98.073555","30.183334","1738474","0.78983384"
"98.073555","30.333353","1738491","0.7937439"
"98.17356","30.653389","1738508","0.7927664"
"98.22357","30.823406","1738524","0.7947214"
"98.323586","31.083435","1738541","0.7947214"
"98.403595","31.283459","1738558","0.79569894"
"98.50361","31.423471","1738574","0.8005865"
"98.59362","31.553488","1738591","0.8005865"
"98.68364","31.673502","1738608","0.8005865"
"98.78365","31.803514","1738624","0.80254155"
"98.873665","31.93353","1738641","0.8044966"
"98.98368","32.253563","1738658","0.8044966"
"99.01369","32.373577","1738674","0.8064516"
"99.01369","32.373577","1738691","0.80742913"
"99.1437","32.503593","1738708","0.80938417"
"99.27371","32.783623","1738724","0.8123167"
"99.30373","32.883633","1738741","0.8123167"
"99.45374","33.10366","1738758","0.8240469"
"99.503746","33.38369","1738774","0.8044966"
"99.58376","33.513706","1738791","0.7683284"
"99.78379","33.713726","1738808","0.771261"
"99.883804","33.813736","1738824","0.7722385"
"100.00383","33.903748","1738841","0.77517104"
"100.12383","34.003757","1738858","0.77614856"
"100.23385","34.093765","1738874","0.77614856"
"100.343864","34.11377","1738891","0.7790811"
"100.45388","34.20378","1738908","0.7790811"
"100.5539","34.28379","1738924","0.7790811"
"100.66391","34.3638","1738941","0.78103614"
"100.86394","34.513813","1738958","0.78299123"
"100.94395","34.64383","1738974","0.78396875"
"101.033966","34.763844","1738991","0.78299123"
"101.13397","34.793846","1739008","0.78201365"
"101.22398","34.93386","1739024","0.78201365"
"101.273994","35.043873","1739041","0.7790811"
"101.35401","35.223892","1739058","0.78201365"
"101.384","35.36391","1739074","0.7790811"
"101.42402","35.493923","1739091","0.77614856"
"101.44402","35.603935","1739108","0.7771261"
"101.49402","35.703945","1739119","0.7781036"
"101.63404","35.793957","1739141","0.77614856"
"101.63404","35.793957","1739158","0.7771261"
"101.72406","35.81396","1739174","0.7800586"
"101.72406","35.81396","1739191","0.7781036"
"101.81406","35.833958","1739208","0.7790811"
"101.81406","35.833958","1739224","0.7781036"
"101.90408","35.833958","1739241","0.7771261"
"101.90408","35.833958","1739258","0.7790811"
"101.9941","35.833958","1739268","0.7790811"
"101.9941","35.833958","1739291","0.78103614"
"101.9941","35.833958","1739324","0.7800586"
"101.9941","35.833958","1739341","0.7781036"
"101.9941","35.833958","1739358","0.7800586"
"102.084114","35.833958","1739374","0.78103614"
"102.084114","35.833958","1739391","0.78103614"
"102.084114","35.833958","1739408","0.7800586"
"102.10411","35.993977","1739416","0.78103614"
"102.124115","36.09399","1739441","0.7800586"
"102.21412","36.234005","1739458","0.78201365"
"102.24413","36.37402","1739473","0.78201365"
"102.32414","36.504032","1739491","0.78103614"
"102.34414","36.684055","1739508","0.78299123"
"102.39415","36.81407","1739524","0.78396875"
"102.41415","36.92408","1739541","0.78396875"
"102.41415","36.92408","1739558","0.78299123"
"102.41415","37.034096","1739574","0.7869013"
"102.41415","37.1341","1739591","0.78396875"
"102.39415","37.234116","1739624","0.78494626"
"102.39415","37.234116","1739641","0.7859238"
"102.28414","37.234116","1739650","0.7859238"
"102.15412","37.234116","1739674","0.7859238"
"102.0641","37.234116","1739691","0.7859238"
"101.95409","37.19411","1739708","0.7859238"
"101.86407","37.1141","1739724","0.78396875"
"101.68405","36.954086","1739741","0.78299123"
"101.60404","36.83407","1739758","0.78299123"
"101.524025","36.674053","1739774","0.78299123"
"101.50403","36.574043","1739791","0.78201365"
"101.44402","36.344017","1739808","0.78201365"
"101.44402","36.09399","1739824","0.78103614"
"101.44402","35.95397","1739841","0.7800586"
"101.524025","35.80396","1739858","0.78103614"
"101.54403","35.633938","1739874","0.78201365"
"101.56403","35.393913","1739891","0.7781036"
"101.56403","35.393913","1739908","0.7790811"
"101.66405","35.2939","1739916","0.7781036"
"101.75406","35.283897","1739941","0.7771261"
"101.874084","35.273895","1739958","0.77517104"
"101.96409","35.303905","1739974","0.77614856"
"102.07411","35.443916","1739991","0.7771261"
"102.21412","35.633938","1740008","0.7771261"
"102.34414","35.863964","1740024","0.7790811"
"102.51416","36.224003","1740041","0.7800586"
"102.62418","36.424026","1740058","0.78299123"
"102.65418","36.63405","1740074","0.78201365"
"102.75419","36.764065","1740088","0.78494626"
"102.774216","36.874077","1740108","0.78494626"
"102.774216","36.98409","1740124","0.78299123"
"102.774216","36.98409","1740141","0.78494626"
"102.55417","37.15411","1740191","0.78396875"
"102.44416","37.15411","1740208","0.78396875"
"102.334145","37.15411","1740224","0.78494626"
"102.20412","37.144104","1740241","0.78396875"
"102.0641","37.044094","1740255","0.78201365"
"101.96409","37.01409","1740274","0.78396875"
"101.86407","36.98409","1740291","0.78201365"
"101.75406","36.874077","1740308","0.78103614"
"101.744064","36.784065","1740324","0.78201365"
"101.72406","36.694057","1740341","0.78201365"
"101.72406","36.60405","1740358","0.7800586"
"101.72406","36.504032","1740374","0.7790811"
"101.75406","36.394024","1740391","0.7800586"
"101.80407","36.27401","1740408","0.78103614"
"101.93409","36.194","1740424","0.7781036"
"102.0141","36.08399","1740435","0.7771261"
"102.124115","35.98398","1740458","0.7771261"
"102.124115","35.98398","1740474","0.77614856"
"102.22414","35.98398","1740488","0.77614856"
"102.32414","36.01398","1740508","0.7781036"
"102.37415","36.133995","1740524","0.7790811"
"102.45416","36.254005","1740541","0.7781036"
"102.47417","36.36402","1740558","0.7790811"
"102.59417","36.624046","1740574","0.78201365"
"102.62418","36.714058","1740586","0.78201365"
"102.674194","36.88408","1740608","0.78103614"
"102.73419","37.124104","1740624","0.7800586"
"102.7642","37.304123","1740641","0.78103614"
"102.82421","37.584156","1740658","0.7790811"
"102.84421","37.794178","1740674","0.79667646"
"102.84421","38.014202","1740691","0.8113392"
"102.84421","38.17422","1740708","0.78494626"
"102.84421","38.304234","1740724","0.75659823"
"102.83421","38.45425","1740735","0.7546432"
"102.83421","38.59427","1740758","0.7536657"
"102.82421","38.74428","1740774","0.7546432"
"102.82421","38.99431","1740791","0.7546432"
"102.84421","39.27434","1740808","0.7546432"
"102.86421","39.45436","1740824","0.7546432"
"102.884224","39.644382","1740841","0.7546432"
"102.90422","39.734394","1740858","0.7546432"
"102.95423","39.91441","1740874","0.7546432"
"102.95423","40.204445","1740886","0.7546432"
"103.07424","40.34446","1740908","0.7556207"
"103.19426","40.544483","1740924","0.7556207"
"103.33428","40.7045","1740941","0.75659823"
"103.384285","40.80451","1740958","0.75659823"
"103.674324","41.074543","1740974","0.75757575"
"103.804344","41.224556","1740991","0.75855327"
"103.92436","41.354572","1741008","0.75757575"
"104.024376","41.494587","1741024","0.75757575"
"104.1244","41.5846","1741037","0.75855327"
"104.234406","41.674606","1741058","0.75855327"
"104.364426","41.78462","1741074","0.75855327"
"104.45444","41.864628","1741091","0.75855327"
"104.54444","41.944633","1741108","0.75757575"
"104.654465","42.174664","1741124","0.7595308"
"104.67447","42.174664","1741141","0.7605083"
"104.81448","42.26467","1741158","0.75855327"
"104.9145","42.28467","1741174","0.75757575"
"105.04451","42.42469","1741191","0.7556207"
"105.14452","42.454693","1741208","0.7556207"
"105.14452","42.454693","1741224","0.75855327"
"105.23454","42.60471","1741241","0.75757575"
"105.26455","42.724724","1741258","0.76441836"
"105.26455","42.97475","1741274","0.7605083"
"105.29454","43.114765","1741291","0.74486804"
"105.374565","43.214775","1741308","0.7438905"
"105.46458","43.394794","1741324","0.7419355"
"105.6046","43.764835","1741341","0.740958"
"105.71461","43.95486","1741358","0.7419355"
"105.834625","44.164883","1741374","0.73998046"
"105.964645","44.37491","1741391","0.73900294"
"106.06466","44.574924","1741408","0.73998046"
"106.26469","44.874958","1741424","0.73998046"
"106.3847","45.02498","1741441","0.73998046"
"106.51472","45.05498","1741458","0.73998046"
"106.54473","45.194996","1741474","0.740958"
"106.75476","45.445023","1741491","0.740958"
"107.00479","45.79506","1741508","0.73900294"
"107.134796","46.035088","1741524","0.73998046"
"107.26482","46.23511","1741541","0.740958"
"107.424835","46.405132","1741558","0.740958"
"107.60487","46.57515","1741574","0.73998046"
"107.88491","46.78517","1741591","0.73998046"
"108.05493","46.955193","1741608","0.740958"
"108.21495","47.085205","1741624","0.7419355"
"108.35497","47.205215","1741638","0.740958"
"108.47499","47.295227","1741657","0.73998046"
"108.595","47.295227","1741674","0.7419355"
"108.71502","47.295227","1741691","0.742913"
"108.81504","47.295227","1741708","0.7419355"
"108.90505","47.315228","1741724","0.740958"
"109.01506","47.535255","1741741","0.7419355"
"109.125084","47.625263","1741758","0.740958"
"109.20509","47.725273","1741774","0.740958"
"109.2851","47.865288","1741789","0.7419355"
"109.36511","47.995304","1741808","0.740958"
"109.425125","48.24533","1741824","0.740958"
"109.54514","48.375347","1741840","0.740958"
"109.62515","48.49536","1741858","0.73998046"
"109.71515","48.615376","1741874","0.73998046"
"109.80517","48.745388","1741891","0.73900294"
"109.92519","48.845398","1741902","0.73998046"
"110.0552","48.94541","1741924","0.7419355"
"110.175224","49.065426","1741941","0.742913"
"110.305244","49.085426","1741958","0.7419355"
"110.53527","49.11543","1741974","0.742913"
"110.6653","49.13543","1741991","0.7419355"
"110.77531","49.155434","1742008","0.740958"
"110.87533","49.275444","1742022","0.73998046"
"110.98534","49.235443","1742041","0.740958"
"111.075356","49.155434","1742052","0.740958"
"111.17537","49.155434","1742074","0.73998046"
"111.28538","49.155434","1742105","0.740958"
"111.3754","49.175438","1742124","0.73998046"
"111.46541","49.26544","1742202","0.740958"
"111.46541","49.26544","1742258","0.7419355"
"111.235374","49.365456","1742274","0.7419355"
"111.105354","49.385456","1742291","0.7419355"
"110.975334","49.475468","1742308","0.742913"
"110.845314","49.565483","1742324","0.7419355"
"110.735306","49.655487","1742341","0.7419355"
"110.645294","49.7455","1742355","0.7419355"
"110.565285","49.83551","1742374","0.7419355"
"110.525276","49.925518","1742391","0.7419355"
"110.485275","50.01553","1742408","0.740958"
"110.475266","50.19555","1742424","0.740958"
"110.475266","50.30556","1742455","0.7419355"
"110.50527","50.405575","1742474","0.740958"
"110.50527","50.405575","1742491","0.740958"
"110.58528","50.51558","1742508","0.73900294"
"110.6953","50.625595","1742524","0.73216033"
"110.7453","50.725605","1742541","0.7253177"
"110.865326","50.775608","1742558","0.72825027"
"111.105354","50.945637","1742574","0.73998046"
"111.235374","50.975636","1742591","0.73900294"
"111.38538","51.02564","1742608","0.73900294"
"111.5454","51.07565","1742623","0.7380254"
"111.71544","51.09565","1742641","0.7370479"
"112.00548","51.09565","1742658","0.7370479"
"112.09548","51.09565","1742674","0.7360704"
"112.255516","51.09565","1742691","0.7360704"
"112.415535","51.09565","1742708","0.7350929"
"112.56556","51.09565","1742724","0.7350929"
"112.8556","50.99564","1742741","0.72727275"
"112.95561","50.915623","1742758","0.71847504"
"112.95561","50.915623","1742774","0.7253177"
"113.045616","50.80562","1742791","0.73313785"
"113.125626","50.715607","1742804","0.73411536"
"113.20565","50.615593","1742838","0.73411536"
"113.20565","50.615593","1742874","0.73313785"
"113.20565","50.615593","1742891","0.73216033"
"113.20565","50.615593","1742921","0.73313785"
"113.20565","50.615593","1742958","0.73411536"
"113.16564","50.735607","1742974","0.73411536"
"113.05562","50.83562","1742991","0.72629523"
"113.02562","50.92563","1743008","0.7194526"
"113.00562","50.92563","1743024","0.7243402"
"112.925606","51.035637","1743041","0.7350929"
"112.875595","51.15565","1743058","0.7350929"
"112.83559","51.255665","1743074","0.7360704"
"112.81559","51.355675","1743091","0.7360704"
"112.80559","51.45569","1743097","0.7350929"
"112.80559","51.575703","1743124","0.7350929"
"112.80559","51.66571","1743141","0.7350929"
"112.80559","51.785725","1743158","0.73411536"
"112.825584","51.89574","1743174","0.73411536"
"112.825584","51.995747","1743191","0.73411536"
"112.8456","52.10576","1743208","0.73313785"
"112.93561","52.215775","1743218","0.73313785"
"112.96561","52.325783","1743241","0.73313785"
"112.9856","52.325783","1743258","0.73313785"
"113.09563","52.445797","1743266","0.73313785"
"113.19565","52.565807","1743291","0.73216033"
"113.30566","52.655823","1743308","0.73216033"
"113.42567","52.74583","1743341","0.7311828"
"113.6157","52.875847","1743358","0.7311828"
"113.6157","52.875847","1743374","0.7311828"
"113.75572","52.965855","1743391","0.7302053"
"113.86574","53.015865","1743408","0.7292278"
"113.975746","53.105865","1743424","0.7292278"
"114.19579","53.21588","1743441","0.72825027"
"114.2958","53.21588","1743458","0.72825027"
"114.40581","53.245884","1743474","0.72727275"
"114.49582","53.325893","1743491","0.72727275"
"114.58583","53.325893","1743507","0.72629523"
"114.695854","53.3559","1743524","0.7253177"
"114.84587","53.49591","1743541","0.7302053"
"114.98589","53.575928","1743556","0.73313785"
"115.0759","53.575928","1743574","0.73313785"
"115.34594","53.695934","1743591","0.7419355"
"115.44595","53.745945","1743608","0.740958"
"115.56597","53.825954","1743624","0.73998046"
"115.70599","53.855953","1743641","0.73998046"
"115.94602","53.915962","1743658","0.7380254"
"116.09605","54.015972","1743674","0.7380254"
"116.23606","54.035976","1743691","0.7370479"
"116.35607","54.125984","1743708","0.7360704"
"116.49609","54.22599","1743724","0.7360704"
"116.71612","54.336006","1743741","0.7350929"
"116.846146","54.356007","1743758","0.73411536"
"116.976166","54.446014","1743774","0.73313785"
"117.11618","54.52603","1743791","0.73313785"
"117.2562","54.626038","1743806","0.73216033"
"117.38622","54.72605","1743824","0.7311828"
"117.53625","54.846066","1743841","0.7302053"
"117.67627","54.96608","1743858","0.7302053"
"117.83629","55.04608","1743874","0.7292278"
"118.15633","55.236107","1743891","0.72727275"
"118.31636","55.326115","1743908","0.72727275"
"118.406364","55.34612","1743924","0.72629523"
"118.55637","55.466125","1743941","0.7253177"
"118.706406","55.57614","1743958","0.7243402"
"118.956436","55.686153","1743970","0.7233627"
"119.11647","55.806168","1743991","0.72238517"
"119.26648","55.90618","1744008","0.72238517"
"119.40651","55.99619","1744024","0.72140765"
"119.52652","56.0762","1744041","0.72043014"
"119.71654","56.256218","1744058","0.7194526"
"119.80656","56.35623","1744074","0.71847504"
"119.90657","56.46624","1744091","0.71847504"
"120.01658","56.576256","1744108","0.7174975"
"120.19661","56.87629","1744124","0.6989247"
"120.426636","57.026302","1744141","0.7155425"
"120.47665","57.19632","1744158","0.7380254"
"120.61667","57.42635","1744174","0.7419355"
"120.636665","57.516354","1744191","0.74584556"
"120.89671","57.78639","1744207","0.7497556"
"121.04673","57.906395","1744224","0.7487781"
"121.196754","58.016415","1744241","0.7487781"
"121.35677","58.13643","1744257","0.7478006"
"121.496796","58.256443","1744274","0.7468231"
"121.6268","58.36645","1744291","0.7468231"
"121.77682","58.476463","1744307","0.74584556"
"121.80683","58.596478","1744324","0.74584556"
"121.80683","58.736492","1744341","0.74584556"
"121.996864","58.956512","1744357","0.74486804"
"122.116875","59.066532","1744374","0.7438905"
"122.22689","59.186546","1744391","0.742913"
"122.336914","59.31656","1744407","0.742913"
"122.48692","59.46657","1744424","0.7419355"
"122.64694","59.60659","1744440","0.7419355"
"122.76696","59.746605","1744457","0.740958"
"122.89699","59.886623","1744474","0.740958"
"123.027","60.016636","1744491","0.73998046"
"123.26703","60.316666","1744507","0.73900294"
"123.39706","60.476685","1744524","0.73900294"
"123.44705","60.5667","1744541","0.73900294"
"123.60707","60.716713","1744557","0.7380254"
"123.717094","60.86673","1744574","0.7380254"
"123.717094","61.16676","1744591","0.75268817"
"123.717094","61.306778","1744607","0.7595308"
"123.83711","61.45679","1744624","0.7595308"
"123.937126","61.61681","1744641","0.7595308"
"124.017136","61.796833","1744657","0.7478006"
"124.187164","62.066864","1744674","0.76246333"
"124.34718","62.246883","1744691","0.7771261"
"124.46719","62.4269","1744707","0.77614856"
"124.58722","62.616924","1744724","0.77614856"
"124.80724","62.896954","1744741","0.77614856"
"124.83726","62.98696","1744752","0.77517104"
"125.00726","63.246994","1744774","0.77517104"
"125.1173","63.42701","1744791","0.77517104"
"125.21731","63.627033","1744807","0.77517104"
"125.31732","63.827057","1744818","0.7741935"
"125.45734","64.12708","1744841","0.7741935"
"125.55735","64.33711","1744857","0.7741935"
"125.667366","64.52713","1744874","0.77517104"
"125.797386","64.77716","1744891","0.7741935"
"125.797386","64.93717","1744907","0.7741935"
"125.797386","65.02719","1744924","0.7741935"
"125.797386","65.1772","1744941","0.77517104"
"125.797386","65.32722","1744957","0.77614856"
"125.72738","65.567245","1744974","0.77517104"
"125.60735","65.657265","1744991","0.77614856"
"125.51735","65.68726","1745007","0.7771261"
"125.51735","65.70727","1745024","0.7781036"
"125.39732","65.75727","1745041","0.7781036"
"125.207306","65.75727","1745057","0.7790811"
"125.09728","65.74726","1745074","0.7800586"
"124.95727","65.63725","1745090","0.78201365"
"124.79724","65.50724","1745107","0.78299123"
"124.52721","65.277214","1745124","0.78396875"
"124.32719","65.067184","1745141","0.7859238"
"124.11714","64.86717","1745157","0.7869013"
"123.92714","64.65715","1745174","0.7878788"
"123.70709","64.427124","1745191","0.7888563"
"123.477066","64.107086","1745207","0.7722385"
"123.41705","63.847054","1745224","0.75757575"
"123.177025","63.587032","1745241","0.75855327"
"122.977","63.347004","1745257","0.7595308"
"122.666954","63.01696","1745274","0.7605083"
"122.47692","62.806946","1745291","0.7605083"
"122.2869","62.616924","1745307","0.7614858"
"122.116875","62.446903","1745324","0.76246333"
"121.97685","62.286884","1745341","0.76344085"
"121.93685","62.15687","1745357","0.76344085"
"121.90685","62.016853","1745374","0.7497556"
"121.80683","61.876835","1745391","0.74584556"
"121.67681","61.746822","1745407","0.75659823"
"121.41678","61.516804","1745424","0.75757575"
"121.31677","61.416786","1745441","0.75757575"
"121.20675","61.316776","1745457","0.75855327"
"121.11673","61.216763","1745474","0.75855327"
"121.02672","61.10676","1745489","0.7595308"
"120.93671","60.976738","1745506","0.7605083"
"120.836685","60.846725","1745524","0.7605083"
"120.78669","60.70671","1745541","0.7556207"
"120.73668","60.5667","1745557","0.7468231"
"120.686676","60.42668","1745574","0.7419355"
"120.51665","60.19665","1745591","0.742913"
"120.43664","60.106644","1745607","0.7438905"
"120.35663","60.016636","1745624","0.7438905"
"120.31663","59.92662","1745641","0.7438905"
"120.29663","59.92662","1745657","0.74486804"
"120.16661","59.816612","1745662","0.74486804"
"120.0566","59.736603","1745691","0.74584556"
"119.95658","59.706596","1745707","0.74584556"
"119.95658","59.6866","1745724","0.7468231"
"119.86657","59.60659","1745729","0.7468231"
"119.746544","59.49658","1745757","0.7468231"
"119.746544","59.49658","1745774","0.7478006"
"119.64654","59.456573","1745791","0.7478006"
"119.64654","59.44657","1745807","0.7487781"
"119.55652","59.406567","1745820","0.7487781"
"119.45651","59.36656","1745841","0.7487781"
"119.326485","59.276554","1745857","0.7497556"
"119.23647","59.26655","1745874","0.75073314"
"119.13647","59.25655","1745891","0.75073314"
"119.04645","59.25655","1745924","0.75171065"
"118.956436","59.276554","1745952","0.75171065"
"118.85643","59.36656","1745974","0.75268817"
"118.81643","59.46657","1746007","0.75268817"
"118.786415","59.566586","1746024","0.75268817"
"118.75641","59.656593","1746041","0.75268817"
"118.74641","59.92662","1746057","0.75171065"
"118.74641","60.086643","1746074","0.75171065"
"118.786415","60.27666","1746091","0.75073314"
"118.83642","60.486683","1746107","0.7497556"
"118.97645","60.81672","1746124","0.7497556"
"119.09646","61.036747","1746141","0.7487781"
"119.21648","61.24677","1746157","0.7487781"
"119.3565","61.466797","1746174","0.7478006"
"119.50652","61.716824","1746191","0.7370479"
"119.84656","62.12687","1746207","0.742913"
"120.046585","62.31689","1746224","0.75171065"
"120.1366","62.4169","1746241","0.75171065"
"120.38663","62.69693","1746257","0.75073314"
"120.55666","62.896954","1746274","0.7497556"
"120.57666","63.216988","1746291","0.7653959"
"120.62667","63.43701","1746307","0.77028346"
"120.75669","63.617035","1746324","0.76930594"
"120.8467","63.717045","1746341","0.76930594"
"121.06673","64.07708","1746357","0.7673509"
"121.18674","64.27711","1746374","0.7673509"
"121.32676","64.45712","1746391","0.7673509"
"121.35677","64.547134","1746407","0.7673509"
"121.5568","64.79716","1746421","0.7663734"
"121.71682","64.94718","1746441","0.7653959"
"121.84684","65.077194","1746457","0.7653959"
"121.86684","65.20721","1746474","0.76441836"
"121.86684","65.34722","1746491","0.76441836"
"121.88684","65.477234","1746507","0.76344085"
"122.22689","65.727264","1746524","0.76246333"
"122.38692","65.87728","1746541","0.7614858"
"122.47692","65.95729","1746557","0.7614858"
"122.64694","66.20732","1746574","0.7614858"
"122.866974","66.53735","1746591","0.7536657"
"122.996994","66.787384","1746607","0.7546432"
"123.13702","66.997406","1746624","0.76246333"
"123.18703","67.18742","1746641","0.76344085"
"123.28703","67.33745","1746654","0.76344085"
"123.307045","67.477455","1746673","0.76246333"
"123.32705","67.607475","1746691","0.76344085"
"123.32705","67.73749","1746707","0.76344085"
"123.32705","67.857506","1746724","0.76344085"
"123.19702","68.05752","1746741","0.76441836"
"123.097015","68.15753","1746757","0.7653959"
"122.977","68.18753","1746774","0.7673509"
"122.846985","68.21754","1746791","0.7673509"
"122.68696","68.21754","1746807","0.7683284"
"122.42691","68.21754","1746824","0.7683284"
"122.246895","68.207535","1746841","0.77028346"
"122.05686","68.19754","1746857","0.771261"
"121.96685","68.177536","1746874","0.7722385"
"121.85684","68.12753","1746891","0.7741935"
"121.74683","67.99752","1746901","0.7741935"
"121.54679","67.857506","1746924","0.77517104"
"121.35677","67.72749","1746941","0.77614856"
"121.26676","67.637474","1746957","0.7771261"
"121.01672","67.46746","1746974","0.7781036"
"120.856705","67.33745","1746991","0.7790811"
"120.70668","67.18742","1747007","0.7800586"
"120.55666","67.04742","1747024","0.7741935"
"120.47665","66.81738","1747041","0.7653959"
"120.41664","66.547356","1747057","0.7497556"
"120.26662","66.35734","1747074","0.75855327"
"120.15661","66.30733","1747091","0.7595308"
"120.036575","66.13731","1747107","0.7595308"
"119.89657","65.977295","1747124","0.7605083"
"119.69653","65.73727","1747141","0.7614858"
"119.51652","65.477234","1747157","0.7614858"
"119.43651","65.38723","1747174","0.76246333"
"119.31649","65.23721","1747191","0.76246333"
"119.09646","64.88717","1747207","0.76344085"
"118.96644","64.69715","1747224","0.76441836"
"118.85643","64.467125","1747241","0.7653959"
"118.656395","64.2471","1747257","0.7653959"
"118.50638","64.00708","1747274","0.7663734"
"118.38637","63.787052","1747284","0.7673509"
"118.24634","63.537025","1747307","0.7683284"
"118.106316","63.357002","1747324","0.7683284"
"118.05631","63.266994","1747341","0.7683284"
"117.78628","62.916954","1747357","0.76930594"
"117.62626","62.72693","1747374","0.77028346"
"117.48624","62.566917","1747391","0.771261"
"117.36623","62.4069","1747407","0.7722385"
"117.2462","62.226883","1747424","0.773216"
"117.06618","61.89684","1747441","0.75659823"
"116.91615","61.69682","1747457","0.75659823"
"116.87616","61.576805","1747474","0.7673509"
"116.73614","61.43679","1747491","0.7683284"
"116.626114","61.286774","1747507","0.7683284"
"116.416084","61.016747","1747524","0.7683284"
"116.336075","60.916733","1747541","0.76930594"
"116.336075","60.916733","1747557","0.76930594"
"116.23606","60.80672","1747565","0.77028346"
"116.14605","60.766716","1747591","0.77028346"
"116.14605","60.756714","1747607","0.77028346"
"116.03603","60.716713","1747624","0.77028346"
"116.03603","60.70671","1747641","0.771261"
"115.94602","60.70671","1747651","0.771261"
"115.86601","60.846725","1747691","0.771261"
"115.846016","60.936733","1747707","0.771261"
"115.816","61.046745","1747724","0.771261"
"115.796005","61.176765","1747741","0.771261"
"115.776","61.446793","1747757","0.771261"
"115.776","61.59681","1747774","0.77028346"
"115.76599","61.706818","1747791","0.7614858"
"115.76599","62.016853","1747807","0.7556207"
"115.816","62.216877","1747824","0.7781036"
"115.89601","62.376896","1747841","0.7790811"
"115.91601","62.53691","1747857","0.7790811"
"115.96602","62.68693","1747874","0.7781036"
"115.98602","62.836945","1747891","0.7771261"
"116.09605","63.15698","1747907","0.77614856"
"116.12605","63.246994","1747924","0.77614856"
"116.22607","63.51702","1747941","0.77614856"
"116.346085","63.697037","1747955","0.77614856"
"116.45609","63.95707","1747974","0.77517104"
"116.5361","64.04707","1747984","0.77517104"
"116.63612","64.2071","1748007","0.7741935"
"116.78613","64.44713","1748023","0.773216"
"116.926155","64.60714","1748041","0.7722385"
"117.086174","64.86717","1748057","0.771261"
"117.28622","65.067184","1748074","0.77028346"
"117.446236","65.247215","1748091","0.76930594"
"117.65625","65.41724","1748107","0.7683284"
"117.99631","65.69726","1748124","0.7673509"
"118.20632","65.85728","1748141","0.7673509"
"118.406364","66.0273","1748157","0.7663734"
"118.59638","66.20732","1748174","0.7653959"
"118.79642","66.40734","1748191","0.76344085"
"119.076454","66.757385","1748207","0.7595308"
"119.25649","67.02741","1748224","0.7605083"
"119.39649","67.22743","1748241","0.76441836"
"119.52652","67.44746","1748257","0.76441836"
"119.65654","67.67748","1748274","0.76344085"
"119.786545","68.05752","1748291","0.7614858"
"119.886566","68.31755","1748307","0.7614858"
"119.93657","68.56758","1748324","0.7614858"
"119.98658","68.80761","1748341","0.7605083"
"120.02659","69.01763","1748357","0.7614858"
"120.02659","69.29766","1748374","0.7614858"
"120.046585","69.44767","1748391","0.7614858"
"120.046585","69.6077","1748407","0.7614858"
"120.046585","69.72771","1748421","0.7614858"
"120.046585","69.847725","1748441","0.7614858"
"120.046585","69.847725","1748457","0.76246333"
"120.00659","69.93773","1748474","0.76246333"
"119.90657","69.95773","1748491","0.76246333"
"119.786545","69.95773","1748507","0.76441836"
"119.536514","69.927734","1748524","0.7653959"
"119.31649","69.85772","1748541","0.7673509"
"119.05646","69.73771","1748557","0.76930594"
"118.79642","69.6277","1748574","0.771261"
"118.396355","69.41767","1748591","0.7722385"
"118.13632","69.267654","1748607","0.773216"
"117.86629","69.107635","1748624","0.7741935"
"117.58624","68.987625","1748641","0.77517104"
"117.33621","68.7676","1748657","0.7771261"
"117.02618","68.46757","1748674","0.7790811"
"116.83614","68.257545","1748691","0.7800586"
"116.66612","68.03752","1748707","0.78103614"
"116.51609","67.79749","1748724","0.78201365"
"116.386086","67.53747","1748741","0.78299123"
"116.21605","67.107414","1748757","0.78201365"
"116.086044","66.81738","1748774","0.77517104"
"115.96602","66.51736","1748791","0.77517104"
"115.83601","66.23732","1748807","0.78201365"
"115.67598","65.86728","1748824","0.78299123"
"115.44595","65.61725","1748841","0.7781036"
"115.25592","65.35722","1748857","0.7741935"
"115.085915","65.117195","1748874","0.7683284"
"114.88588","64.877174","1748891","0.76344085"
"114.76586","64.667145","1748907","0.76441836"
"114.60584","64.39712","1748924","0.7653959"
"114.45582","64.2371","1748941","0.7663734"
"114.41581","64.147095","1748957","0.7673509"
"114.26579","64.00708","1748974","0.7673509"
"114.01575","63.73705","1748991","0.7683284"
"113.895744","63.627033","1749007","0.7683284"
"113.77572","63.52702","1749024","0.76930594"
"113.65571","63.447018","1749038","0.77028346"
"113.54569","63.36701","1749057","0.771261"
"113.42567","63.327003","1749074","0.771261"
"113.32566","63.296997","1749091","0.771261"
"113.23565","63.276993","1749106","0.7722385"
"113.125626","63.276993","1749124","0.7722385"
"113.035614","63.307","1749141","0.7722385"
"113.035614","63.307","1749157","0.771261"
"112.93561","63.457016","1749174","0.771261"
"112.93561","63.457016","1749191","0.7722385"
"112.8656","63.717045","1749207","0.7722385"
"112.8456","63.86706","1749224","0.7722385"
"112.8456","64.017075","1749241","0.7722385"
"112.8456","64.17709","1749257","0.7722385"
"112.8656","64.267105","1749274","0.7722385"
"112.90561","64.53713","1749291","0.771261"
"112.99562","64.69715","1749301","0.771261"
"113.02562","64.85717","1749324","0.771261"
"113.125626","65.0972","1749341","0.77028346"
"113.22565","65.247215","1749354","0.77028346"
"113.31566","65.38723","1749374","0.76930594"
"113.41568","65.54725","1749391","0.77028346"
"113.515686","65.70727","1749407","0.76930594"
"113.675705","65.96729","1749424","0.7683284"
"113.895744","66.26733","1749441","0.7673509"
"114.03576","66.457344","1749457","0.7673509"
"114.19579","66.72738","1749474","0.76344085"
"114.3658","66.997406","1749491","0.76441836"
"114.52582","67.237434","1749507","0.7673509"
"114.75586","67.637474","1749524","0.7653959"
"114.97589","67.9175","1749541","0.77028346"
"115.19592","68.19754","1749557","0.7741935"
"115.30593","68.47757","1749574","0.7741935"
"115.48596","68.7576","1749591","0.7800586"
"115.75599","69.15764","1749607","0.78396875"
"115.88602","69.40768","1749624","0.78396875"
"115.99603","69.6577","1749641","0.78299123"
"116.10604","69.90773","1749657","0.78201365"
"116.24606","70.22776","1749674","0.78201365"
"116.346085","70.41778","1749691","0.78103614"
"116.45609","70.617805","1749707","0.7800586"
"116.49609","70.82783","1749724","0.7800586"
"116.60611","71.05785","1749741","0.7800586"
"116.626114","71.19787","1749757","0.7800586"
"116.65612","71.33788","1749774","0.7800586"
"116.676125","71.427895","1749791","0.77614856"
"116.70612","71.58791","1749807","0.77517104"
"116.756134","71.877945","1749824","0.78201365"
"116.776146","71.877945","1749841","0.78103614"
"116.776146","71.99796","1749850","0.78103614"
"116.76613","72.10797","1749874","0.78201365"
"116.756134","72.10797","1749891","0.78201365"
"116.676125","72.207985","1749899","0.78299123"
"116.57612","72.29799","1749924","0.78396875"
"116.4761","72.327995","1749941","0.78396875"
"116.4761","72.327995","1749957","0.78494626"
"116.35607","72.378","1749974","0.7859238"
"116.24606","72.378","1749986","0.7859238"
"116.12605","72.338","1750007","0.7869013"
"116.12605","72.31799","1750024","0.7869013"
"116.01603","72.21798","1750041","0.7869013"
"115.796005","72.047966","1750057","0.7888563"
"115.59597","71.94795","1750074","0.78299123"
"115.385956","71.847946","1750091","0.7790811"
"115.24593","71.80794","1750107","0.771261"
"114.87587","71.52791","1750124","0.76344085"
"114.73586","71.35789","1750141","0.7683284"
"114.57583","71.21787","1750157","0.76930594"
"114.39581","71.05785","1750174","0.77028346"
"114.22578","70.91784","1750191","0.773216"
"113.975746","70.68781","1750207","0.773216"
"113.81573","70.5078","1750224","0.773216"
"113.66571","70.31777","1750240","0.7741935"
"113.50569","70.11775","1750257","0.77517104"
"113.335655","69.927734","1750274","0.77517104"
"113.14564","69.6277","1750290","0.77614856"
"113.00562","69.39767","1750307","0.7771261"
"112.80559","69.17764","1750324","0.7771261"
"112.625565","68.97762","1750340","0.7771261"
"112.50555","68.7676","1750357","0.7781036"
"112.24551","68.47757","1750374","0.7790811"
"112.075485","68.29755","1750390","0.7800586"
"111.895454","68.13753","1750407","0.7800586"
"111.76545","67.967514","1750424","0.7790811"
"111.565414","67.71748","1750440","0.7800586"
"111.435394","67.557465","1750457","0.7800586"
"111.325386","67.407455","1750473","0.78103614"
"111.225365","67.277435","1750490","0.78201365"
"111.13535","67.157425","1750507","0.78201365"
"111.01535","66.9374","1750524","0.7790811"
"110.90532","66.79738","1750540","0.773216"
"110.815315","66.68737","1750557","0.77028346"
"110.735306","66.547356","1750574","0.77517104"
"110.70529","66.41734","1750590","0.78103614"
"110.645294","66.32733","1750607","0.78103614"
"110.59528","66.23732","1750624","0.7800586"
"110.515274","66.1173","1750640","0.78103614"
"110.475266","66.017296","1750657","0.78103614"
"110.275246","65.77727","1750674","0.7790811"
"110.16522","65.67726","1750690","0.7790811"
"110.13522","65.57725","1750707","0.7790811"
"110.08521","65.487236","1750724","0.7790811"
"109.9952","65.38723","1750740","0.7790811"
"109.885185","65.29722","1750757","0.7771261"
"109.78517","65.21721","1750768","0.7771261"
"109.75517","65.1072","1750790","0.7771261"
"109.73516","65.1072","1750807","0.7771261"
"109.64515","64.98718","1750824","0.7771261"
"109.595146","64.85717","1750840","0.7781036"
"109.54514","64.76716","1750857","0.7781036"
"109.49513","64.65715","1750874","0.7771261"
"109.41511","64.55714","1750890","0.7771261"
"109.295105","64.37711","1750907","0.7781036"
"109.175095","64.28711","1750924","0.7781036"
"109.08508","64.17709","1750940","0.7781036"
"108.98506","64.06708","1750957","0.7781036"
"108.87505","63.95707","1750974","0.7781036"
"108.76503","63.847054","1750984","0.7790811"
"108.64501","63.75705","1751007","0.7790811"
"108.51499","63.657032","1751024","0.7790811"
"108.36497","63.547024","1751040","0.7800586"
"108.07493","63.36701","1751057","0.7790811"
"107.90491","63.266994","1751074","0.7790811"
"107.71489","63.216988","1751090","0.7790811"
"107.53486","63.14698","1751107","0.7790811"
"107.33483","63.076977","1751124","0.7790811"
"107.1048","63.01696","1751140","0.7800586"
"106.92477","62.976963","1751157","0.7800586"
"106.76475","62.896954","1751174","0.7790811"
"106.50472","62.836945","1751190","0.7781036"
"106.33469","62.72693","1751207","0.7781036"
"106.06466","62.666927","1751224","0.7790811"
"105.97465","62.626923","1751240","0.7781036"
"105.80463","62.586918","1751257","0.7781036"
"105.56459","62.55691","1751274","0.7790811"
"105.18453","62.546913","1751290","0.78396875"
"105.04451","62.546913","1751300","0.7869013"
"104.81448","62.53691","1751324","0.7878788"
"104.68446","62.53691","1751340","0.7878788"
"104.574455","62.526913","1751357","0.7888563"
"104.35442","62.526913","1751374","0.7878788"
"104.2544","62.526913","1751390","0.7878788"
"104.1644","62.526913","1751407","0.7878788"
"104.07439","62.526913","1751422","0.7869013"
"103.984375","62.526913","1751440","0.7869013"
"103.85434","62.55691","1751457","0.7869013"
"103.75433","62.586918","1751474","0.7859238"
"103.66434","62.626923","1751489","0.7859238"
"103.564316","62.646927","1751507","0.7869013"
"103.474304","62.72693","1751523","0.7869013"
"103.364296","62.746933","1751540","0.7869013"
"103.25427","62.77694","1751557","0.7859238"
"103.15425","62.85695","1751574","0.78494626"
"103.04424","62.87695","1751590","0.78494626"
"102.95423","62.906956","1751599","0.78494626"
"102.84421","62.906956","1751622","0.78494626"
"102.7442","62.896954","1751652","0.7859238"
"102.7442","62.896954","1751674","0.78494626"
"102.724205","62.78694","1751690","0.78396875"
"102.724205","62.666927","1751707","0.78494626"
"102.7442","62.566917","1751724","0.78494626"
"102.774216","62.4569","1751740","0.78396875"
"102.91422","62.216877","1751757","0.78103614"
"102.94422","62.046852","1751774","0.76930594"
"103.07424","61.89684","1751790","0.7614858"
"103.12425","61.68682","1751807","0.76930594"
"103.20426","61.566807","1751824","0.7771261"
"103.37428","61.266773","1751840","0.7781036"
"103.4943","61.13676","1751857","0.7790811"
"103.594315","61.016747","1751874","0.7790811"
"103.70433","60.876728","1751890","0.7781036"
"103.81435","60.746716","1751907","0.7790811"
"103.91437","60.636703","1751924","0.7790811"
"103.99436","60.526688","1751940","0.7790811"
"104.08438","60.42668","1751957","0.7800586"
"104.17439","60.32667","1751974","0.7800586"
"104.37443","60.04664","1751990","0.7800586"
"104.40443","59.886623","1752007","0.7800586"
"104.53445","59.736603","1752024","0.7800586"
"104.564445","59.616592","1752040","0.78103614"
"104.68446","59.416565","1752057","0.78103614"
"104.79447","59.146534","1752074","0.78103614"
"104.904495","58.956512","1752090","0.78201365"
"104.984505","58.8065","1752107","0.78103614"
"105.114525","58.66649","1752124","0.7790811"
"105.27454","58.396454","1752140","0.7771261"
"105.414566","58.316444","1752157","0.7741935"
"105.544586","58.18643","1752174","0.771261"
"105.574585","58.066418","1752190","0.771261"
"105.67461","57.956406","1752207","0.7722385"
"105.79462","57.756382","1752224","0.7722385"
"105.90464","57.64637","1752240","0.7722385"
"105.98464","57.546364","1752257","0.7722385"
"106.01465","57.456352","1752274","0.7722385"
"106.13467","57.35634","1752287","0.7722385"
"106.22468","57.26633","1752305","0.7722385"
"106.30469","57.17632","1752324","0.7722385"
"106.40471","56.976295","1752340","0.75855327"
"106.50472","56.786274","1752354","0.74486804"
"106.59474","56.75627","1752374","0.74486804"
"106.68474","56.726273","1752407","0.7438905"
"106.68474","56.716267","1752414","0.74486804"
"106.784744","56.716267","1752457","0.74486804"
"106.784744","56.716267","1752490","0.7438905"
"106.784744","56.716267","1752507","0.7438905"
"106.87476","56.766277","1752520","0.7438905"
"106.87476","56.766277","1752540","0.74486804"
"106.87476","56.766277","1752557","0.74486804"
"106.89478","56.68626","1752574","0.7438905"
"106.91478","56.506245","1752590","0.75073314"
"106.98479","56.22621","1752607","0.75659823"
"107.00479","56.1262","1752624","0.75757575"
"107.02479","56.026196","1752640","0.75659823"
"107.0448","55.93618","1752655","0.75757575"
"107.0748","55.816174","1752674","0.75757575"
"107.0948","55.706154","1752703","0.75757575"
"107.124794","55.616146","1752724","0.75855327"
"107.14481","55.52614","1752757","0.75757575"
"107.16481","55.436127","1752787","0.75855327"
"107.16481","55.436127","1752817","0.75757575"
"107.16481","55.326115","1752840","0.75855327"
"107.16481","55.326115","1752874","0.75855327"
"107.124794","55.236107","1752890","0.75855327"
"107.1148","55.236107","1752907","0.75855327"
"107.014786","55.146095","1752938","0.75855327"
"106.91478","55.10609","1752974","0.75855327"
"106.82477","55.056087","1752990","0.75757575"
"106.82477","55.036083","1753007","0.75757575"
"106.82477","55.036083","1753024","0.75855327"
"106.72475","54.946075","1753040","0.75855327"
"106.64474","54.856064","1753052","0.7595308"
"106.56473","54.736046","1753074","0.75855327"
"106.54473","54.646038","1753090","0.75855327"
"106.50472","54.55603","1753107","0.75855327"
"106.45472","54.436016","1753124","0.75855327"
"106.39471","54.316","1753140","0.75855327"
"106.30469","54.075974","1753157","0.75855327"
"106.26469","53.895958","1753174","0.75855327"
"106.22468","53.775944","1753190","0.7595308"
"106.18468","53.56592","1753207","0.7595308"
"106.05466","53.265884","1753224","0.75855327"
"105.964645","53.11587","1753240","0.7595308"
"105.92464","52.99586","1753257","0.75855327"
"105.82462","52.89585","1753274","0.7595308"
"105.82462","52.89585","1753290","0.7605083"
"105.734604","52.785835","1753307","0.7595308"
"105.68459","52.675823","1753324","0.7595308"
"105.6346","52.585815","1753340","0.75855327"
"105.61459","52.585815","1753354","0.7595308"
"105.50458","52.505806","1753372","0.7614858"
"105.50458","52.505806","1753389","0.76441836"
"105.414566","52.455803","1753407","0.76441836"
"105.414566","52.445797","1753424","0.76441836"
"105.374565","52.345787","1753440","0.76441836"
"105.34455","52.235775","1753457","0.76441836"
"105.33456","52.235775","1753474","0.76441836"
"105.29454","52.145763","1753490","0.76441836"
"105.25455","52.045757","1753507","0.76441836"
"105.194534","51.95574","1753524","0.7663734"
"104.984505","51.88573","1753540","0.76930594"
"104.954506","51.72572","1753557","0.76930594"
"104.8545","51.5957","1753573","0.76930594"
"104.774475","51.45569","1753590","0.76930594"
"104.694466","51.305668","1753606","0.76930594"
"104.58444","51.045643","1753624","0.7663734"
"104.484436","50.85562","1753640","0.75757575"
"104.42442","50.655598","1753657","0.7605083"
"104.34441","50.455578","1753674","0.76930594"
"104.17439","50.20555","1753690","0.7683284"
"104.1244","50.115543","1753707","0.7683284"
"103.99436","49.94552","1753724","0.7673509"
"103.90435","49.7955","1753740","0.7683284"
"103.83434","49.555473","1753757","0.76930594"
"103.78434","49.425465","1753774","0.7683284"
"103.74433","49.335453","1753790","0.76930594"
"103.73434","49.335453","1753807","0.7683284"
"103.68433","49.21544","1753824","0.7683284"
"103.674324","49.21544","1753828","0.7683284"
"103.674324","49.21544","1753857","0.76930594"
"103.57432","49.11543","1753874","0.76930594"
"103.57432","49.11543","1753907","0.77028346"
"103.57432","49.11543","1753924","0.7683284"
"103.48431","49.02542","1753956","0.7683284"
"103.39428","48.925407","1753990","0.77028346"
"103.29427","48.845398","1754007","0.76930594"
"103.19426","48.825394","1754024","0.76930594"
"103.08424","48.77539","1754040","0.7683284"
"102.98423","48.69538","1754057","0.7683284"
"102.73419","48.635376","1754074","0.7683284"
"102.59417","48.605373","1754090","0.76930594"
"102.48416","48.58537","1754106","0.76930594"
"102.384155","48.545364","1754124","0.7683284"
"102.26413","48.44535","1754137","0.7683284"
"102.15412","48.42535","1754157","0.7683284"
"102.0241","48.42535","1754174","0.7673509"
"101.90408","48.39535","1754189","0.7663734"
"101.80407","48.375347","1754207","0.7663734"
"101.70405","48.335346","1754224","0.7673509"
"101.70405","48.325344","1754240","0.7673509"
"101.61404","48.295338","1754257","0.7653959"
"101.61404","48.275333","1754274","0.7663734"
"101.524025","48.255333","1754290","0.7673509"
"101.524025","48.24533","1754294","0.7673509"
"101.43401","48.24533","1754340","0.7653959"
"101.334","48.24533","1754374","0.7663734"
"101.24399","48.24533","1754407","0.7653959"
"101.24399","48.24533","1754422","0.7653959"
"101.15398","48.22533","1754440","0.76441836"
"101.023964","48.195328","1754457","0.76441836"
"100.91395","48.095318","1754474","0.7653959"
"100.773926","48.005306","1754490","0.76441836"
"100.61391","47.9153","1754507","0.76441836"
"100.41388","47.865288","1754524","0.7683284"
"100.04382","47.69527","1754540","0.7741935"
"99.79379","47.59526","1754557","0.7771261"
"99.58376","47.525253","1754574","0.7771261"
"99.38374","47.425243","1754590","0.7771261"
"99.27371","47.39524","1754607","0.77517104"
"99.1537","47.37524","1754624","0.77614856"
"99.1537","47.37524","1754640","0.77517104"
"99.1537","47.37524","1754655","0.7741935"
"99.1537","47.37524","1754690","0.7800586"
"99.203705","47.46525","1754707","0.77517104"
"99.43374","47.60526","1754724","0.77517104"
"99.61377","47.785286","1754740","0.77517104"
"99.82379","47.9453","1754757","0.77614856"
"100.23385","48.11532","1754774","0.76930594"
"100.473885","48.235332","1754790","0.7653959"
"100.71392","48.355343","1754807","0.7614858"
"100.92394","48.49536","1754824","0.76246333"
"101.12398","48.605373","1754836","0.76344085"
"101.273994","48.69538","1754857","0.76344085"
"101.40401","48.745388","1754874","0.76344085"
"101.51403","48.825394","1754890","0.76344085"
"101.60404","48.825394","1754902","0.76441836"
"101.71405","48.915405","1754923","0.76441836"
"101.81406","48.93541","1754940","0.76344085"
"101.81406","48.93541","1754956","0.76344085"
"101.90408","48.905407","1754990","0.76441836"
"101.92408","48.77539","1755021","0.76441836"
"101.95409","48.655376","1755040","0.7653959"
"101.95409","48.535362","1755057","0.7653959"
"101.93409","48.38535","1755074","0.7653959"
"101.90408","48.12532","1755090","0.7653959"
"101.86407","47.9453","1755107","0.7663734"
"101.79407","47.745277","1755124","0.7653959"
"101.72406","47.525253","1755140","0.7653959"
"101.63404","47.355232","1755157","0.76344085"
"101.524025","47.10521","1755174","0.7673509"
"101.39401","46.905186","1755190","0.76441836"
"101.26399","46.625153","1755207","0.76441836"
"101.08396","46.205105","1755224","0.76441836"
"100.88394","45.925076","1755240","0.76441836"
"100.70392","45.67505","1755257","0.76441836"
"100.513885","45.415016","1755274","0.76441836"
"100.303856","45.174995","1755290","0.7673509"
"100.103836","45.124985","1755307","0.773216"
"99.80379","44.864956","1755324","0.7741935"
"99.38374","44.43491","1755357","0.7741935"
"99.1837","44.23489","1755374","0.7722385"
"98.89367","44.034866","1755390","0.773216"
"98.713646","43.894848","1755407","0.77517104"
"98.52361","43.754837","1755424","0.77517104"
"98.333595","43.574818","1755440","0.7741935"
"98.06355","43.364796","1755457","0.7741935"
"97.93353","43.204777","1755474","0.7741935"
"97.813515","43.164772","1755490","0.7741935"
"97.7235","43.07476","1755507","0.7741935"
"97.7235","42.954746","1755524","0.7741935"
"97.18343","42.714718","1755540","0.799609"
"97.28344","42.574703","1755557","0.78983384"
"97.10342","42.484695","1755574","0.7800586"
"96.99341","42.34468","1755590","0.78201365"
"96.683365","42.014645","1755607","0.7859238"
"96.54334","41.874626","1755624","0.78983384"
"96.423325","41.68461","1755640","0.7888563"
"96.30331","41.664604","1755657","0.79081136"
"96.12328","41.464584","1755674","0.79569894"
"95.96326","41.15455","1755690","0.7937439"
"95.833244","40.99453","1755707","0.7917889"
"95.71323","40.844513","1755724","0.79081136"
"95.59321","40.7045","1755740","0.7917889"
"95.43319","40.484474","1755757","0.7937439"
"95.23316","40.194443","1755774","0.79081136"
"95.10314","40.044426","1755790","0.78983384"
"94.98312","39.884407","1755807","0.79081136"
"94.93312","39.7944","1755824","0.7878788"
"94.613075","39.414352","1755840","0.7878788"
"94.563065","39.314346","1755857","0.7869013"
"94.353035","39.06432","1755874","0.7859238"
"94.233025","38.964306","1755890","0.78396875"
"94.083","38.81429","1755907","0.78299123"
"93.75296","38.464252","1755924","0.78299123"
"93.57293","38.234226","1755940","0.7869013"
"93.40291","38.004204","1755957","0.8162268"
"93.3129","37.864185","1755974","0.827957"
"93.04286","37.484142","1755990","0.80742913"
"92.922844","37.324127","1756007","0.80156404"
"92.81283","37.21411","1756024","0.8044966"
"92.712814","37.1141","1756040","0.8044966"
"92.61279","36.98409","1756057","0.80156404"
"92.52278","36.894077","1756074","0.8044966"
"92.39277","36.774067","1756090","0.80156404"
"92.30276","36.684055","1756107","0.8005865"
"92.30276","36.684055","1756124","0.80156404"
"92.20274","36.574043","1756140","0.799609"
"92.112724","36.484035","1756151","0.7986315"
"92.06271","36.38402","1756174","0.80156404"
"91.952705","36.334015","1756190","0.8005865"
"91.85269","36.234005","1756207","0.7947214"
"91.65266","36.03398","1756224","0.7937439"
"91.49264","35.923973","1756240","0.79667646"
"91.34262","35.80396","1756257","0.799609"
"91.26261","35.713947","1756274","0.797654"
"90.96257","35.35391","1756290","0.80156404"
"90.92256","35.223892","1756307","0.80156404"
"90.78254","35.09388","1756323","0.7986315"
"90.62252","34.843853","1756340","0.7986315"
"90.4825","34.66383","1756357","0.797654"
"90.31248","34.473812","1756373","0.79569894"
"90.08245","34.22378","1756390","0.7937439"
"89.92243","34.05376","1756407","0.7947214"
"89.83241","33.973755","1756423","0.7917889"
"89.662384","33.813736","1756440","0.78983384"
"89.40236","33.623714","1756457","0.7878788"
"89.23233","33.4637","1756473","0.7888563"
"89.0323","33.233677","1756490","0.7878788"
"88.912285","33.153664","1756507","0.7859238"
"88.662254","32.973644","1756523","0.78494626"
"88.372215","32.47359","1756540","0.8162268"
"88.272194","32.28357","1756551","0.8357771"
"88.112175","32.04354","1756573","0.8289345"
"87.99216","31.903526","1756590","0.829912"
"87.852135","31.75351","1756607","0.827957"
"87.59211","31.523483","1756623","0.827957"
"87.48209","31.39347","1756640","0.82600194"
"87.392075","31.233452","1756657","0.8250244"
"87.29207","31.093435","1756673","0.8250244"
"87.18205","30.963423","1756690","0.8240469"
"87.06203","30.83341","1756707","0.8220919"
"86.95202","30.683392","1756723","0.8230694"
"86.852","30.543375","1756740","0.8230694"
"86.761986","30.413359","1756757","0.8240469"
"86.641975","30.113329","1756773","0.8172043"
"86.59197","29.96331","1756790","0.8162268"
"86.50195","29.823298","1756807","0.8191593"
"86.47195","29.693281","1756823","0.8181818"
"86.42194","29.533266","1756840","0.8181818"
"86.381935","29.40325","1756857","0.8191593"
"86.35194","29.173225","1756873","0.8191593"
"86.341934","29.173225","1756890","0.8162268"
"86.31192","29.073214","1756902","0.8181818"
"86.31192","28.9632","1756923","0.8162268"
"86.31192","28.85319","1756940","0.8172043"
"86.31192","28.85319","1756957","0.8162268"
"86.301926","28.753178","1756990","0.8172043"
"86.29192","28.753178","1757007","0.8172043"
"86.1619","28.733175","1757023","0.8191593"
"86.1619","28.723173","1757040","0.82013685"
"86.03189","28.683168","1757057","0.8220919"
"85.82186","28.623161","1757073","0.8240469"
"85.711845","28.573158","1757090","0.8230694"
"85.59183","28.463146","1757107","0.82013685"
"85.461815","28.363136","1757123","0.82013685"
"85.331795","28.23312","1757138","0.8220919"
"85.09176","28.073101","1757157","0.8191593"
"84.93174","27.923086","1757173","0.82111436"
"84.75171","27.733063","1757190","0.8230694"
"84.56168","27.583048","1757207","0.82111436"
"84.361664","27.41303","1757223","0.8172043"
"84.07162","27.133","1757240","0.8162268"
"83.83158","27.04299","1757257","0.83284456"
"83.58155","27.012985","1757273","0.856305"
"83.37152","26.912977","1757290","0.8611926"
"83.07148","26.69295","1757307","0.8611926"
"82.87145","26.572939","1757323","0.86021507"
"82.711426","26.42292","1757340","0.8611926"
"82.57141","26.33291","1757357","0.85923755"
"82.44139","26.222898","1757373","0.8572825"
"82.32138","26.072882","1757385","0.85923755"
"82.23136","25.932865","1757407","0.85826004"
"82.15135","25.802853","1757423","0.85923755"
"82.06134","25.69284","1757438","0.85826004"
"81.96133","25.602827","1757457","0.8572825"
"81.86131","25.602827","1757473","0.8572825"
"81.86131","25.602827","1757490","0.85826004"
"81.7713","25.562826","1757507","0.85826004"
"81.73129","25.452812","1757521","0.8572825"
"81.63128","25.352802","1757540","0.856305"
"81.611275","25.222788","1757557","0.8553275"
"81.60128","25.222788","1757573","0.856305"
"81.52126","25.132778","1757581","0.8572825"
"81.49126","24.98276","1757607","0.8572825"
"81.44125","24.892752","1757623","0.8572825"
"81.35124","24.682728","1757640","0.8572825"
"81.31123","24.462704","1757657","0.856305"
"81.27123","24.362692","1757673","0.856305"
"81.08121","24.182673","1757690","0.8367546"
"81.08121","24.162672","1757707","0.8191593"
"80.97119","24.112665","1757723","0.8191593"
"80.851166","23.842634","1757740","0.82013685"
"80.72115","23.70262","1757754","0.8181818"
"80.561134","23.402584","1757773","0.83870965"
"80.42111","23.212566","1757790","0.85826004"
"80.29109","23.032547","1757807","0.85826004"
"80.15108","22.842524","1757823","0.8572825"
"79.90104","22.552492","1757840","0.8572825"
"79.78102","22.312468","1757857","0.8572825"
"79.631004","22.022434","1757873","0.8572825"
"79.48098","21.752403","1757890","0.85826004"
"79.28096","21.492376","1757904","0.8572825"
"79.12094","21.332357","1757923","0.8572825"
"78.86089","21.062328","1757940","0.85435"
"78.73088","20.842304","1757957","0.8553275"
"78.59086","20.652283","1757973","0.856305"
"78.47085","20.422256","1757990","0.856305"
"78.26082","20.132225","1758007","0.8553275"
"78.14079","19.9122","1758023","0.8553275"
"78.030785","19.702177","1758040","0.85435"
"77.92076","19.492155","1758057","0.85337245"
"77.76074","18.9921","1758073","0.827957"
"77.65073","18.72207","1758090","0.80351907"
"77.530716","18.472042","1758107","0.7986315"
"77.4207","18.202013","1758123","0.80742913"
"77.30068","17.90198","1758140","0.8230694"
"77.150665","17.481934","1758157","0.8220919"
"77.04064","17.1819","1758173","0.82111436"
"76.92063","16.851864","1758190","0.8230694"
"76.79061","16.591835","1758207","0.8240469"
"76.680595","16.361809","1758223","0.82111436"
"76.46057","15.981767","1758240","0.8191593"
"76.32055","15.771743","1758257","0.8103617"
"76.24054","15.561721","1758273","0.8044966"
"76.13052","15.351697","1758290","0.80351907"
"75.9805","15.021661","1758307","0.80351907"
"75.87049","14.821638","1758323","0.8005865"
"75.82048","14.581612","1758340","0.80156404"
"75.73047","14.231573","1758357","0.7859238"
"75.61044","13.901537","1758373","0.76441836"
"75.48043","13.441485","1758390","0.76344085"
"75.370415","13.091447","1758407","0.75268817"
"75.250404","12.721406","1758423","0.7438905"
"75.13038","12.371367","1758440","0.742913"
"75.05037","12.021329","1758457","0.742913"
"74.92036","11.481269","1758473","0.742913"
"74.81033","11.201239","1758490","0.742913"
"74.73032","10.941209","1758507","0.742913"
"74.63032","10.651177","1758523","0.740958"
"74.5403","10.251134","1758540","0.73998046"
"74.5003","9.991104","1758557","0.7380254"
"74.490295","9.751078","1758573","0.7370479"
"74.490295","9.751078","1758590","0.71652"
"74.51029","9.341033","1758607","0.69403714"
"74.51029","9.341033","1758619","0.6920821"
"74.51029","9.341033","1758640","0.6901271"
"74.740326","8.910985","1758656","0.7311828"
"74.740326","8.910985","1758690","0.70576733"
"75.03037","8.500939","1758707","0.6871945"
"75.03037","8.500939","1758723","0.6852395"
"75.03037","8.500939","1758740","0.7047898"
"75.41042","8.100895","1758754","0.7233627"
"75.41042","8.100895","1758773","0.72238517"
"75.86048","7.8908725","1758790","0.72238517"
"75.86048","7.8908725","1758807","0.7438905"
"76.350555","7.7408557","1758823","0.76930594"
"76.350555","7.7408557","1758840","0.7741935"
"76.85062","7.7408557","1758857","0.78494626"
"77.25067","7.770859","1758873","0.78396875"
"77.25067","7.770859","1758890","0.7741935"
"77.73074","7.8908725","1758907","0.7741935"
"78.28082","7.9908834","1758920","0.7722385"
"78.69087","7.9908834","1758940","0.7370479"
"79.12094","8.100895","1758957","0.73998046"
"79.54099","8.210908","1758973","0.7438905"
"80.13107","8.380927","1758987","0.73313785"
"80.64114","8.530943","1759007","0.7350929"
"80.64114","8.530943","1759023","0.7781036"
"81.16122","8.6709585","1759040","0.78983384"
"81.64128","8.820974","1759057","0.7790811"
"81.64128","8.820974","1759073","0.8005865"
"82.14135","9.091005","1759090","0.7947214"
"82.14135","9.091005","1759107","0.797654"
"82.64142","9.321031","1759123","0.78983384"
"83.03147","9.551056","1759140","0.7927664"
"83.381516","9.861091","1759157","0.8103617"
"83.67156","10.031109","1759173","0.7927664"
"83.9716","10.211128","1759190","0.7937439"
"84.26164","10.4411545","1759207","0.7947214"
"84.55168","10.67118","1759223","0.7947214"
"84.991745","11.001216","1759240","0.797654"
"85.27178","11.221241","1759257","0.799609"
"85.56182","11.441265","1759273","0.8005865"
"85.87187","11.731297","1759290","0.8054741"
"86.35194","12.251353","1759307","0.81427175"
"86.631966","12.58139","1759323","0.81427175"
"86.92201","12.901426","1759340","0.8191593"
"87.20205","13.201459","1759357","0.8230694"
"87.47209","13.471489","1759373","0.8250244"
"87.89215","13.911539","1759390","0.82600194"
"88.18219","14.231573","1759407","0.827957"
"88.46223","14.57161","1759423","0.8289345"
"88.752266","14.881645","1759440","0.829912"
"89.0423","15.161675","1759457","0.8289345"
"89.462364","15.561721","1759473","0.8308895"
"89.712395","15.841752","1759490","0.83186704"
"89.94243","16.131783","1759507","0.83186704"
"90.17246","16.441816","1759523","0.829912"
"90.522514","16.971876","1759540","0.83284456"
"90.80254","17.361917","1759557","0.83186704"
"91.09259","17.74196","1759573","0.83284456"
"91.352615","18.092","1759590","0.8357771"
"91.59266","18.412037","1759607","0.8357771"
"91.98271","18.892088","1759623","0.83773214"
"92.24275","19.18212","1759640","0.84359723"
"92.47278","19.512157","1759657","0.85435"
"92.77282","19.862196","1759673","0.8572825"
"93.03285","20.202234","1759690","0.86021507"
"93.432915","20.732292","1759707","0.8611926"
"93.70295","21.012321","1759723","0.8621701"
"93.91298","21.26235","1759740","0.8631476"
"94.133","21.592386","1759757","0.8631476"
"94.42304","22.172451","1759773","0.86510265"
"94.603065","22.542492","1759790","0.8514174"
"94.773094","22.89253","1759807","0.829912"
"94.993126","23.122555","1759823","0.8230694"
"95.23316","23.372583","1759840","0.8445748"
"95.34317","23.69262","1759857","0.84652984"
"95.45319","24.012653","1759873","0.8484849"
"95.58321","24.312689","1759890","0.8504399"
"95.72323","24.642725","1759907","0.8504399"
"95.97327","25.052767","1759923","0.85239494"
"96.19329","25.092773","1759940","0.8484849"
"96.31331","25.122778","1759957","0.8455523"
"96.36332","25.352802","1759973","0.84652984"
"96.503334","25.522821","1759990","0.84652984"
"96.62335","25.652834","1760007","0.8455523"
"96.73336","25.75285","1760023","0.83186704"
"96.933395","25.622833","1760040","0.78299123"
"97.15343","25.382805","1760057","0.63147604"
"97.57349","25.182783","1760073","0.1827957"
"97.75351","25.172781","1760080","9.775171E-4"
"97.75351","25.172781","1760089","9.775171E-4"
