64,185.2564153
65,182.9148287
66,180.5859524
67,178.2756073
68,175.9895682
69,173.7335489
70,171.5131883
71,169.3340361
72,167.2015392
73,165.1210275
74,163.0977014
75,161.136618
76,159.2426791
77,157.4206186
78,155.6749905
79,154.0101582
80,152.4302827
81,150.939313
82,149.5409758
83,148.238766
84,147.0359387
85,145.9355002
86,144.940201
87,144.0525289
88,143.2747025
89,142.6086662
90,142.0560845
91,141.6183387
92,141.2965228
93,141.0914414
94,141.0036069
95,141.0332389
96,141.1802634
97,141.4443128
98,141.8247272
99,142.3205557
100,142.9305591
101,143.6532126
102,144.4867099
103,145.4289679
104,146.4776312
105,147.6300788
106,148.8834302
107,150.2345527
108,151.6800691
109,153.2163664
110,154.8396047
111,156.5457267
112,158.330468
113,160.1893677
114,162.1177795
115,164.1108834
116,166.1636976
117,168.2710912
118,170.4277968
119,172.6284237
120,174.8674716
121,177.1393439
122,179.4383623
123,181.7587803
124,184.0947981
125,186.4405768
126,188.7902533
127,191.1379546
128,193.4778126
129,195.803979
130,198.1106394
131,200.3920286
132,202.6424441
133,204.8562611
134,207.0279463
135,209.1520715
136,211.2233275
137,213.2365373
138,215.1866689
139,217.068848
140,218.8783701
141,220.6107124
142,222.2615449
143,223.8267413
144,225.3023896
145,226.6848013
146,227.9705212
147,229.1563355
148,230.2392805
149,231.2166493
150,232.0859989
151,232.8451565
152,233.4922246
153,234.0255858
154,234.443907
155,234.7461426
156,234.9315372
157,234.9996274
158,234.9502431
159,234.7835075
160,234.4998376
161,234.0999423
162,233.5848211
163,232.9557616
164,232.2143362
165,231.3623979
166,230.4020762
167,229.3357714
168,228.1661487
169,226.8961315
170,225.5288943
171,224.0678544
172,222.5166636
173,220.8791991
174,219.1595538
175,217.3620258
176,215.4911081
177,213.5514769
178,211.5479803
179,209.485626
180,207.3695688
181,205.2050978
182,202.997623
183,200.752662
184,198.475826
185,196.1728058
186,193.8493579
187,191.5112896
188,189.164445
189,186.8146898
190,184.4678973
191,182.1299333
192,179.8066413
193,177.5038284
194,175.2272506
195,172.9825979
196,170.7754809
197,168.6114163
198,166.495813
199,164.433959
200,162.4310078
201,160.4919658
202,158.6216795
203,156.8248237
204,155.1058897
205,153.4691738
206,151.9187669
207,150.4585444
208,149.092156
209,147.8230169
210,146.6542993
211,145.5889244
212,144.6295552
213,143.7785895
214,143.0381542
215,142.4101002
216,141.8959972
217,141.4971302
218,141.2144961
219,141.0488014
220,141.0004603
221,141.0695935
222,141.2560284
223,141.5592988
224,141.9786467
225,142.5130241
226,143.1610953
227,143.9212403
228,144.7915593
229,145.7698769
230,146.8537478
231,148.0404629
232,149.327056
233,150.7103114
234,152.1867716
235,153.7527461
236,155.404321
237,157.1373681
238,158.9475557
239,160.8303593
240,162.7810729
241,164.7948206
242,166.8665692
243,168.9911403
244,171.1632237
245,173.3773903
246,175.6281058
247,177.9097446
248,180.2166038
249,182.5429174
250,184.8828708
251,187.2306155
252,189.5802832
253,191.9260011
254,194.2619059
255,196.5821593
256,198.8809618
257,201.1525675
258,203.3912986
259,205.5915596
260,207.7478507
261,209.8547826
262,211.9070888
263,213.8996398
264,215.8274552
265,217.6857164
266,219.4697788
267,221.1751832
268,222.7976668
269,224.3331744
270,225.777868
271,227.1281367
272,228.3806053
273,229.5321435
274,230.5798729
275,231.5211748
276,232.3536965
277,233.075357
278,233.6843526
279,234.1791611
280,234.5585457
281,234.8215583
282,234.9675413
283,234.9961299
284,234.9072527
285,234.7011318
286,234.3782823
287,233.9395113
288,233.3859155
289,232.7188785
290,231.9400676
291,231.0514294
292,230.0551851
293,228.9538247
294,227.7501011
295,226.4470229
296,225.0478472
297,223.5560711
298,221.9754234
299,220.3098549
300,218.5635285
301,216.7408092
302,214.8462529
303,212.8845949
304,210.8607384
305,208.7797419
306,206.6468069
307,204.4672646
308,202.2465628
309,199.9902519
310,197.7039717
311,195.3934365
312,193.0644217
313,190.7227484
314,188.3742696
315,186.0248554
316,183.680378
317,181.3466975
318,179.0296467
319,176.7350171
320,174.4685441
321,172.2358927
322,170.0426434
323,167.8942781
324,165.7961666
325,163.7535532
326,161.7715432
327,159.8550908
328,158.0089859
329,156.237843
330,154.5460889
331,152.9379522
332,151.4174523
333,149.9883898
334,148.6543364
335,147.4186268
336,146.2843494
337,145.2543395
338,144.3311714
339,143.5171527
340,142.8143179
341,142.2244238
342,141.7489448
343,141.3890693
344,141.1456969
345,141.0194358
346,141.0106017
347,141.1192167
348,141.3450091
349,141.6874148
350,142.1455777
351,142.7183529
352,143.4043086
353,144.2017303
354,145.1086249
355,146.1227255
356,147.2414976
357,148.4621446
358,149.7816158
359,151.1966129
360,152.7035994
361,154.2988085
362,155.978253
363,157.7377352
364,159.5728573
365,161.4790325
366,163.4514963
367,165.4853185
368,167.5754158
369,169.7165638
370,171.9034109
371,174.1304911
372,176.3922379
373,178.682998
374,180.9970458
375,183.3285973
376,185.6718249
377,188.0208717
378,190.3698663
379,192.7129375
380,195.0442289
381,197.3579133
382,199.6482078
383,201.9093878
384,204.1358017
385,206.3218844
386,208.4621719
387,210.5513147
388,212.584091
389,214.5554198
390,216.4603739
391,218.2941919
392,220.0522901
393,221.7302744
394,223.3239505
395,224.8293352
396,226.2426657
397,227.5604094
398,228.7792727
399,229.8962091
400,230.9084268
401,231.8133957
402,232.608854
403,233.2928134
404,233.8635643
405,234.3196802
406,234.6600211
407,234.8837362
408,234.9902663
409,234.9793453
410,234.8510003
411,234.6055523
412,234.2436146
413,233.766092
414,233.1741781
415,232.4693521
416,231.653376
417,230.7282892
418,229.6964038
419,228.5602992
420,227.322815
421,225.9870442
422,224.5563256
423,223.0342352
424,221.4245775
425,219.7313757
426,217.958862
427,216.1114668
428,214.1938075
429,212.2106774
430,210.1670331
431,208.0679829
432,205.9187731
433,203.7247757
434,201.4914746
435,199.2244518
436,196.9293738
437,194.6119769
438,192.2780536
439,189.9334373
440,187.5839885
441,185.2355794
442,182.89408
443,180.5653427
444,178.2551882
445,175.9693907
446,173.7136634
447,171.4936445
448,169.3148829
449,167.1828244
450,165.1027979
451,163.0800026
452,161.1194942
453,159.2261731
454,157.4047716
455,155.6598423
456,153.9957465
457,152.4166436
458,150.9264806
459,149.528982
460,148.227641
461,147.0257102
462,145.9261937
463,144.9318399
464,144.045134
465,143.2682924
466,142.6032568
467,142.0516893
468,141.6149688
469,141.2941866
470,141.0901447
471,141.003353
472,141.0340284
473,141.1820943
474,141.4471805
475,141.8286246
476,142.3254731
477,142.936484
478,143.6601304
479,144.4946033
480,145.437817
481,146.487414
482,147.6407709
483,148.8950048
484,150.2469808
485,151.6933198
486,153.2304065
487,154.8543991
488,156.5612384
489,158.3466583
490,160.2061961
491,162.1352039
492,164.1288603
493,166.182182
494,168.2900369
495,170.4471565
496,172.6481491
497,174.8875133
498,177.1596518
499,179.4588856
500,181.7794677
501,184.115598
502,186.4614372
503,188.811122
504,191.1587794
505,193.4985415
506,195.8245602
507,198.1310215
508,200.4121605
509,202.6622756
510,204.8757426
511,207.0470291
512,209.1707079
513,211.241471
514,213.2541425
515,215.2036918
516,217.085246
517,218.8941023
518,220.6257394
519,222.2758292
520,223.8402472
521,225.3150832
522,226.696651
523,227.9814974
524,229.1664108
525,230.2484296
526,231.2248493
527,232.0932294
528,232.8513994
529,233.4974643
530,234.0298092
531,234.4471036
532,234.7483044
533,234.9326587
534,234.9997059
535,234.9492783
536,234.7815019
537,234.4967962
538,234.0958726
539,233.5797334
540,232.9496686
541,232.2072531
542,231.3543424
543,230.3930684
544,229.3258339
545,228.1553063
546,226.8844113
547,225.5163256
548,224.0544686
549,222.5024942
550,220.8642815
551,219.1439252
552,217.3457254
553,215.4741765
554,213.5339565
555,211.5299148
556,209.4670607
557,207.3505501
558,205.1856732
559,202.977841
560,200.7325721
561,198.4554783
562,196.1522513
563,193.8286479
564,191.4904759
565,189.1435796
566,186.7938249
567,184.447085
568,182.1092256
569,179.78609
570,177.4834849
571,175.2071656
572,172.9628218
573,170.7560631
574,168.5924052
575,166.4772562
576,164.4159029
577,162.4134975
578,160.475045
579,158.6053906
580,156.8092074
581,155.090985
582,153.455018
583,151.9053954
584,150.4459905
585,149.0804511
586,147.8121903
587,146.6443781
588,145.5799334
589,144.6215168
590,143.7715238
591,143.032079
592,142.4050305
593,141.8919457
594,141.4941071
595,141.2125089
596,141.0478552
597,141.0005573
598,141.0707336
599,141.2582085
600,141.5625137
601,141.9828883
602,142.5182818
603,143.1673559
604,143.9284882
605,144.7997764
606,145.7790426
607,146.8638392
608,148.0514548
609,149.338921
610,150.7230197
611,152.2002915
612,153.7670439
613,155.4193609
614,157.1531125
615,158.9639652
616,160.8473929
617,162.798688
618,164.8129732
619,166.885214
620,169.0102307
621,171.1827119
622,173.3972276
623,175.6482426
624,177.9301306
625,180.237188
626,182.5636484
627,184.9036969
628,187.2514845
629,189.6011429
630,191.9467994
631,194.2825909
632,196.6026793
633,198.9012654
634,201.172604
635,203.4110179
636,205.6109124
637,207.7667887
638,209.8732584
639,211.9250563
640,213.917054
641,215.8442726
642,217.701895
643,219.4852781
644,221.1899645
645,222.8116932
646,224.3464108
647,225.7902813
648,227.1396958
649,228.3912814
650,229.5419099
651,230.5887052
652,231.529051
653,232.3605968
654,233.0812641
655,233.6892519
656,234.1830402
657,234.5613951
658,234.8233707
659,234.9683122
660,234.9958574
661,234.9059375
662,234.6987771
663,234.3748941
664,233.9350981
665,233.3804882
666,232.7124507
667,231.9326554
668,231.0430513
669,230.0458621
670,228.94358
671,227.7389603
672,226.435014
673,225.0350001
674,223.542418
675,221.9609983
676,220.2946939
677,218.5476695
678,216.7242919
679,214.8291185
680,212.8668862
681,210.8424998
682,208.7610189
683,206.6276463
684,204.4477143
685,202.2266716
686,199.9700696
687,197.6835487
688,195.372824
689,193.043671
690,190.7019115
691,188.3533986
692,186.0040024
693,183.6595951
694,181.3260366
695,179.0091595
696,176.7147549
697,174.4485575
698,172.2162316
699,170.023357
700,167.8754145
701,165.7777731
702,163.7356757
703,161.7542264
704,159.8383779
705,157.9929188
706,156.2224617
707,154.531432
708,152.9240562
709,151.4043521
710,149.976118
711,148.6429238
712,147.4081018
713,146.2747384
714,145.2456664
715,144.323458
716,143.5104182
717,142.8085792
718,142.2196952
719,141.7452381
720,141.3863939
721,141.1440594
722,141.0188403
723,141.0110497
724,141.1207069
725,141.347538
726,141.690976
727,142.1501623
728,142.7239494
729,143.4109031
730,144.2093063
731,145.1171634
732,146.1322052
733,147.2518948
734,148.4734334
735,149.7937678
736,151.2095979
737,152.7173848
738,154.3133599
739,155.9935341
740,157.7537077
741,159.5894814
742,161.4962665
743,163.4692972
744,165.5036418
745,167.5942157
746,169.7357933
747,171.923022
748,174.1504347
749,176.4124642
750,178.7034564
751,181.0176852
752,183.3493661
753,185.6926712
754,188.0417434
755,190.3907112
756,192.7337036
757,195.0648641
758,197.3783661
759,199.6684272
760,201.9293232
761,204.1554032
762,206.3411031
763,208.4809597
764,210.5696247
765,212.6018773
766,214.5726381
767,216.4769811
768,218.3101464
769,220.0675522
770,221.7448059
771,223.337715
772,224.8422983
773,226.2547951
774,227.5716747
775,228.7896458
776,229.905664
777,230.9169399
778,231.8209458
779,232.6154221
780,233.2983832
781,233.8681218
782,234.323214
783,234.6625224
784,234.8851987
785,234.9906864
786,234.9787219
787,234.8493351
788,234.6028493
789,234.2398807
790,233.7613364
791,233.1684127
792,232.4625914
793,231.6456368
794,230.7195908
795,229.6867681
796,228.5497503
797,227.3113791
798,225.97475
799,224.5432037
800,223.0203185
801,221.4099008
802,219.7159757
803,217.9427771
804,216.0947372
805,214.1764751
806,212.1927855
807,210.1486265
808,208.0491074
809,205.8994761
810,203.7051053
811,201.47148
812,199.204183
813,196.9088813
814,194.5913121
815,192.2572681
816,189.9125831
817,187.5631176
818,185.2147442
819,182.8733324
820,180.5447346
821,178.2347711
822,175.9492155
823,173.6937807
824,171.4741039
825,169.2957333
826,167.1641137
827,165.0845728
828,163.0623086
829,161.1023757
830,159.2096728
831,157.3889307
832,155.6447004
833,153.9813415
834,152.4030115
835,150.9136554
836,149.5169959
837,148.2165238
838,147.0154897
839,145.9168956
840,144.9234872
841,144.0377478
842,143.2618911
843,142.5978563
844,142.0473033
845,141.611608
846,141.2918596
847,141.0888572
848,141.0031083
849,141.0348271
850,141.1839344
851,141.4500574
852,141.8325311
853,142.3303994
854,142.9424179
855,143.6670569
856,144.5025052
857,145.4466745
858,146.497205
859,147.6514709
860,148.9065871
861,150.2594165
862,151.7065776
863,153.2444535
864,154.8692
865,156.5767564
866,158.3628545
867,160.22303
868,162.1526334
869,164.1468419
870,166.2006707
871,168.3089866
872,170.4665198
873,172.6678775
874,174.9075575
875,177.1799618
876,179.4794106
877,181.8001564
878,184.1363986
879,186.4822978
880,188.8319905
881,191.1796036
882,193.5192694
883,195.8451398
884,198.1514015
885,200.43229
886,202.6821042
887,204.8952208
888,207.0661082
889,209.1893402
890,211.2596099
891,213.2717427
892,215.2207093
893,217.1016383
894,218.9098284
895,220.64076
896,222.2901067
897,223.8537459
898,225.3277695
899,226.7084931
900,227.9924657
901,229.1764778
902,230.2575703
903,231.2330408
904,232.1004512
905,232.8576335
906,233.5026951
907,234.0340236
908,234.450291
909,234.7504569
910,234.933771
911,234.9997751
912,234.9483043
913,234.7794871
914,234.4937456
915,234.0917939
916,233.5746368
917,232.9435668
918,232.2001613
919,231.3462784
920,230.3840523
921,229.3158883
922,228.144456
923,226.8726835
924,225.5037495
925,224.0410757
926,222.4883179
927,220.8493574
928,219.1282905
929,217.3294191
930,215.4572395
931,213.516431
932,211.5118448
933,209.4484912
934,207.3315275
935,205.1662451
936,202.958056
937,200.7124796
938,198.4351286
939,196.1316952
940,193.8079368
941,191.4696615
942,189.122714
943,186.7729602
944,184.4262734
945,182.0885191
946,179.7655403
947,177.4631435
948,175.1870832
949,172.9430486
950,170.7366486
951,168.5733979
952,166.4587036
953,164.3978514
954,162.3959922
955,160.4581297
956,158.5891075
957,156.7935973
958,155.0760868
959,153.4408689
960,151.8920309
961,150.433444
962,149.0687539
963,147.8013717
964,146.6344651
965,145.5709508
966,144.613487
967,143.7644669
968,143.0260126
969,142.3999698
970,141.8879034
971,141.4910932
972,141.210531
973,141.0469182
974,141.0006636
975,141.0718828
976,141.260398
977,141.5657377
978,141.987139
979,142.5235484
980,143.1736253
981,143.9357448
982,144.808002
983,145.7882166
984,146.8739388
985,148.0624547
986,149.3507936
987,150.7357354
988,152.2138185
989,153.7813484
990,155.4344072
991,157.1688629
992,158.9803804
993,160.8644319
994,162.8163081
995,164.8311305
996,166.9038629
997,169.0293248
998,171.2022034
999,173.4170678
1000,175.6683819
1001,177.9505186
1002,180.2577738
1003,182.5843806
1004,184.9245235
1005,187.2723536
1006,189.6220024
1007,191.967597
1008,194.3032747
1009,196.6231975
1010,198.9215668
1011,201.1926379
1012,203.4307342
1013,205.6302618
1014,207.7857228
1015,209.8917299
1016,211.943019
1017,213.9344631
1018,215.8610845
1019,217.7180677
1020,219.5007713
1021,221.2047393
1022,222.8257127
1023,224.35964
1024,225.8026871
1025,227.1512472
1026,228.4019496
1027,229.5516682
1028,230.5975292
1029,231.5369185
1030,232.3674883
1031,233.0871624
1032,233.6941421
1033,234.1869103
1034,234.5642352
1035,234.8251738
1036,234.9690739
1037,234.9955757
1038,234.904613
1039,234.6964133
1040,234.3714968
1041,233.9306758
1042,233.3750519
1043,232.7060141
1044,231.9252345
1045,231.0346648
1046,230.0365307
1047,228.9333272
1048,227.7278118
1049,226.4229975
1050,225.0221457
1051,223.5287578
1052,221.9465665
1053,220.2795265
1054,218.5318045
1055,216.7077689
1056,214.8119788
1057,212.8491727
1058,210.8242566
1059,208.7422918
1060,206.6084821
1061,204.4281608
1062,202.2067777
1063,199.949885
1064,197.6631239
1065,195.35221
1066,193.0229193
1067,190.681074
1068,188.3325274
1069,185.9831497
1070,183.638813
1071,181.3053771
1072,178.9886742
1073,176.6944949
1074,174.4285735
1075,172.1965736
1076,170.0040741
1077,167.8565549
1078,165.7593839
1079,163.7178029
1080,161.7369147
1081,159.8216705
1082,157.9768575
1083,156.2070867
1084,154.5167817
1085,152.9101672
1086,151.3912591
1087,149.9638537
1088,148.6315189
1089,147.3975848
1090,146.2651356
1091,145.2370018
1092,144.3157533
1093,143.5036926
1094,142.8028495
1095,142.2149757
1096,141.7415407
1097,141.3837277
1098,141.1424311
1099,141.018254
1100,141.0115069
1101,141.1222064
1102,141.3500761
1103,141.6945463
1104,142.154756
1105,142.7295549
1106,143.4175064
1107,144.2168909
1108,145.1257103
1109,146.1416932
1110,147.2623
1111,148.4847299
1112,149.8059273
1113,151.2225901
1114,152.7311772
1115,154.327918
1116,156.0088214
1117,157.7696862
1118,159.606111
1119,161.5135057
1120,163.4871029
1121,165.5219696
1122,167.6130196
1123,169.7550264
1124,171.9426362
1125,174.170381
1126,176.4326927
1127,178.7239167
1128,181.038326
1129,183.3701358
1130,185.7135179
1131,188.062615
1132,190.4115557
1133,192.7544686
1134,195.0854979
1135,197.3988172
1136,199.6886443
1137,201.9492558
1138,204.1750015
1139,206.3603181
1140,208.4997435
1141,210.5879302
1142,212.6196588
1143,214.5898511
1144,216.4935827
1145,218.3260951
1146,220.082808
1147,221.7593307
1148,223.3514726
1149,224.8552542
1150,226.2669169
1151,227.5829322
1152,228.8000109
1153,229.9151107
1154,230.9254446
1155,231.8284872
1156,232.6219815
1157,233.303944
1158,233.8726702
1159,234.3267387
1160,234.6650145
1161,234.886652
1162,234.9910973
1163,234.9780893
1164,234.8476606
1165,234.6001371
1166,234.2361376
1167,233.7565718
1168,233.1626384
1169,232.4558219
1170,231.637889
1171,230.7108841
1172,229.6771242
1173,228.5391933
1174,227.2999354
1175,225.9624482
1176,224.5300747
1177,223.006395
1178,221.3952175
1179,219.7005694
1180,217.9266863
1181,216.0780022
1182,214.1591376
1183,212.1748888
1184,210.1302154
1185,208.030228
1186,205.8801755
1187,203.6854318
1188,201.4514827
1189,199.1839119
1190,196.8883872
1191,194.5706461
1192,192.2364818
1193,189.8917285
1194,187.5422469
1195,185.1939094
1196,182.8525857
1197,180.5241279
1198,178.2143558
1199,175.9290428
1200,173.6739008
1201,171.4545667
1202,169.2765875
1203,167.1454071
1204,165.0663523
1205,163.0446197
1206,161.0852625
1207,159.1931782
1208,157.3730959
1209,155.6295649
1210,153.9669432
1211,152.3893864
1212,150.9008375
1213,149.5050173
1214,148.2054144
1215,147.0052773
1216,145.9076057