--                  XXX Can be used as template XXX                          --
-------------------------------------------------------------------------------
-- Company:       (...)
-- Engineer:      (...)
--
-- Create Date:   (...)
-- Design Name:   (...)
-- Module Name:   (...)
-- Project Name:  (...)
-- Target Device: (...)
-- Tool versions: (...)
-- Description:   (...)
--
-- Denotes used in all code (only first/last prefix/suffix):
--  - c_   - constants
--  - g_   - generates
--  - i_   - input signals
--  - o_   - output signals
--  - p_   - processes
--  - v_   - variables
--  - io_  - inout signals
--  - lX_  - loops
--  - _i   - internal signals
--  - _iX  - instances
--  - _m   - memories
--  - _p   - packages
--  - _q   - registers
--  - _sr  - shift registers
--  - _t   - types
--  - _dut - Device Under Test
--  - _uut - Unit Under Test
--
-- Dependencies:
--  - Files:
--    (...)
--  - Modules:
--    (...)
--
-- Revision:
--  - Revision 0.01 - File created
--    - Files:
--      (...)
--    - Modules:
--      (...)
--    - Processes (Architecture: (...)):
--      (...)
--
-- Imporant Subtypes/Types/Signals/Variables/Constants:
-- (...)
--
-- Information from the software vendor:
--  - Messeges:
--    (...)
--  - Bugs:
--    (...)
--  - Notices:
--    (...)
--  - Infos:
--    (...)
--  - Notes:
--    (...)
--  - Criticals/Failures:
--    (...)
--
-- Concepts/Milestones:
-- (...)
--
-- Additional Comments:
-- (...)
--
-------------------------------------------------------------------------------
-- - VHDL Test Bench Created by ISE for module: (...) -
--
-- This testbench has been automatically generated using types std_logic and
-- std_logic_vector for the ports of the unit under test. Xilinx recommends
-- that these types always be used for the top-level I/O of a design in order
-- to guarantee that the testbench will bind correctly to the
-- post-implementation simulation model.
-------------------------------------------------------------------------------

