{
  "extends": ["tslint:recommended", "tslint-react", "tslint-config-prettier"],
  "linterOptions": {
    "exclude": [
      "config/**/*.js",
      "node_modules/**/*.ts",
      "coverage/lcov-report/*.js",
      "src/server/**",
      "src/__tests__/**/*.js"
    ]
  },
  "rules": {
    "ordered-imports": false,
    "import-sources-order": "any",
    "named-imports-order": "any", 
    "interface-name" : false, 
    "no-console": [true, "warning"],
    "no-angle-bracket-type-assertion": false,
    "jsx-no-lambda": false
  }
}
