// Jest Snapshot v1, https://goo.gl/fbAQLP

exports[`SignIn should wrap component in store 1`] = `
Array [
  <Context.Provider
    value={null}
  >
    <SignIn
      setUser={[Function]}
      signIn={[Function]}
      store={
        Object {
          "clearActions": [Function],
          "dispatch": [Function],
          "getActions": [Function],
          "getState": [Function],
          "replaceReducer": [Function],
          "subscribe": [Function],
        }
      }
      user="test"
    />
  </Context.Provider>,
]
`;
