<svg width="80" height="80" viewBox="0 0 80 80" fill="none" xmlns="http://www.w3.org/2000/svg">
<path d="M57.9001 41.3003L40.0001 55.7003L22.1334 40.7669C21.7964 40.4868 21.4074 40.2758 20.9888 40.1459C20.5702 40.0161 20.1301 39.97 19.6937 40.0102C19.2572 40.0504 18.833 40.1762 18.4452 40.3804C18.0574 40.5846 17.7136 40.8632 17.4334 41.2003C17.1533 41.5373 16.9423 41.9263 16.8124 42.3449C16.6826 42.7635 16.6365 43.2036 16.6767 43.64C16.7169 44.0764 16.8427 44.5007 17.0469 44.8885C17.2511 45.2763 17.5297 45.6201 17.8668 45.9003L37.8668 62.5669C38.4632 63.0572 39.2113 63.3252 39.9834 63.3252C40.7555 63.3252 41.5037 63.0572 42.1001 62.5669L62.1001 46.4669C62.4425 46.1918 62.7272 45.8518 62.9378 45.4664C63.1484 45.0809 63.2807 44.6576 63.3271 44.2209C63.3736 43.7841 63.3333 43.3425 63.2085 42.9213C63.0838 42.5002 62.877 42.1079 62.6001 41.7669C62.3226 41.427 61.9808 41.1451 61.5941 40.9376C61.2075 40.73 60.7837 40.6009 60.347 40.5575C59.9103 40.5142 59.4694 40.5575 59.0495 40.6849C58.6296 40.8124 58.239 41.0215 57.9001 41.3003Z" fill="#067018"/>
<path d="M37.8668 39.233C38.4632 39.7232 39.2114 39.9912 39.9834 39.9912C40.7555 39.9912 41.5037 39.7232 42.1001 39.233L62.1001 23.1329C62.4425 22.8579 62.7272 22.5178 62.9378 22.1324C63.1484 21.7469 63.2807 21.3237 63.3272 20.8869C63.3736 20.4501 63.3333 20.0085 63.2085 19.5874C63.0838 19.1662 62.877 18.7739 62.6001 18.433C62.325 18.0905 61.985 17.8058 61.5995 17.5953C61.2141 17.3847 60.7908 17.2524 60.354 17.2059C59.9173 17.1594 59.4757 17.1997 59.0545 17.3245C58.6334 17.4493 58.2411 17.6561 57.9001 17.933L40.0001 32.3663L22.1334 17.433C21.4527 16.8672 20.5751 16.5949 19.6937 16.6762C18.8123 16.7575 17.9992 17.1856 17.4334 17.8663C16.8676 18.547 16.5954 19.4246 16.6767 20.306C16.758 21.1874 17.186 22.0005 17.8668 22.5663L37.8668 39.233Z" fill="#067018"/>
</svg>
