<svg width="152" height="130" viewBox="0 0 152 130" fill="none" xmlns="http://www.w3.org/2000/svg">
<path fill-rule="evenodd" clip-rule="evenodd" d="M80.2559 60.8405L93.0039 68.9367L101.78 49.2617L80.2559 60.8405Z" fill="#F9A846"/>
<path fill-rule="evenodd" clip-rule="evenodd" d="M115.093 67.4253L100.172 69.7702L100.947 50.4512L115.093 67.4253Z" fill="#F06022"/>
<path fill-rule="evenodd" clip-rule="evenodd" d="M87.4893 67.4253L102.417 69.7702L101.642 50.4512L87.4893 67.4253Z" fill="#F9D15C"/>
<path fill-rule="evenodd" clip-rule="evenodd" d="M91.7838 70.2261L79.8047 72.1072L80.4275 56.6074L91.7838 70.2261Z" fill="#F48120"/>
<path fill-rule="evenodd" clip-rule="evenodd" d="M55.5674 101.234L59.8951 93.8555L82.989 102.441L55.5674 101.234Z" fill="#F48120"/>
<path fill-rule="evenodd" clip-rule="evenodd" d="M74.6581 83.3555L59.8955 93.8538L82.9894 102.439L74.6581 83.3555Z" fill="#F9D15C"/>
<path fill-rule="evenodd" clip-rule="evenodd" d="M68.8687 77.6934L59.8955 93.854L74.6581 83.3556L68.8687 77.6934Z" fill="#F48120"/>
<path fill-rule="evenodd" clip-rule="evenodd" d="M80.2562 60.8398L80.3833 64.9769L80.7392 76.3015L68.8682 77.6932L80.2562 60.8398Z" fill="#F9D15C"/>
<path fill-rule="evenodd" clip-rule="evenodd" d="M82.9895 102.441L89.6686 80.3702L83.625 74.7715L74.6582 83.357L82.9895 102.441Z" fill="#FFF100"/>
<path fill-rule="evenodd" clip-rule="evenodd" d="M68.8682 77.6929L86.9352 52.6289L76.5004 58.4818L68.8682 77.6929Z" fill="#FDEF4C"/>
<path fill-rule="evenodd" clip-rule="evenodd" d="M94.3775 47.9902L85.8491 48.6257L76.501 58.4823L86.7261 52.9217L94.3775 47.9902Z" fill="#F9D15C"/>
<path fill-rule="evenodd" clip-rule="evenodd" d="M100.739 53.0742L96.3473 52.9344L86.9355 52.6293L94.3772 47.9902L100.739 53.0742Z" fill="#F9D15C"/>
<path fill-rule="evenodd" clip-rule="evenodd" d="M81.127 60.687L96.3471 52.9339L86.9354 52.6289L81.127 60.687Z" fill="#F06022"/>
<path fill-rule="evenodd" clip-rule="evenodd" d="M110.647 84.6978L116.372 71.4668L105.048 71.9752L110.647 84.6978Z" fill="#F48120"/>
<path fill-rule="evenodd" clip-rule="evenodd" d="M116.372 71.4668L117.516 97.8653L111.199 83.4205L116.372 71.4668Z" fill="#FDEF4C"/>
<path fill-rule="evenodd" clip-rule="evenodd" d="M116.372 71.4668L117.516 97.8653L126.184 83.5793L116.372 71.4668Z" fill="#F9D15C"/>
<path fill-rule="evenodd" clip-rule="evenodd" d="M111.199 83.4199L117.516 97.8647L111.581 102.103L111.199 83.4199Z" fill="#F48120"/>
<path fill-rule="evenodd" clip-rule="evenodd" d="M105.048 71.9742L110.278 71.8789L112.489 101.36L105.048 71.9742Z" fill="#FAE700"/>
<path fill-rule="evenodd" clip-rule="evenodd" d="M117.141 71.5807L104.882 72.1145L110.671 67.6406L117.141 71.5807Z" fill="#F06022"/>
<path fill-rule="evenodd" clip-rule="evenodd" d="M68.8682 77.6945L80.7646 75.8516L80.6375 78.4635L74.6575 83.3568L68.8682 77.6945Z" fill="#F06022"/>
<path fill-rule="evenodd" clip-rule="evenodd" d="M103.775 67.6466C103.928 67.5958 105.085 67.583 106.432 67.5894C108.484 67.5958 110.963 67.6466 110.963 67.6466L105.046 71.9743L103.775 67.6466Z" fill="#FDEF4C"/>
<path fill-rule="evenodd" clip-rule="evenodd" d="M99.722 78.5273L80.5744 83.5477L80.3838 64.9785L99.722 78.5273Z" fill="#F9A846"/>
<path fill-rule="evenodd" clip-rule="evenodd" d="M105.511 67.2663L96.894 78.0697L80.3838 64.9785L105.511 67.2663Z" fill="#FDEF4C"/>
<path fill-rule="evenodd" clip-rule="evenodd" d="M105.511 67.2656L112.489 101.36L91.8164 82.0218L105.511 67.2656Z" fill="#F48120"/>
<path fill-rule="evenodd" clip-rule="evenodd" d="M87.9717 90.0859L103.344 98.4364L101.565 125.407L87.9717 90.0859Z" fill="#F9D15C"/>
<path fill-rule="evenodd" clip-rule="evenodd" d="M82.9893 102.44L101.565 125.406L87.6665 86.9844L82.9893 102.44Z" fill="#F48120"/>
<path fill-rule="evenodd" clip-rule="evenodd" d="M109.069 121.594L101.563 125.407L103.47 92.7109L109.069 121.594Z" fill="#FFF100"/>
<path fill-rule="evenodd" clip-rule="evenodd" d="M94.2568 79.957C94.2568 80.4019 95.6994 98.3737 95.6994 98.3737L112.495 101.361L94.2568 79.957Z" fill="#F9D15C"/>
<path fill-rule="evenodd" clip-rule="evenodd" d="M112.489 101.359C112.489 101.359 94.4855 98.0478 95.6929 98.3719C96.9003 98.6897 105.492 107.085 105.492 107.085L112.489 101.359Z" fill="#F06022"/>
<path fill-rule="evenodd" clip-rule="evenodd" d="M121.652 67.8376L110.454 67.6406L122.192 74.5485L121.652 67.8376Z" fill="#FFF100"/>
<path fill-rule="evenodd" clip-rule="evenodd" d="M113.601 64.877L120.172 67.8129L105.574 67.5905L113.601 64.877Z" fill="#F9A846"/>
<path fill-rule="evenodd" clip-rule="evenodd" d="M100.637 53.0742L105.575 67.5889L114.478 65.0152L100.637 53.0742Z" fill="#FDEF4C"/>
<path fill-rule="evenodd" clip-rule="evenodd" d="M121.653 67.8371L119.124 65.2379L113.557 65.1426L120.172 67.8117L121.653 67.8371Z" fill="#F06022"/>
<path fill-rule="evenodd" clip-rule="evenodd" d="M127.996 48.1875L113.373 65.1362L124.564 65.4921L127.996 48.1875Z" fill="#FFF100"/>
<path fill-rule="evenodd" clip-rule="evenodd" d="M124.367 44.4199L127.996 48.1884L113.373 65.1371L124.367 44.4199Z" fill="#F48120"/>
<path fill-rule="evenodd" clip-rule="evenodd" d="M100.656 53.0882L126.216 40.9375L113.373 65.1372L100.656 53.0882Z" fill="#F9A846"/>
<path fill-rule="evenodd" clip-rule="evenodd" d="M120.744 35.084L117.782 44.9532L126.215 40.9369L120.744 35.084Z" fill="#FDEF4C"/>
<path fill-rule="evenodd" clip-rule="evenodd" d="M116.384 31.2715L100.649 53.1135L117.782 44.9537L116.384 31.2715Z" fill="#F48120"/>
<path fill-rule="evenodd" clip-rule="evenodd" d="M111.199 22.4883C111.072 24.7761 111.58 39.9199 111.58 39.9199L116.378 31.2708L111.199 22.4883Z" fill="#FDEF4C"/>
<path fill-rule="evenodd" clip-rule="evenodd" d="M106.242 24.9043L100.637 53.0758L113.111 37.9701L106.242 24.9043Z" fill="#F9A846"/>
<path fill-rule="evenodd" clip-rule="evenodd" d="M99.1758 19.6914L104.368 41.5207L106.242 24.9025L99.1758 19.6914Z" fill="#FDEF4C"/>
<path fill-rule="evenodd" clip-rule="evenodd" d="M93.3223 48.6709L104.367 41.4707L100.637 53.0749L93.3223 48.6709Z" fill="#F06022"/>
<path fill-rule="evenodd" clip-rule="evenodd" d="M85.3724 50.1016L74.0479 42.4629L93.0809 48.087L85.3724 50.1016Z" fill="#F9A846"/>
<path fill-rule="evenodd" clip-rule="evenodd" d="M62.4688 32.2871L74.0475 42.4614L90.6911 41.9848L62.4688 32.2871Z" fill="#F06022"/>
<path fill-rule="evenodd" clip-rule="evenodd" d="M70.3616 29.1035L77.9367 37.6763L62.4688 32.2873L70.3616 29.1035Z" fill="#FDEF4C"/>
<path fill-rule="evenodd" clip-rule="evenodd" d="M88.0481 30.5016L77.9374 37.6763L70.3623 29.1035L88.0481 30.5016Z" fill="#F48120"/>
<path fill-rule="evenodd" clip-rule="evenodd" d="M89.2874 42.0298L77.9375 37.6767L88.0482 30.502L89.2874 42.0298Z" fill="#F9D15C"/>
<path fill-rule="evenodd" clip-rule="evenodd" d="M102.104 31.3345L89.2416 41.6168L88.0469 30.502L102.104 31.3345Z" fill="#F9A846"/>
<path fill-rule="evenodd" clip-rule="evenodd" d="M81.1074 16L102.149 31.3345L88.047 30.502L81.1074 16Z" fill="#FDEF4C"/>
<path fill-rule="evenodd" clip-rule="evenodd" d="M70.8707 22.4883L88.0481 30.5019L70.3623 29.1038L70.8707 22.4883Z" fill="#FDEF4C"/>
<path fill-rule="evenodd" clip-rule="evenodd" d="M88.4922 42.0485L102.079 31.2832L104.367 41.4702L88.4922 42.0485Z" fill="#F48120"/>
<path fill-rule="evenodd" clip-rule="evenodd" d="M74.0479 42.354L104.367 41.4707L93.4432 48.5883L74.0479 42.354Z" fill="#FFF100"/>
<path fill-rule="evenodd" clip-rule="evenodd" d="M95.6927 98.3737L80.5742 83.5476L94.2565 79.957L95.6927 98.3737Z" fill="#F06022"/>
<path fill-rule="evenodd" clip-rule="evenodd" d="M13.3758 118.182C12.429 118.182 11.5265 118.023 10.6623 117.712C9.798 117.394 9.04176 116.924 8.39355 116.295L8.98457 115.494C9.64548 116.091 10.3318 116.536 11.0372 116.816C11.7426 117.102 12.5243 117.242 13.3758 117.242C14.4435 117.242 15.3077 117.019 15.9623 116.568C16.6169 116.117 16.941 115.494 16.941 114.693C16.941 114.318 16.8584 113.994 16.6931 113.74C16.5279 113.479 16.2801 113.257 15.9496 113.079C15.6191 112.901 15.2124 112.736 14.7231 112.596C14.2338 112.456 13.6682 112.304 13.02 112.145C12.3273 111.986 11.7236 111.827 11.2152 111.675C10.7004 111.516 10.281 111.331 9.95052 111.109C9.62006 110.887 9.37222 110.62 9.20699 110.308C9.04176 109.991 8.95915 109.59 8.95915 109.101C8.95915 108.484 9.07989 107.951 9.31502 107.493C9.55016 107.036 9.88061 106.661 10.2937 106.362C10.7131 106.063 11.1897 105.841 11.7363 105.688C12.2764 105.536 12.8611 105.466 13.4712 105.466C14.4308 105.466 15.2823 105.625 16.0195 105.949C16.7567 106.273 17.335 106.686 17.7417 107.188L17.0808 107.824C16.6741 107.353 16.1402 106.997 15.4857 106.762C14.8311 106.527 14.1384 106.406 13.3949 106.406C12.9373 106.406 12.5116 106.451 12.1048 106.546C11.7045 106.642 11.355 106.788 11.0563 106.997C10.7576 107.201 10.5225 107.468 10.3509 107.785C10.1793 108.11 10.0903 108.491 10.0903 108.929C10.0903 109.292 10.1475 109.584 10.2683 109.8C10.389 110.022 10.5733 110.207 10.8339 110.366C11.0944 110.524 11.4312 110.658 11.8379 110.779C12.2447 110.899 12.734 111.026 13.2996 111.166C14.0685 111.357 14.7549 111.535 15.3522 111.706C15.9496 111.878 16.4516 112.094 16.852 112.342C17.2524 112.596 17.5574 112.895 17.7735 113.238C17.9832 113.588 18.0912 114.026 18.0912 114.56C18.0912 115.659 17.6591 116.543 16.8012 117.191C15.956 117.858 14.8057 118.182 13.3758 118.182ZM77.8215 118.182C76.9572 118.182 76.1501 118.011 75.4129 117.674C74.6758 117.337 74.0339 116.873 73.4874 116.282C72.9472 115.691 72.5214 115.011 72.21 114.242C71.905 113.473 71.7525 112.647 71.7525 111.764C71.7525 110.899 71.905 110.086 72.21 109.317C72.5151 108.554 72.9409 107.887 73.4747 107.309C74.0085 106.737 74.644 106.279 75.3748 105.949C76.1056 105.618 76.9 105.453 77.7452 105.453C78.6095 105.453 79.4166 105.625 80.1537 105.962C80.8909 106.298 81.5328 106.756 82.0666 107.334C82.6004 107.906 83.0198 108.58 83.3185 109.342C83.6172 110.105 83.7697 110.912 83.7697 111.764C83.7697 111.84 83.7697 111.942 83.7697 112.056C83.7697 112.177 83.7634 112.247 83.7443 112.278H72.979C73.0235 112.984 73.1887 113.645 73.4747 114.248C73.7607 114.852 74.1165 115.38 74.5487 115.818C74.9808 116.257 75.4828 116.606 76.0484 116.86C76.614 117.115 77.2241 117.235 77.866 117.235C78.2917 117.235 78.7112 117.178 79.1179 117.057C79.5246 116.937 79.9059 116.778 80.2618 116.574C80.6176 116.371 80.929 116.123 81.2087 115.831C81.4819 115.538 81.698 115.221 81.8569 114.878L82.8927 115.164C82.7211 115.602 82.4606 116.009 82.1238 116.377C81.787 116.746 81.393 117.064 80.9417 117.331C80.4905 117.597 80.0012 117.807 79.4674 117.953C78.9336 118.112 78.3871 118.182 77.8215 118.182ZM82.6385 111.338C82.594 110.613 82.4288 109.952 82.1555 109.355C81.8823 108.758 81.5264 108.243 81.0943 107.811C80.6621 107.379 80.1601 107.042 79.5945 106.794C79.0289 106.553 78.4188 106.425 77.777 106.425C77.1288 106.425 76.5251 106.546 75.9595 106.794C75.3939 107.036 74.8918 107.379 74.4597 107.811C74.0276 108.243 73.678 108.764 73.4238 109.368C73.1633 109.972 73.0108 110.632 72.9663 111.338H82.6385ZM65.137 118.182C64.1901 118.182 63.2877 118.023 62.4234 117.712C61.5591 117.394 60.8029 116.924 60.1547 116.295L60.7457 115.494C61.4066 116.091 62.0929 116.536 62.7984 116.816C63.5037 117.102 64.2854 117.242 65.137 117.242C66.2046 117.242 67.0689 117.019 67.7234 116.568C68.378 116.117 68.7021 115.494 68.7021 114.693C68.7021 114.318 68.6195 113.994 68.4543 113.74C68.289 113.479 68.0412 113.257 67.7107 113.079C67.3803 112.901 66.9736 112.736 66.4842 112.596C65.9949 112.456 65.4293 112.304 64.7811 112.145C64.0884 111.986 63.4847 111.827 62.9763 111.675C62.4615 111.516 62.0421 111.331 61.7117 111.109C61.3812 110.887 61.1334 110.62 60.9681 110.308C60.8029 109.991 60.7203 109.59 60.7203 109.101C60.7203 108.484 60.841 107.951 61.0762 107.493C61.3113 107.036 61.6417 106.661 62.0548 106.362C62.4742 106.063 62.9509 105.841 63.4974 105.688C64.0376 105.536 64.6222 105.466 65.2323 105.466C66.1919 105.466 67.0435 105.625 67.7806 105.949C68.5178 106.273 69.0961 106.686 69.5028 107.188L68.8419 107.824C68.4352 107.353 67.9014 106.997 67.2468 106.762C66.5923 106.527 65.8996 106.406 65.156 106.406C64.6985 106.406 64.2727 106.451 63.866 106.546C63.4656 106.642 63.1161 106.788 62.8174 106.997C62.5187 107.201 62.2836 107.468 62.112 107.785C61.9404 108.11 61.8515 108.491 61.8515 108.929C61.8515 109.292 61.9087 109.584 62.0294 109.8C62.1501 110.022 62.3344 110.207 62.595 110.366C62.8555 110.524 63.1924 110.658 63.5991 110.779C64.0058 110.899 64.4951 111.026 65.0607 111.166C65.8297 111.357 66.516 111.535 67.1134 111.706C67.7107 111.878 68.2128 112.094 68.6131 112.342C69.0135 112.596 69.3185 112.895 69.5346 113.238C69.7443 113.588 69.8524 114.026 69.8524 114.56C69.8524 115.659 69.4202 116.543 68.5623 117.191C67.7171 117.858 66.5732 118.182 65.137 118.182ZM56.7103 117.947V105.523H57.9177V117.947H56.7103ZM54.1111 106.73C53.0117 106.762 52.0458 107.086 51.2196 107.709C50.3935 108.332 49.8152 109.184 49.4847 110.27V117.947H48.3027V105.669H49.4339V108.694C49.8597 107.83 50.4189 107.124 51.1243 106.578C51.8233 106.038 52.5796 105.726 53.3803 105.644C53.5392 105.631 53.679 105.618 53.8061 105.618C53.9332 105.618 54.0349 105.618 54.1111 105.618V106.73ZM44.7376 117.947H43.5555V111.096C43.5555 109.508 43.3331 108.351 42.8819 107.627C42.4307 106.902 41.719 106.54 40.7466 106.54C40.2255 106.54 39.7108 106.635 39.2024 106.826C38.6876 107.016 38.2174 107.283 37.7725 107.627C37.334 107.97 36.9464 108.376 36.6159 108.84C36.2855 109.304 36.044 109.806 35.8851 110.34V117.941H34.7031V105.669H35.8152V108.599C36.0694 108.129 36.3808 107.696 36.7494 107.309C37.118 106.921 37.5374 106.591 38.0013 106.317C38.4652 106.044 38.9545 105.828 39.4757 105.682C39.9968 105.529 40.5306 105.459 41.0835 105.459C42.4244 105.459 43.3649 105.93 43.9178 106.864C44.4706 107.798 44.7439 109.145 44.7439 110.893V117.947H44.7376ZM24.6368 118.182C22.0249 118.182 20.7158 116.371 20.7158 112.749V105.669H21.8978V112.59C21.8978 115.615 22.9273 117.121 24.9927 117.121C25.5138 117.121 26.0159 117.032 26.5052 116.848C26.9945 116.67 27.4521 116.415 27.8779 116.091C28.3036 115.767 28.6786 115.38 29.0027 114.922C29.3268 114.464 29.581 113.962 29.7716 113.41V105.669H30.9537V116.295C30.9537 116.689 31.1189 116.886 31.4493 116.886V117.947C31.3731 117.96 31.2968 117.972 31.2396 117.972C31.1824 117.972 31.1316 117.972 31.0998 117.972C30.7821 117.972 30.5025 117.877 30.261 117.68C30.0195 117.483 29.8924 117.223 29.8924 116.892V115.049C29.3586 116.041 28.6214 116.809 27.6872 117.362C26.734 117.909 25.7235 118.182 24.6368 118.182Z" fill="#F06022"/>
<path d="M9.90648 124.13V123.749H10.4212V124.13C10.4212 124.442 10.3196 124.683 10.1226 124.855C9.91919 125.026 9.62051 125.109 9.22015 125.109C8.81979 125.109 8.51475 125.026 8.31139 124.855C8.10803 124.683 8 124.442 8 124.13V121.334C8 121.023 8.10168 120.781 8.29868 120.61C8.50204 120.438 8.80072 120.355 9.20108 120.355C9.60145 120.355 9.90648 120.438 10.1098 120.61C10.3132 120.781 10.4212 121.023 10.4212 121.334V121.995H9.90648V121.334C9.90648 120.959 9.67135 120.775 9.20744 120.775C8.74353 120.775 8.5084 120.959 8.5084 121.334V124.13C8.5084 124.505 8.74353 124.69 9.20744 124.69C9.67135 124.69 9.90648 124.499 9.90648 124.13Z" fill="#636C77"/>
<path d="M14.6845 121.334V124.13C14.6845 124.442 14.5828 124.683 14.3731 124.855C14.1634 125.026 13.852 125.109 13.4389 125.109C13.0259 125.109 12.7145 125.026 12.4984 124.855C12.2887 124.683 12.1807 124.442 12.1807 124.13V121.334C12.1807 121.023 12.2823 120.781 12.4921 120.61C12.7018 120.438 13.0132 120.355 13.4262 120.355C13.8393 120.355 14.1507 120.438 14.3668 120.61C14.5765 120.781 14.6845 121.023 14.6845 121.334ZM14.1698 124.13V121.334C14.1698 120.959 13.9219 120.775 13.4326 120.775C12.9433 120.775 12.6954 120.959 12.6954 121.334V124.13C12.6954 124.505 12.9433 124.69 13.4326 124.69C13.9219 124.69 14.1698 124.499 14.1698 124.13Z" fill="#636C77"/>
<path d="M17.1505 125.001H16.6357V120.458H16.8582L17.0425 120.902C17.1441 120.737 17.2776 120.604 17.4492 120.502C17.6144 120.4 17.7987 120.35 17.9957 120.35C18.4914 120.35 18.8091 120.521 18.9426 120.858C19.1777 120.521 19.4891 120.35 19.8704 120.35C20.5631 120.35 20.9063 120.674 20.9063 121.328V124.995H20.3852V121.328C20.3852 120.953 20.2072 120.769 19.8577 120.769C19.6543 120.769 19.4637 120.845 19.2858 121.004C19.1142 121.163 19.0252 121.316 19.0252 121.468V124.995H18.5105V121.328C18.5105 120.953 18.3325 120.769 17.983 120.769C17.7796 120.769 17.589 120.845 17.411 120.998C17.2395 121.15 17.1505 121.296 17.1505 121.449V125.001Z" fill="#636C77"/>
<path d="M23.3985 125.001H22.8838V120.458H23.1062L23.2905 120.902C23.3922 120.737 23.5256 120.604 23.6972 120.502C23.8625 120.4 24.0467 120.35 24.2438 120.35C24.7394 120.35 25.0572 120.521 25.1906 120.858C25.4258 120.521 25.7372 120.35 26.1185 120.35C26.8112 120.35 27.1543 120.674 27.1543 121.328V124.995H26.6396V121.328C26.6396 120.953 26.4616 120.769 26.1121 120.769C25.9088 120.769 25.7181 120.845 25.5402 121.004C25.3686 121.163 25.2796 121.316 25.2796 121.468V124.995H24.7649V121.328C24.7649 120.953 24.5869 120.769 24.2374 120.769C24.034 120.769 23.8434 120.845 23.6654 120.998C23.4939 121.15 23.4049 121.296 23.4049 121.449V125.001H23.3985Z" fill="#636C77"/>
<path d="M29.0605 124.132V120.465H29.5753V124.132C29.5753 124.31 29.6134 124.443 29.696 124.545C29.7787 124.64 29.9248 124.691 30.1409 124.691C30.357 124.691 30.554 124.615 30.7383 124.456C30.9225 124.297 31.0115 124.144 31.0115 123.992V120.465H31.5263V125.009H31.3038L31.1132 124.564C31.0052 124.729 30.8654 124.863 30.7001 124.964C30.5285 125.066 30.3442 125.117 30.1472 125.117C29.4228 125.11 29.0605 124.78 29.0605 124.132Z" fill="#636C77"/>
<path d="M34.0997 125.001H33.585V120.458H33.8074L33.9917 120.909C34.2268 120.534 34.5509 120.35 34.9703 120.35C35.6885 120.35 36.0507 120.674 36.0507 121.328V124.995H35.5359V121.328C35.5359 121.15 35.4978 121.017 35.4152 120.915C35.3326 120.82 35.1864 120.769 34.9703 120.769C34.7543 120.769 34.5573 120.845 34.373 121.004C34.1887 121.163 34.0997 121.316 34.0997 121.468V125.001Z" fill="#636C77"/>
<path d="M38.548 125.001H38.0332V120.457H38.548V125.001Z" fill="#636C77"/>
<path d="M40.4985 120.457H42.1191V120.876H41.0133V124.225C41.0133 124.359 41.0514 124.467 41.1213 124.556C41.1912 124.645 41.2929 124.689 41.42 124.689C41.5471 124.689 41.6488 124.645 41.7187 124.562C41.7886 124.473 41.8204 124.365 41.8204 124.232V123.399H42.3351V124.2C42.3351 124.492 42.2525 124.721 42.0873 124.874C41.922 125.033 41.6996 125.109 41.42 125.109C41.1404 125.109 40.918 125.033 40.7464 124.874C40.5748 124.715 40.4922 124.492 40.4922 124.2V120.457H40.4985Z" fill="#636C77"/>
<path d="M45.2156 125.001H44.7009V123.717C44.0336 123.647 43.7031 123.323 43.7031 122.751V120.457H44.2179V122.751C44.2179 123.126 44.4657 123.31 44.9551 123.31C45.4444 123.31 45.6923 123.126 45.6923 122.751V120.457H46.207V122.751C46.207 123.323 45.8766 123.647 45.222 123.717V125.001H45.2156Z" fill="#636C77"/>
<path d="M54.3596 124.13V123.749H54.8744V124.13C54.8744 124.442 54.7727 124.683 54.5757 124.855C54.3723 125.026 54.0737 125.109 53.6733 125.109C53.2729 125.109 52.9679 125.026 52.7645 124.855C52.5612 124.683 52.4531 124.442 52.4531 124.13V121.334C52.4531 121.023 52.5548 120.781 52.7518 120.61C52.9552 120.438 53.2539 120.355 53.6542 120.355C54.0546 120.355 54.3596 120.438 54.563 120.61C54.7664 120.781 54.8744 121.023 54.8744 121.334V121.995H54.3596V121.334C54.3596 120.959 54.1245 120.775 53.6606 120.775C53.1967 120.775 52.9615 120.959 52.9615 121.334V124.13C52.9615 124.505 53.1967 124.69 53.6606 124.69C54.1309 124.69 54.3596 124.499 54.3596 124.13Z" fill="#636C77"/>
<path d="M56.6401 120.457H58.2606V120.876H57.1549V124.225C57.1549 124.359 57.193 124.467 57.2629 124.556C57.3328 124.645 57.4345 124.689 57.5616 124.689C57.6887 124.689 57.7904 124.645 57.8603 124.562C57.9302 124.473 57.962 124.365 57.962 124.232V123.399H58.4767V124.2C58.4767 124.492 58.3941 124.721 58.2289 124.874C58.0636 125.033 57.8412 125.109 57.5616 125.109C57.282 125.109 57.0596 125.033 56.888 124.874C56.7164 124.715 56.6338 124.492 56.6338 124.2V120.457H56.6401Z" fill="#636C77"/>
<path d="M60.6124 125.001H60.0977V120.457H60.6124V125.001Z" fill="#636C77"/>
<path d="M64.0832 125.001H63.3079L62.2275 120.457H62.7423L63.6892 124.461L64.6424 120.457H65.1572L64.0832 125.001Z" fill="#636C77"/>
<path d="M69.058 125H68.8356L68.6449 124.556C68.5432 124.721 68.4098 124.854 68.2382 124.956C68.073 125.058 67.8887 125.108 67.6853 125.108C66.9799 125.108 66.624 124.784 66.624 124.13V123.431C66.624 122.776 66.9799 122.452 67.6853 122.452H68.5369V121.308C68.5369 121.143 68.4797 121.01 68.3653 120.914C68.2509 120.819 68.0857 120.774 67.8632 120.774C67.4247 120.774 67.2087 120.952 67.2087 121.308V121.721H66.6939V121.34C66.6939 121.029 66.7893 120.787 66.9863 120.616C67.1769 120.444 67.4756 120.361 67.8632 120.361C68.2573 120.361 68.5496 120.444 68.7466 120.616C68.9436 120.787 69.0453 121.029 69.0453 121.34V125H69.058ZM68.5432 122.872H67.6917C67.4883 122.872 67.3421 122.922 67.2659 123.018C67.1896 123.113 67.1451 123.253 67.1451 123.431V124.13C67.1451 124.308 67.1833 124.441 67.2659 124.543C67.3421 124.638 67.4883 124.689 67.6917 124.689C67.895 124.689 68.0857 124.613 68.2636 124.46C68.4415 124.308 68.5305 124.162 68.5432 124.009V122.872Z" fill="#636C77"/>
<path d="M70.939 120.457H72.5595V120.876H71.4537V124.225C71.4537 124.359 71.4918 124.467 71.5617 124.556C71.6317 124.645 71.7333 124.689 71.8604 124.689C71.9875 124.689 72.0892 124.645 72.1591 124.562C72.229 124.473 72.2608 124.365 72.2608 124.232V123.399H72.7755V124.2C72.7755 124.492 72.6929 124.721 72.5277 124.874C72.3625 125.033 72.14 125.109 71.8604 125.109C71.5808 125.109 71.3584 125.033 71.1868 124.874C71.0152 124.715 70.9326 124.492 70.9326 124.2V120.457H70.939Z" fill="#636C77"/>
<path d="M74.9043 125.001H74.3896V120.457H74.9043V125.001Z" fill="#636C77"/>
<path d="M79.3603 121.334V124.13C79.3603 124.442 79.2586 124.683 79.0489 124.855C78.8392 125.026 78.5278 125.109 78.1147 125.109C77.7016 125.109 77.3903 125.026 77.1742 124.855C76.9645 124.683 76.8564 124.442 76.8564 124.13V121.334C76.8564 121.023 76.9581 120.781 77.1678 120.61C77.3775 120.438 77.6889 120.355 78.102 120.355C78.5151 120.355 78.8265 120.438 79.0425 120.61C79.2522 120.781 79.3603 121.023 79.3603 121.334ZM78.8455 124.13V121.334C78.8455 120.959 78.5977 120.775 78.1084 120.775C77.619 120.775 77.3712 120.959 77.3712 121.334V124.13C77.3712 124.505 77.619 124.69 78.1084 124.69C78.5977 124.69 78.8455 124.499 78.8455 124.13Z" fill="#636C77"/>
<path d="M81.8194 125.001H81.3047V120.458H81.5271L81.7114 120.909C81.9465 120.534 82.2706 120.35 82.69 120.35C83.4081 120.35 83.7704 120.674 83.7704 121.328V124.995H83.2556V121.328C83.2556 121.15 83.2175 121.017 83.1349 120.915C83.0523 120.82 82.9061 120.769 82.69 120.769C82.474 120.769 82.277 120.845 82.0927 121.004C81.9084 121.163 81.8194 121.316 81.8194 121.468V125.001Z" fill="#636C77"/>
<path d="M50.7943 123.801V123.382H50.4257V120.465H49.9109L47.96 123.382V123.801H49.9109V124.583H47.96V125.002H50.7943V124.583H50.4257V123.801H50.7943ZM48.5319 123.382L49.9363 121.272L49.9046 123.382H48.5319Z" fill="url(#paint0_linear)"/>
<g style="mix-blend-mode:hue">
<rect x="8" width="135.99" height="130" fill="#C4C4C4"/>
</g>
<defs>
<linearGradient id="paint0_linear" x1="49.3766" y1="125.002" x2="49.3766" y2="120.46" gradientUnits="userSpaceOnUse">
<stop stop-color="#FDEF4C"/>
<stop offset="0.5279" stop-color="#F9A846"/>
<stop offset="1" stop-color="#F48120"/>
</linearGradient>
</defs>
</svg>
