[
  {
    "_id": {"$oid": "636b77ced3b2a34583e3186e"},
    "__v": 5,
    "bgColor": "bg-pink-600",
    "iconName": "house",
    "tasks": ["636b77d6d3b2a34583e31872", "636b77ddd3b2a34583e31879", "636b7a1574b39bbd0aa9fab3", "6370d6dfec60e083d201227b", "6370d7a8ec60e083d20122c1", "6372873c97056733e7825d43"],
    "title": "Home"
  },
  {
    "_id": {"$oid": "636b78f574b39bbd0aa9fa7f"},
    "__v": 15,
    "bgColor": "bg-indigo-300",
    "iconName": "building",
    "tasks": ["636b7edf1c8e1a319d2a088b", "636b8104c9d4bd4ad5bb4caf", "636b813de9b5265528defa80", "6370d716ec60e083d20122a1", "6370d729ec60e083d20122a7", "6370d753ec60e083d20122bb", "6370d82fec60e083d20122cf"],
    "title": "Work"
  },
  {
    "_id": {"$oid": "6370d88dec60e083d20122d4"},
    "__v": 0,
    "bgColor": "bg-yellow-500",
    "iconName": "graduation-cap",
    "tasks": [],
    "title": "Goals"
  },
  {
    "_id": {"$oid": "637134544c698dd2fee68a42"},
    "__v": 0,
    "bgColor": "bg-lime-600",
    "iconName": "book",
    "tasks": [],
    "title": "Test"
  }
]