[
  {
    "name": "I",
    "notch": "y",
    "turnover": "q",
    "wiring": "EKMFLGDQVZNTOWYHXUSPAIBRCJ"
  },
  {
    "name": "II",
    "wiring": "AJDKSIRUXBLHWTMCQGZNPYFVOE",
    "notch": "m",
    "turnover": "e"
  },
  {
    "name": "III",
    "wiring": "BDFHJLCPRTXVZNYEIWGAKMUSQO",
    "notch": "d",
    "turnover": "v"
  },
  {
    "name": "IV",
    "wiring": "ESOVPZJAYQUIRHXLNFTGKDCMWB",
    "notch": "r",
    "turnover": "j"
  },
  {
    "name": "V",
    "wiring": "VZBRGITYUPSDNHLXAWMJQOFECK",
    "notch": "h",
    "turnover": "z"
  },
  {
    "name": "VI",
    "wiring": "JPGVOUMFYQBENHZRDKASXLICTW",
    "notch": "hu",
    "turnover": "zm"
  },
  {
    "name": "VII",
    "wiring": "NZJHGRCXMYSWBOUFAIVLPEKQDT",
    "notch": "hu",
    "turnover": "zm"
  },  
  {
    "name": "VIII",
    "wiring": "FKQHTLXOCBJSPDZRAMEWNIUYGV",
    "notch": "hu",
    "turnover": "zm"
  }
]