{
  "models": [
    {
      "edges": [
        {
          "id": "4fc44fde-58fb-4b28-9079-dd3188000bc5",
          "name": "e_DatenInRaumFilterEintragen",
          "sourceVertexId": "41ce8d96-9ce1-43dd-8aa3-56e7482ac231",
          "targetVertexId": "8f8696d2-2e59-4377-8dc0-a9cf5d18b56c"
        },
        {
          "id": "aa3f2688-11d6-4a12-942a-6b1c9dcc2342",
          "name": "e_DatenInSemesterFilterEintragen",
          "sourceVertexId": "41ce8d96-9ce1-43dd-8aa3-56e7482ac231",
          "targetVertexId": "a64058d7-ef53-41ea-b67e-8add9f124d13"
        },
        {
          "id": "3f820bed-7a37-46a0-b762-b2378aa43027",
          "name": "e_DatenInModulFilterEintragen",
          "sourceVertexId": "41ce8d96-9ce1-43dd-8aa3-56e7482ac231",
          "targetVertexId": "ba97186b-b101-42b9-a69b-8ea5c51014cb"
        },
        {
          "id": "e9641717-801d-4fb0-91b3-a49d88cfda16",
          "name": "e_DatenInTeachingUnitFilterEintragen",
          "sourceVertexId": "41ce8d96-9ce1-43dd-8aa3-56e7482ac231",
          "targetVertexId": "47f29150-cc09-4faf-9e4a-5312fb50b614"
        },
        {
          "id": "c8f24560-1b97-4aa5-ba5a-a082de52c1b3",
          "name": "e_DatenInStudyProgrammFilterEintragen",
          "sourceVertexId": "41ce8d96-9ce1-43dd-8aa3-56e7482ac231",
          "targetVertexId": "8ec3a124-da74-484a-8b5f-dfec0893cc86"
        },
        {
          "id": "a4b850d8-14d7-4f04-9d93-757fb9fa12f2",
          "name": "e_DatenInLecturerFilterEintragen",
          "sourceVertexId": "41ce8d96-9ce1-43dd-8aa3-56e7482ac231",
          "targetVertexId": "1b2deb2c-4abb-4cc0-ae8e-4fa897c7d199"
        },
        {
          "id": "fee68095-c76c-453b-9201-e95d802120f3",
          "name": "e_AutomatischeFilterung",
          "sourceVertexId": "8f8696d2-2e59-4377-8dc0-a9cf5d18b56c",
          "targetVertexId": "10747efa-eb66-419f-a01e-abbea95fbc7c"
        },
        {
          "id": "16e91e9e-4061-4cc6-90df-1e11219bfbff",
          "name": "e_AutomatischeFilterung",
          "sourceVertexId": "a64058d7-ef53-41ea-b67e-8add9f124d13",
          "targetVertexId": "10747efa-eb66-419f-a01e-abbea95fbc7c"
        },
        {
          "id": "3c551ac5-a237-43c2-ac6e-b7436da52808",
          "name": "e_AutomatischeFilterung",
          "sourceVertexId": "ba97186b-b101-42b9-a69b-8ea5c51014cb",
          "targetVertexId": "10747efa-eb66-419f-a01e-abbea95fbc7c"
        },
        {
          "id": "32ecc3e7-a47b-4eb0-8bbb-c95ccd26b529",
          "name": "e_AutomatischeFilterung",
          "sourceVertexId": "47f29150-cc09-4faf-9e4a-5312fb50b614",
          "targetVertexId": "10747efa-eb66-419f-a01e-abbea95fbc7c"
        },
        {
          "id": "1c781a1f-d5ef-4d7b-a755-7c4d7a4e5f8c",
          "name": "e_AutomatischeFilterung",
          "sourceVertexId": "1b2deb2c-4abb-4cc0-ae8e-4fa897c7d199",
          "targetVertexId": "10747efa-eb66-419f-a01e-abbea95fbc7c"
        },
        {
          "id": "b44560c5-0b58-410a-b3ce-bdae6b922c52",
          "name": "e_AutomatischeFilterung",
          "sourceVertexId": "8ec3a124-da74-484a-8b5f-dfec0893cc86",
          "targetVertexId": "10747efa-eb66-419f-a01e-abbea95fbc7c"
        },
        {
          "id": "b7874c2e-92e3-4dc5-b098-11ba9aa85d4f",
          "name": "e_DatenInRaumFilterEintragen",
          "sourceVertexId": "10747efa-eb66-419f-a01e-abbea95fbc7c",
          "targetVertexId": "8f8696d2-2e59-4377-8dc0-a9cf5d18b56c"
        },
        {
          "id": "7bdae1d1-c283-4daf-b794-e55118505f46",
          "name": "e_DatenInSemesterFilterEintragen",
          "sourceVertexId": "10747efa-eb66-419f-a01e-abbea95fbc7c",
          "targetVertexId": "a64058d7-ef53-41ea-b67e-8add9f124d13"
        },
        {
          "id": "451272d1-b8fa-453f-ad38-e6d815ef138e",
          "name": "e_DatenInModulFilterEintragen",
          "sourceVertexId": "10747efa-eb66-419f-a01e-abbea95fbc7c",
          "targetVertexId": "ba97186b-b101-42b9-a69b-8ea5c51014cb"
        },
        {
          "id": "0d3f6f28-c465-410f-840c-13be3c93941e",
          "name": "e_DatenInTeachingUnitFilterEintragen",
          "sourceVertexId": "10747efa-eb66-419f-a01e-abbea95fbc7c",
          "targetVertexId": "47f29150-cc09-4faf-9e4a-5312fb50b614"
        },
        {
          "id": "e1b5fb9c-6d6b-4c01-9621-87a8c26ba37a",
          "name": "e_DatenInStudyProgrammFilterEintragen",
          "sourceVertexId": "10747efa-eb66-419f-a01e-abbea95fbc7c",
          "targetVertexId": "8ec3a124-da74-484a-8b5f-dfec0893cc86"
        },
        {
          "id": "5f10019e-4e68-4b48-88fd-c7ce3ad719e4",
          "name": "e_DatenInLecturerFilterEintragen",
          "sourceVertexId": "10747efa-eb66-419f-a01e-abbea95fbc7c",
          "targetVertexId": "1b2deb2c-4abb-4cc0-ae8e-4fa897c7d199"
        },
        {
          "id": "bfdddc99-6016-41a5-b429-fe4cfde16f11",
          "name": "e_Clear_Filter",
          "sourceVertexId": "41ce8d96-9ce1-43dd-8aa3-56e7482ac231",
          "targetVertexId": "41ce8d96-9ce1-43dd-8aa3-56e7482ac231"
        },
        {
          "id": "e62e6098-a681-4f47-9c00-a90b0c8182e0",
          "name": "e_Clear_Filter",
          "sourceVertexId": "10747efa-eb66-419f-a01e-abbea95fbc7c",
          "targetVertexId": "41ce8d96-9ce1-43dd-8aa3-56e7482ac231",
          "weight": "0.5"
        },
        {
          "id": "c322e5d4-362f-4674-bfe5-5b683a3a5e35",
          "name": "e_AufModulImKalenderKlicken",
          "sourceVertexId": "10747efa-eb66-419f-a01e-abbea95fbc7c",
          "targetVertexId": "6cc42098-078d-4845-899c-273cc229a3c5"
        },
        {
          "id": "d451ffc3-b53b-46f9-9bae-bf399cd64537",
          "name": "e_AufModulImKalenderKlicken",
          "sourceVertexId": "41ce8d96-9ce1-43dd-8aa3-56e7482ac231",
          "targetVertexId": "6cc42098-078d-4845-899c-273cc229a3c5"
        },
        {
          "id": "6aac0e12-4627-4017-98ad-a351134553bf",
          "name": "e_AufDetailsKlicken",
          "sourceVertexId": "6cc42098-078d-4845-899c-273cc229a3c5",
          "targetVertexId": "2aa7a9b3-6391-4646-accb-6d0977015a6c"
        },
        {
          "id": "fa9d4a56-61ba-4b99-a268-927a5f20d421",
          "name": "v_ZurueckNavigieren",
          "sourceVertexId": "2aa7a9b3-6391-4646-accb-6d0977015a6c",
          "targetVertexId": "10747efa-eb66-419f-a01e-abbea95fbc7c"
        }
      ],
      "generator": "random(edge_coverage(100))",
      "id": "4f9460da-7a3f-455b-a44e-4686bd465646",
      "name": "Startseite",
      "startElementId": "41ce8d96-9ce1-43dd-8aa3-56e7482ac231",
      "vertices": [
        {
          "id": "41ce8d96-9ce1-43dd-8aa3-56e7482ac231",
          "name": "v_UngefilterteAnsicht",
          "properties": {
            "x": 217,
            "y": 119
          }
        },
        {
          "id": "47f29150-cc09-4faf-9e4a-5312fb50b614",
          "name": "v_TeachingUnitFilterGefuellt",
          "properties": {
            "x": 360,
            "y": 459
          }
        },
        {
          "id": "8ec3a124-da74-484a-8b5f-dfec0893cc86",
          "name": "v_StudyProgrammFilterGefuellt",
          "properties": {
            "x": 626,
            "y": 460
          }
        },
        {
          "id": "1b2deb2c-4abb-4cc0-ae8e-4fa897c7d199",
          "name": "v_LecturerFilterGefuellt",
          "properties": {
            "x": 869,
            "y": 459
          }
        },
        {
          "id": "ba97186b-b101-42b9-a69b-8ea5c51014cb",
          "name": "v_ModuleFilterGefuellt",
          "properties": {
            "x": 115,
            "y": 455
          }
        },
        {
          "id": "6cc42098-078d-4845-899c-273cc229a3c5",
          "name": "v_ModulModalGeoeffnet",
          "properties": {
            "x": 1100.2195087055734,
            "y": 458.0529491228893
          }
        },
        {
          "id": "2aa7a9b3-6391-4646-accb-6d0977015a6c",
          "name": "v_WeitergeleitetAufModulinfos",
          "properties": {
            "x": 1108.8692371327968,
            "y": 626.7587287987657
          }
        },
        {
          "id": "a64058d7-ef53-41ea-b67e-8add9f124d13",
          "name": "v_SemesterFilterGefuellt",
          "properties": {
            "x": -74.95110498367342,
            "y": 455.25490084838236
          }
        },
        {
          "id": "8f8696d2-2e59-4377-8dc0-a9cf5d18b56c",
          "name": "v_RaumFilterGefuellt",
          "properties": {
            "x": -271.9511049836733,
            "y": 457.25490084838236
          }
        },
        {
          "id": "10747efa-eb66-419f-a01e-abbea95fbc7c",
          "name": "v_AnsichtGefiltert",
          "properties": {
            "x": 218.84135930592333,
            "y": 771.2549008483826
          }
        }
      ]
    }
  ],
  "selectedModelIndex": 0,
  "selectedElementId": null
}
