('C:\\Users\\komle\\PycharmProjects\\CityCourier\\dist\\main.exe',
 True,
 False,
 False,
 'c:\\users\\komle\\pycharmprojects\\citycourier\\venv\\lib\\site-packages\\PyInstaller\\bootloader\\images\\icon-console.ico',
 None,
 False,
 False,
 '<?xml version="1.0" encoding="UTF-8" standalone="yes"?><assembly xmlns="urn:schemas-microsoft-com:asm.v1" manifestVersion="1.0"><assemblyIdentity type="win32" name="main" processorArchitecture="amd64" version="1.0.0.0"/><trustInfo xmlns="urn:schemas-microsoft-com:asm.v3"><security><requestedPrivileges><requestedExecutionLevel level="asInvoker" uiAccess="false"/></requestedPrivileges></security></trustInfo><dependency><dependentAssembly><assemblyIdentity type="win32" name="Microsoft.Windows.Common-Controls" language="*" processorArchitecture="*" version="6.0.0.0" publicKeyToken="6595b64144ccf1df"/><compatibility xmlns="urn:schemas-microsoft-com:compatibility.v1"/></dependentAssembly></dependency><compatibility xmlns="urn:schemas-microsoft-com:compatibility.v1"><application><supportedOS Id="{e2011457-1546-43c5-a5fe-008deee3d3f0}"/><supportedOS Id="{35138b9a-5d96-4fbd-8e2d-a2440225f93a}"/><supportedOS Id="{4a2f28e3-53b9-4441-ba9c-d69d4a4a6e38}"/><supportedOS Id="{1f676c76-80e1-4239-95bb-83d0f6d0da78}"/><supportedOS Id="{8e0f7a12-bfb3-4fe8-b9a5-48fd50a15a9a}"/></application></compatibility><application xmlns="urn:schemas-microsoft-com:asm.v3"><windowsSettings><longPathAware xmlns="http://schemas.microsoft.com/SMI/2016/WindowsSettings">true</longPathAware></windowsSettings></application></assembly>',
 True,
 'main.pkg',
 [('PYZ-00.pyz',
   'C:\\Users\\komle\\PycharmProjects\\CityCourier\\build\\main\\PYZ-00.pyz',
   'PYZ'),
  ('struct',
   'C:\\Users\\komle\\AppData\\Local\\Programs\\Python\\Python39\\lib\\struct.pyo',
   'PYMODULE'),
  ('pyimod01_os_path',
   'c:\\users\\komle\\pycharmprojects\\citycourier\\venv\\lib\\site-packages\\PyInstaller\\loader\\pyimod01_os_path.pyc',
   'PYMODULE'),
  ('pyimod02_archive',
   'c:\\users\\komle\\pycharmprojects\\citycourier\\venv\\lib\\site-packages\\PyInstaller\\loader\\pyimod02_archive.pyc',
   'PYMODULE'),
  ('pyimod03_importers',
   'c:\\users\\komle\\pycharmprojects\\citycourier\\venv\\lib\\site-packages\\PyInstaller\\loader\\pyimod03_importers.pyc',
   'PYMODULE'),
  ('pyiboot01_bootstrap',
   'c:\\users\\komle\\pycharmprojects\\citycourier\\venv\\lib\\site-packages\\PyInstaller\\loader\\pyiboot01_bootstrap.py',
   'PYSOURCE'),
  ('pyi_rth_multiprocessing',
   'C:\\Users\\komle\\PycharmProjects\\CityCourier\\venv\\Lib\\site-packages\\PyInstaller\\hooks\\rthooks\\pyi_rth_multiprocessing.py',
   'PYSOURCE'),
  ('pyi_rth_pkgres',
   'C:\\Users\\komle\\PycharmProjects\\CityCourier\\venv\\Lib\\site-packages\\PyInstaller\\hooks\\rthooks\\pyi_rth_pkgres.py',
   'PYSOURCE'),
  ('main',
   'C:\\Users\\komle\\PycharmProjects\\CityCourier\\main.py',
   'PYSOURCE'),
  ('libfreetype-6.dll',
   'c:\\users\\komle\\pycharmprojects\\citycourier\\venv\\lib\\site-packages\\pygame\\libfreetype-6.dll',
   'BINARY'),
  ('SDL2_image.dll',
   'c:\\users\\komle\\pycharmprojects\\citycourier\\venv\\lib\\site-packages\\pygame\\SDL2_image.dll',
   'BINARY'),
  ('libjpeg-9.dll',
   'c:\\users\\komle\\pycharmprojects\\citycourier\\venv\\lib\\site-packages\\pygame\\libjpeg-9.dll',
   'BINARY'),
  ('libogg-0.dll',
   'c:\\users\\komle\\pycharmprojects\\citycourier\\venv\\lib\\site-packages\\pygame\\libogg-0.dll',
   'BINARY'),
  ('SDL2.dll',
   'c:\\users\\komle\\pycharmprojects\\citycourier\\venv\\lib\\site-packages\\pygame\\SDL2.dll',
   'BINARY'),
  ('libpng16-16.dll',
   'c:\\users\\komle\\pycharmprojects\\citycourier\\venv\\lib\\site-packages\\pygame\\libpng16-16.dll',
   'BINARY'),
  ('libwebp-7.dll',
   'c:\\users\\komle\\pycharmprojects\\citycourier\\venv\\lib\\site-packages\\pygame\\libwebp-7.dll',
   'BINARY'),
  ('portmidi.dll',
   'c:\\users\\komle\\pycharmprojects\\citycourier\\venv\\lib\\site-packages\\pygame\\portmidi.dll',
   'BINARY'),
  ('SDL2_ttf.dll',
   'c:\\users\\komle\\pycharmprojects\\citycourier\\venv\\lib\\site-packages\\pygame\\SDL2_ttf.dll',
   'BINARY'),
  ('libvorbisfile-3.dll',
   'c:\\users\\komle\\pycharmprojects\\citycourier\\venv\\lib\\site-packages\\pygame\\libvorbisfile-3.dll',
   'BINARY'),
  ('libFLAC-8.dll',
   'c:\\users\\komle\\pycharmprojects\\citycourier\\venv\\lib\\site-packages\\pygame\\libFLAC-8.dll',
   'BINARY'),
  ('SDL2_mixer.dll',
   'c:\\users\\komle\\pycharmprojects\\citycourier\\venv\\lib\\site-packages\\pygame\\SDL2_mixer.dll',
   'BINARY'),
  ('libopenblas.GK7GX5KEQ4F6UYO3P26ULGBQYHGQO7J4.gfortran-win_amd64.dll',
   'c:\\users\\komle\\pycharmprojects\\citycourier\\venv\\lib\\site-packages\\numpy\\.libs\\libopenblas.GK7GX5KEQ4F6UYO3P26ULGBQYHGQO7J4.gfortran-win_amd64.dll',
   'BINARY'),
  ('libopusfile-0.dll',
   'c:\\users\\komle\\pycharmprojects\\citycourier\\venv\\lib\\site-packages\\pygame\\libopusfile-0.dll',
   'BINARY'),
  ('libmodplug-1.dll',
   'c:\\users\\komle\\pycharmprojects\\citycourier\\venv\\lib\\site-packages\\pygame\\libmodplug-1.dll',
   'BINARY'),
  ('libtiff-5.dll',
   'c:\\users\\komle\\pycharmprojects\\citycourier\\venv\\lib\\site-packages\\pygame\\libtiff-5.dll',
   'BINARY'),
  ('zlib1.dll',
   'c:\\users\\komle\\pycharmprojects\\citycourier\\venv\\lib\\site-packages\\pygame\\zlib1.dll',
   'BINARY'),
  ('libopus-0.dll',
   'c:\\users\\komle\\pycharmprojects\\citycourier\\venv\\lib\\site-packages\\pygame\\libopus-0.dll',
   'BINARY'),
  ('libmpg123-0.dll',
   'c:\\users\\komle\\pycharmprojects\\citycourier\\venv\\lib\\site-packages\\pygame\\libmpg123-0.dll',
   'BINARY'),
  ('libvorbis-0.dll',
   'c:\\users\\komle\\pycharmprojects\\citycourier\\venv\\lib\\site-packages\\pygame\\libvorbis-0.dll',
   'BINARY'),
  ('unicodedata',
   'C:\\Users\\komle\\AppData\\Local\\Programs\\Python\\Python39\\DLLs\\unicodedata.pyd',
   'EXTENSION'),
  ('_ctypes',
   'C:\\Users\\komle\\AppData\\Local\\Programs\\Python\\Python39\\DLLs\\_ctypes.pyd',
   'EXTENSION'),
  ('_lzma',
   'C:\\Users\\komle\\AppData\\Local\\Programs\\Python\\Python39\\DLLs\\_lzma.pyd',
   'EXTENSION'),
  ('_bz2',
   'C:\\Users\\komle\\AppData\\Local\\Programs\\Python\\Python39\\DLLs\\_bz2.pyd',
   'EXTENSION'),
  ('select',
   'C:\\Users\\komle\\AppData\\Local\\Programs\\Python\\Python39\\DLLs\\select.pyd',
   'EXTENSION'),
  ('_socket',
   'C:\\Users\\komle\\AppData\\Local\\Programs\\Python\\Python39\\DLLs\\_socket.pyd',
   'EXTENSION'),
  ('_overlapped',
   'C:\\Users\\komle\\AppData\\Local\\Programs\\Python\\Python39\\DLLs\\_overlapped.pyd',
   'EXTENSION'),
  ('_ssl',
   'C:\\Users\\komle\\AppData\\Local\\Programs\\Python\\Python39\\DLLs\\_ssl.pyd',
   'EXTENSION'),
  ('_asyncio',
   'C:\\Users\\komle\\AppData\\Local\\Programs\\Python\\Python39\\DLLs\\_asyncio.pyd',
   'EXTENSION'),
  ('_queue',
   'C:\\Users\\komle\\AppData\\Local\\Programs\\Python\\Python39\\DLLs\\_queue.pyd',
   'EXTENSION'),
  ('_hashlib',
   'C:\\Users\\komle\\AppData\\Local\\Programs\\Python\\Python39\\DLLs\\_hashlib.pyd',
   'EXTENSION'),
  ('_multiprocessing',
   'C:\\Users\\komle\\AppData\\Local\\Programs\\Python\\Python39\\DLLs\\_multiprocessing.pyd',
   'EXTENSION'),
  ('pyexpat',
   'C:\\Users\\komle\\AppData\\Local\\Programs\\Python\\Python39\\DLLs\\pyexpat.pyd',
   'EXTENSION'),
  ('_decimal',
   'C:\\Users\\komle\\AppData\\Local\\Programs\\Python\\Python39\\DLLs\\_decimal.pyd',
   'EXTENSION'),
  ('_uuid',
   'C:\\Users\\komle\\AppData\\Local\\Programs\\Python\\Python39\\DLLs\\_uuid.pyd',
   'EXTENSION'),
  ('numpy.core._multiarray_umath',
   'c:\\users\\komle\\pycharmprojects\\citycourier\\venv\\lib\\site-packages\\numpy\\core\\_multiarray_umath.cp39-win_amd64.pyd',
   'EXTENSION'),
  ('numpy.core._multiarray_tests',
   'c:\\users\\komle\\pycharmprojects\\citycourier\\venv\\lib\\site-packages\\numpy\\core\\_multiarray_tests.cp39-win_amd64.pyd',
   'EXTENSION'),
  ('numpy.linalg.lapack_lite',
   'c:\\users\\komle\\pycharmprojects\\citycourier\\venv\\lib\\site-packages\\numpy\\linalg\\lapack_lite.cp39-win_amd64.pyd',
   'EXTENSION'),
  ('numpy.random.mtrand',
   'c:\\users\\komle\\pycharmprojects\\citycourier\\venv\\lib\\site-packages\\numpy\\random\\mtrand.cp39-win_amd64.pyd',
   'EXTENSION'),
  ('numpy.random._sfc64',
   'c:\\users\\komle\\pycharmprojects\\citycourier\\venv\\lib\\site-packages\\numpy\\random\\_sfc64.cp39-win_amd64.pyd',
   'EXTENSION'),
  ('numpy.random._philox',
   'c:\\users\\komle\\pycharmprojects\\citycourier\\venv\\lib\\site-packages\\numpy\\random\\_philox.cp39-win_amd64.pyd',
   'EXTENSION'),
  ('numpy.random._pcg64',
   'c:\\users\\komle\\pycharmprojects\\citycourier\\venv\\lib\\site-packages\\numpy\\random\\_pcg64.cp39-win_amd64.pyd',
   'EXTENSION'),
  ('numpy.random._mt19937',
   'c:\\users\\komle\\pycharmprojects\\citycourier\\venv\\lib\\site-packages\\numpy\\random\\_mt19937.cp39-win_amd64.pyd',
   'EXTENSION'),
  ('numpy.random.bit_generator',
   'c:\\users\\komle\\pycharmprojects\\citycourier\\venv\\lib\\site-packages\\numpy\\random\\bit_generator.cp39-win_amd64.pyd',
   'EXTENSION'),
  ('numpy.random._generator',
   'c:\\users\\komle\\pycharmprojects\\citycourier\\venv\\lib\\site-packages\\numpy\\random\\_generator.cp39-win_amd64.pyd',
   'EXTENSION'),
  ('numpy.random._bounded_integers',
   'c:\\users\\komle\\pycharmprojects\\citycourier\\venv\\lib\\site-packages\\numpy\\random\\_bounded_integers.cp39-win_amd64.pyd',
   'EXTENSION'),
  ('numpy.random._common',
   'c:\\users\\komle\\pycharmprojects\\citycourier\\venv\\lib\\site-packages\\numpy\\random\\_common.cp39-win_amd64.pyd',
   'EXTENSION'),
  ('numpy.fft._pocketfft_internal',
   'c:\\users\\komle\\pycharmprojects\\citycourier\\venv\\lib\\site-packages\\numpy\\fft\\_pocketfft_internal.cp39-win_amd64.pyd',
   'EXTENSION'),
  ('numpy.linalg._umath_linalg',
   'c:\\users\\komle\\pycharmprojects\\citycourier\\venv\\lib\\site-packages\\numpy\\linalg\\_umath_linalg.cp39-win_amd64.pyd',
   'EXTENSION'),
  ('pygame.imageext',
   'c:\\users\\komle\\pycharmprojects\\citycourier\\venv\\lib\\site-packages\\pygame\\imageext.cp39-win_amd64.pyd',
   'EXTENSION'),
  ('pygame.fastevent',
   'c:\\users\\komle\\pycharmprojects\\citycourier\\venv\\lib\\site-packages\\pygame\\fastevent.cp39-win_amd64.pyd',
   'EXTENSION'),
  ('pygame.scrap',
   'c:\\users\\komle\\pycharmprojects\\citycourier\\venv\\lib\\site-packages\\pygame\\scrap.cp39-win_amd64.pyd',
   'EXTENSION'),
  ('pygame.mixer',
   'c:\\users\\komle\\pycharmprojects\\citycourier\\venv\\lib\\site-packages\\pygame\\mixer.cp39-win_amd64.pyd',
   'EXTENSION'),
  ('pygame.mixer_music',
   'c:\\users\\komle\\pycharmprojects\\citycourier\\venv\\lib\\site-packages\\pygame\\mixer_music.cp39-win_amd64.pyd',
   'EXTENSION'),
  ('_elementtree',
   'C:\\Users\\komle\\AppData\\Local\\Programs\\Python\\Python39\\DLLs\\_elementtree.pyd',
   'EXTENSION'),
  ('pygame.font',
   'c:\\users\\komle\\pycharmprojects\\citycourier\\venv\\lib\\site-packages\\pygame\\font.cp39-win_amd64.pyd',
   'EXTENSION'),
  ('pygame._freetype',
   'c:\\users\\komle\\pycharmprojects\\citycourier\\venv\\lib\\site-packages\\pygame\\_freetype.cp39-win_amd64.pyd',
   'EXTENSION'),
  ('pygame.transform',
   'c:\\users\\komle\\pycharmprojects\\citycourier\\venv\\lib\\site-packages\\pygame\\transform.cp39-win_amd64.pyd',
   'EXTENSION'),
  ('pygame.time',
   'c:\\users\\komle\\pycharmprojects\\citycourier\\venv\\lib\\site-packages\\pygame\\time.cp39-win_amd64.pyd',
   'EXTENSION'),
  ('pygame.pixelarray',
   'c:\\users\\komle\\pycharmprojects\\citycourier\\venv\\lib\\site-packages\\pygame\\pixelarray.cp39-win_amd64.pyd',
   'EXTENSION'),
  ('pygame.mask',
   'c:\\users\\komle\\pycharmprojects\\citycourier\\venv\\lib\\site-packages\\pygame\\mask.cp39-win_amd64.pyd',
   'EXTENSION'),
  ('pygame.surface',
   'c:\\users\\komle\\pycharmprojects\\citycourier\\venv\\lib\\site-packages\\pygame\\surface.cp39-win_amd64.pyd',
   'EXTENSION'),
  ('pygame.pixelcopy',
   'c:\\users\\komle\\pycharmprojects\\citycourier\\venv\\lib\\site-packages\\pygame\\pixelcopy.cp39-win_amd64.pyd',
   'EXTENSION'),
  ('pygame.mouse',
   'c:\\users\\komle\\pycharmprojects\\citycourier\\venv\\lib\\site-packages\\pygame\\mouse.cp39-win_amd64.pyd',
   'EXTENSION'),
  ('pygame.key',
   'c:\\users\\komle\\pycharmprojects\\citycourier\\venv\\lib\\site-packages\\pygame\\key.cp39-win_amd64.pyd',
   'EXTENSION'),
  ('pygame.joystick',
   'c:\\users\\komle\\pycharmprojects\\citycourier\\venv\\lib\\site-packages\\pygame\\joystick.cp39-win_amd64.pyd',
   'EXTENSION'),
  ('pygame.image',
   'c:\\users\\komle\\pycharmprojects\\citycourier\\venv\\lib\\site-packages\\pygame\\image.cp39-win_amd64.pyd',
   'EXTENSION'),
  ('pygame.event',
   'c:\\users\\komle\\pycharmprojects\\citycourier\\venv\\lib\\site-packages\\pygame\\event.cp39-win_amd64.pyd',
   'EXTENSION'),
  ('pygame.draw',
   'c:\\users\\komle\\pycharmprojects\\citycourier\\venv\\lib\\site-packages\\pygame\\draw.cp39-win_amd64.pyd',
   'EXTENSION'),
  ('pygame.display',
   'c:\\users\\komle\\pycharmprojects\\citycourier\\venv\\lib\\site-packages\\pygame\\display.cp39-win_amd64.pyd',
   'EXTENSION'),
  ('pygame.math',
   'c:\\users\\komle\\pycharmprojects\\citycourier\\venv\\lib\\site-packages\\pygame\\math.cp39-win_amd64.pyd',
   'EXTENSION'),
  ('pygame.bufferproxy',
   'c:\\users\\komle\\pycharmprojects\\citycourier\\venv\\lib\\site-packages\\pygame\\bufferproxy.cp39-win_amd64.pyd',
   'EXTENSION'),
  ('pygame.color',
   'c:\\users\\komle\\pycharmprojects\\citycourier\\venv\\lib\\site-packages\\pygame\\color.cp39-win_amd64.pyd',
   'EXTENSION'),
  ('pygame.surflock',
   'c:\\users\\komle\\pycharmprojects\\citycourier\\venv\\lib\\site-packages\\pygame\\surflock.cp39-win_amd64.pyd',
   'EXTENSION'),
  ('pygame.rwobject',
   'c:\\users\\komle\\pycharmprojects\\citycourier\\venv\\lib\\site-packages\\pygame\\rwobject.cp39-win_amd64.pyd',
   'EXTENSION'),
  ('pygame.rect',
   'c:\\users\\komle\\pycharmprojects\\citycourier\\venv\\lib\\site-packages\\pygame\\rect.cp39-win_amd64.pyd',
   'EXTENSION'),
  ('pygame.constants',
   'c:\\users\\komle\\pycharmprojects\\citycourier\\venv\\lib\\site-packages\\pygame\\constants.cp39-win_amd64.pyd',
   'EXTENSION'),
  ('pygame.base',
   'c:\\users\\komle\\pycharmprojects\\citycourier\\venv\\lib\\site-packages\\pygame\\base.cp39-win_amd64.pyd',
   'EXTENSION'),
  ('VCRUNTIME140.dll',
   'C:\\Users\\komle\\AppData\\Local\\Programs\\Python\\Python39\\VCRUNTIME140.dll',
   'BINARY'),
  ('python39.dll',
   'C:\\Users\\komle\\AppData\\Local\\Programs\\Python\\Python39\\python39.dll',
   'BINARY'),
  ('libffi-7.dll',
   'C:\\Users\\komle\\AppData\\Local\\Programs\\Python\\Python39\\DLLs\\libffi-7.dll',
   'BINARY'),
  ('libssl-1_1.dll',
   'C:\\Users\\komle\\AppData\\Local\\Programs\\Python\\Python39\\DLLs\\libssl-1_1.dll',
   'BINARY'),
  ('libcrypto-1_1.dll',
   'C:\\Users\\komle\\AppData\\Local\\Programs\\Python\\Python39\\DLLs\\libcrypto-1_1.dll',
   'BINARY'),
  ('base_library.zip',
   'C:\\Users\\komle\\PycharmProjects\\CityCourier\\build\\main\\base_library.zip',
   'DATA'),
  ('pygame\\pygame_icon.bmp',
   'c:\\users\\komle\\pycharmprojects\\citycourier\\venv\\lib\\site-packages\\pygame\\pygame_icon.bmp',
   'DATA'),
  ('pygame\\freesansbold.ttf',
   'c:\\users\\komle\\pycharmprojects\\citycourier\\venv\\lib\\site-packages\\pygame\\freesansbold.ttf',
   'DATA'),
  ('main.exe.manifest',
   'C:\\Users\\komle\\PycharmProjects\\CityCourier\\build\\main\\main.exe.manifest',
   'BINARY'),
  ('pyi-windows-manifest-filename main.exe.manifest', '', 'OPTION')],
 [],
 False,
 False,
 1621250494,
 [('run.exe',
   'c:\\users\\komle\\pycharmprojects\\citycourier\\venv\\lib\\site-packages\\PyInstaller\\bootloader\\Windows-64bit\\run.exe',
   'EXECUTABLE')])
