{
	"$schema": "./node_modules/ng-packagr/ng-package.schema.json",
	"dest": "dist",
	"lib": {
		"entryFile": "public-api.ts"
	},
	"whitelistedNonPeerDependencies": ["tslib", "ngx-mqtt", "@ngx-translate/core"]
}
