{
	"productName": "Vault",
	"asar": false,
	"directories": {
		"output": "release/"
	},
	"files": ["dist/**/*"],
	"win": {
		"icon": "dist/assets/images/logo/logo-512x512.png",
		"target": ["portable"]
	},
	"mac": {
		"icon": "dist/assets/images/logo/logo-512x512.png",
		"target": ["dmg"]
	},
	"linux": {
		"category": "Network",
		"icon": "dist/assets/images/logo/logo-512x512.png",
		"target": ["AppImage"]
	}
}
