<?xml version="1.0" encoding="UTF-8" standalone="no"?>
<!-- Created with sK1/UniConvertor (http://sk1project.org/) -->

<svg
   xmlns:dc="http://purl.org/dc/elements/1.1/"
   xmlns:cc="http://creativecommons.org/ns#"
   xmlns:rdf="http://www.w3.org/1999/02/22-rdf-syntax-ns#"
   xmlns:svg="http://www.w3.org/2000/svg"
   xmlns="http://www.w3.org/2000/svg"
   xmlns:sodipodi="http://sodipodi.sourceforge.net/DTD/sodipodi-0.dtd"
   xmlns:inkscape="http://www.inkscape.org/namespaces/inkscape"
   width="595.276pt"
   height="841.89pt"
   viewBox="0 0 595.276 841.89"
   fill-rule="evenodd"
   id="svg2"
   version="1.1"
   inkscape:version="0.48.0 r9654"
   sodipodi:docname="logo_poprawione.cdr">
  <metadata
     id="metadata28">
    <rdf:RDF>
      <cc:Work
         rdf:about="">
        <dc:format>image/svg+xml</dc:format>
        <dc:type
           rdf:resource="http://purl.org/dc/dcmitype/StillImage" />
        <dc:title></dc:title>
      </cc:Work>
    </rdf:RDF>
  </metadata>
  <defs
     id="defs26" />
  <sodipodi:namedview
     pagecolor="#ffffff"
     bordercolor="#666666"
     borderopacity="1"
     objecttolerance="10"
     gridtolerance="10"
     guidetolerance="10"
     inkscape:pageopacity="0"
     inkscape:pageshadow="2"
     inkscape:window-width="1152"
     inkscape:window-height="817"
     id="namedview24"
     showgrid="false"
     inkscape:zoom="0.69342471"
     inkscape:cx="398.00878"
     inkscape:cy="745.5198"
     inkscape:window-x="-4"
     inkscape:window-y="-4"
     inkscape:window-maximized="1"
     inkscape:current-layer="svg2" />
  <g
     id="g3022"
     transform="matrix(1.1932642,0,0,1.1932642,-30.809613,-247.6148)">
    <path
       inkscape:connector-curvature="0"
       id="path16"
       d="m 128.077,271.778 31.575,0 -0.382,33.03 27.782,-33.03 35.107,0 -23.333,57.417 -34.157,0 11.037,-28.836 -21.915,28.836 -26.018,-0.031 -1.638,-28.882 -11.715,28.913 -9.751,0 23.408,-57.417 z"
       style="fill:#273785;stroke:none" />
    <path
       inkscape:connector-curvature="0"
       id="path18"
       d="m 252.704,271.778 43.179,0 c 0,0 2.699,0.748 5.086,1.995 2.388,1.248 4.049,3.118 4.049,3.118 l -11.314,11.123 c 0,0 -1.557,-3.742 -2.699,-5.301 -1.142,-1.56 -4.256,-4.886 -4.256,-4.886 l -17.645,0.104 c 0,0 -6.955,1.455 -13.078,13.097 -6.124,11.642 -8.2,21.205 -7.059,26.402 1.142,5.197 10.172,3.846 11.833,2.079 1.661,-1.767 3.841,-3.742 5.398,-8.316 1.557,-4.573 1.573,-6.069 1.66,-6.069 l 33.423,0 -9.653,24.071 -50.757,0 c 0,0 -19.71,-4.845 -14.922,-28.913 3.901,-19.61 17.659,-28.504 26.755,-28.504 z"
       style="fill:#273785;stroke:none" />
    <path
       inkscape:connector-curvature="0"
       id="path20"
       d="m 358.977,271.661 29.374,0 0,57.503 -29.374,0 0,-5.91 -28.86,0.032 -5.471,5.909 -16.747,0 c 0,0 50.968,-57.534 51.078,-57.534 z m -20.575,41.917 20.577,-23.692 0.037,23.755 c 0,0 -20.686,0.019 -20.614,-0.063 z"
       style="fill:#273785;stroke:none" />
    <path
       inkscape:connector-curvature="0"
       id="path22"
       d="m 116.69,250.807 353.142,0 -2.015,4.914 -351.127,0 c -3.873,0 -6.672,1.758 -8.883,4.421 -2.434,2.931 -4.276,7.04 -6.018,11.229 l -26.5008,63.758 c -0.3417,0.823 -0.4993,1.642 -0.4993,2.444 l -0.0095,0 c 0,1.938 0.9394,3.846 2.4404,5.525 1.6343,1.829 3.9123,3.365 6.414,4.404 2.1487,0.893 4.4234,1.405 6.5549,1.405 l 0,-0.01 339.4123,0 -2.015,4.915 -337.3973,0 0,-0.01 c -2.8055,0 -5.7297,-0.644 -8.4364,-1.769 -3.1415,-1.305 -6.0448,-3.282 -8.1801,-5.671 -2.2685,-2.538 -3.6883,-5.555 -3.6883,-8.789 l -0.0096,0 c 0,-1.42 0.2785,-2.87 0.8831,-4.325 l 26.5011,-63.759 c 1.8825,-4.529 3.9025,-9.004 6.7855,-12.476 3.105,-3.74 7.078,-6.206 12.646,-6.206 z"
       style="fill:#273785;stroke:none" />
  </g>
</svg>
