<?xml version="1.0" encoding="utf-8"?>
<!-- Generator: Adobe Illustrator 22.1.0, SVG Export Plug-In . SVG Version: 6.00 Build 0)  -->
<svg version="1.1" id="レイヤー_1" xmlns="http://www.w3.org/2000/svg" xmlns:xlink="http://www.w3.org/1999/xlink" x="0px"
	 y="0px" viewBox="0 0 176 30.1" style="enable-background:new 0 0 176 30.1;" xml:space="preserve">
<style type="text/css">
	.st0{enable-background:new    ;}
	.st1{fill:#131B2D;}
</style>
<title>btn_s_text_open_post</title>
<g id="レイヤー_2_1_">
	<g id="レイヤー_7">
		<g class="st0">
			<path class="st1" d="M18.4,18.6c-1.2,5.3-5,5.9-7,5.9c-1.2,0-2.5-0.2-3.8-0.6c-0.6-0.2-0.9-0.7-0.9-1.2c0-0.7,0.5-1.3,1.3-1.3
				c0.2,0,0.4,0,0.7,0.1c1,0.4,2,0.6,3,0.6c1.8,0,3.4-0.9,4.2-3.5l-12.9,0c-0.8,0-1.2-0.6-1.2-1.2c0-0.5,0.4-1.1,1.1-1.1l13.3,0
				c0.1-0.7,0.1-1.3,0.1-1.7c0,0,0,0,0-0.1c0-0.6-0.5-0.9-1-0.9c-1,0-2,0-3,0c-1,0-2,0-3,0l-0.2,0.5c-0.2,0.6-0.8,0.9-1.4,0.9
				c-0.7,0-1.2-0.3-1.2-1c0-0.2,0.1-0.3,0.1-0.5c0.9-2,1.7-4.8,2-7C8.8,6,9.3,5.7,9.9,5.7c0.6,0,1.3,0.4,1.3,1.1c0,0.1,0,0.2,0,0.2
				l-0.1,0.4H18c0.8,0,1.2,0.6,1.2,1.1S18.8,9.6,18,9.6h-7.4c-0.2,0.7-0.3,1.4-0.5,2.1c1,0,2.1,0,3.1,0c1.1,0,2.1,0,3.1,0
				c1.6,0,2.6,1,2.6,2.5c0,0.1,0,1.2-0.1,2.2l4.3,0c0.7,0,1.1,0.6,1.1,1.2c0,0.5-0.4,1.1-1.1,1.1H18.4z M5.3,8.2
				c0,0.7-0.6,1.1-1.3,1.1c-0.6,0-1.3-0.4-1.3-1.2c0-0.3,0-0.8,0-1.2s0-0.9,0-1.3C2.8,4.2,3.9,3.1,6,3.1c2.6,0,5.2-0.1,7.7-0.1
				c2.1,0,4.2,0,6.4,0.1c1.8,0,3.1,1,3.2,2.5c0,0.4,0,0.9,0,1.5c0,1,0,2.1-1.4,2.1c-0.6,0-1.2-0.4-1.2-1.1c0,0,0,0,0-0.1
				c0-2.5,0-2.8-1.6-2.8c-2.1,0-4.4-0.1-6.7-0.1c-1.9,0-3.7,0-5.3,0.1c-1.4,0-1.6,0.4-1.7,1.4C5.3,6.6,5.3,6.6,5.3,8.2L5.3,8.2z"/>
		</g>
		<g class="st0">
			<path class="st1" d="M50,20.3l-6.4-0.1c1.7,1,3.8,1.7,5.4,1.9c0.7,0.1,1,0.6,1,1.1c0,0.7-0.5,1.4-1.4,1.4c-0.6,0-3.8-0.8-6.8-2.8
				c-0.3-0.2-0.5-0.5-0.5-0.9c0-0.3,0.1-0.6,0.3-0.8h-4.1c0.3,0.2,0.4,0.6,0.4,0.9c0,0.3-0.1,0.6-0.4,0.8c-2.2,1.6-5.7,2.8-6.8,2.8
				c-0.8,0-1.3-0.6-1.3-1.2c0-0.5,0.3-1,1.1-1.1c1.7-0.2,3.8-0.9,5.5-2.2l-6.4,0.1h0c-0.7,0-1-0.5-1-1c0-0.5,0.4-1.1,1.1-1.1H50
				c0.7,0,1.1,0.5,1.1,1.1C51,19.8,50.7,20.3,50,20.3L50,20.3z M41.2,5.8V7c1,0,2.1,0,3,0.1c1.6,0.1,2.7,0.8,2.7,1.8
				C47,9.9,47,10.9,47,12c0,1.1,0,2.1-0.1,3.1c-0.1,1.1-1.1,1.9-2.8,2c-1.5,0-2.9,0.1-4.4,0.1s-2.8,0-4.2-0.1
				c-1.9-0.1-2.8-0.8-2.9-1.9c-0.1-0.9-0.1-1.9-0.1-2.8c0-1.1,0-2.2,0.1-3.1c0.1-1.1,0.8-2,2.8-2.1c1,0,2-0.1,3-0.1V5.8l-7.5,0
				c-0.8,0-1.2-0.5-1.2-1.1c0-0.5,0.4-1,1.2-1l7.4,0.1V2.7c0-0.8,0.7-1.2,1.4-1.2c0.7,0,1.4,0.4,1.4,1.2l0,1.1l7.4-0.1
				c0.8,0,1.2,0.5,1.2,1s-0.4,1.1-1.2,1.1L41.2,5.8z M44.5,11.4h-9.6v1.2h9.6V11.4z M44.5,9.6c0-0.5-0.4-0.8-1.2-0.8
				c-1.2,0-2.4-0.1-3.5-0.1c-1.2,0-2.4,0-3.6,0.1c-0.8,0-1.1,0.4-1.2,0.8l0,0.3h9.5L44.5,9.6z M34.9,14l0,0.4c0,0.9,0.6,0.9,4.5,0.9
				c4.5,0,4.9,0,5-0.9c0-0.1,0-0.3,0-0.4H34.9z"/>
		</g>
		<g class="st0">
			<path class="st1" d="M61.7,5.3c0.4-0.2,0.8-0.3,1.1-0.5c1.4-0.9,2.8,1.3,0.9,2.3c-0.7,0.3-1.8,0.6-2.9,0.9
				c-0.3,0.8-0.8,1.8-1.2,2.6c1.8-0.3,3.5,0.3,4.4,2.3c1.1-0.5,2.2-1.1,3.2-1.5c0.6-0.3,1.3-0.6,2-1c2-1.1,3.1,1.5,1.5,2.3
				c-0.8,0.4-1.4,0.5-2.8,1.1c-1.1,0.4-2.3,0.9-3.3,1.4c0.1,0.9,0.1,1.9,0.1,2.9c-0.1,1-0.7,1.6-1.4,1.6c-0.6,0-1.2-0.5-1.2-1.5
				c0-0.5,0.1-1.1,0.1-1.7c-0.2,0.1-0.5,0.3-0.7,0.4c-3.2,2.1-2.8,3.6-1.4,4.4c1.4,0.7,3.9,0.2,5.1-0.2c2.3-0.7,3,2.1,0.6,2.7
				c-1.5,0.4-5.1,0.8-7.1-0.4c-3.5-2-2.9-5.5,1.8-8.6c0.4-0.2,0.8-0.5,1.3-0.8c-0.7-2.2-2.7-1.9-4.4,0c0,0-0.1,0.1-0.1,0.1
				c-0.2,0.3-0.4,0.5-0.6,0.7c-1.4,1.3-3.3-0.2-1.8-1.6c0.7-0.6,1.6-1.6,2.1-2.4c0.4-0.7,0.9-1.5,1.2-2.3c-1.4,0.2-2.4,0.1-3.2-0.3
				c-1.9-0.9-0.6-3.4,1.2-2.2c0.5,0.3,1.5,0.2,2.4,0.1c0.1,0,0.3,0,0.4-0.1c0.2-0.8,0.2-1.3,0.3-2.2c0.1-1.6,2.5-1.4,2.6-0.1
				c0,0.5-0.1,1-0.2,1.5L61.7,5.3z"/>
		</g>
		<g class="st0">
			<path class="st1" d="M82,15.9c-0.9,0.5-1.8,0.9-2.3,0.9c-0.8,0-1.2-0.6-1.2-1.2c0-0.4,0.2-0.9,0.8-1.1c1-0.4,2-0.8,2.8-1.2V9.2
				h-2.2c-0.8,0-1.1-0.6-1.1-1.1s0.4-1.1,1.1-1.1H82l0-4c0-0.8,0.6-1.2,1.2-1.2c0.6,0,1.2,0.4,1.2,1.2v4H86c0.8,0,1.1,0.6,1.1,1.1
				S86.8,9.2,86,9.2h-1.7v2.9c0.3-0.2,0.6-0.4,0.9-0.6c0.2-0.1,0.4-0.2,0.5-0.2c0.5,0,1,0.5,1,1.1c0,0.6-0.4,1-2.5,2.2v3.1
				c0,0.4,0.1,2.8,0.1,3.7c0,0,0,0.1,0,0.1c0,1.6-1,2.9-3.3,2.9c-1.8,0-2.4-0.5-2.4-1.4c0-0.6,0.4-1.2,1-1.2c0.1,0,0.2,0,0.2,0
				c0.2,0.1,0.5,0.1,0.8,0.1c0.5,0,1.1-0.2,1.1-0.9V15.9z M88.1,14.3c-0.6,0-1-0.5-1-1.1c0-0.5,0.3-1.1,0.9-1.1c1.1,0,2.5,0,3.9,0
				c1.5,0,2.9,0,4.2,0c1.8,0,2.7,1,2.7,2.1c0,1.3-1.7,3.7-3.5,5.4c1.5,0.9,3.2,1.6,5.3,2.1c0.7,0.2,1.1,0.7,1.1,1.2
				c0,0.7-0.5,1.3-1.5,1.3c-1.4,0-4.3-1.4-6.7-3.1c-3.8,3-7.3,3.4-7.6,3.4c-0.8,0-1.4-0.7-1.4-1.3c0-0.5,0.3-1,1.1-1.1
				c2.3-0.4,4.3-1.4,6-2.6c-1.4-1.3-2.7-3.1-2.7-3.7c0-0.6,0.6-1.1,1.2-1.1c0.4,0,0.7,0.2,1,0.5c0.6,1.1,1.3,2,2.2,2.8
				c1.7-1.7,2.4-3.4,2.4-3.6c0-0.3-0.4-0.3-0.6-0.3c-0.5,0-1.1,0-1.8,0C91.7,14.2,89.6,14.2,88.1,14.3L88.1,14.3z M99.1,7.1
				c0-0.7,0.5-1,1.1-1c0.6,0,1.2,0.4,1.2,1c0,0.1,0,0.1,0,0.2c0,3.4-1.5,3.7-3.7,3.7c-2.8,0-3.2-0.8-3.2-3c0-0.9,0-2.1,0-2.8
				c0-0.6-0.3-0.8-1.6-0.8c-1.5,0-1.7,0.3-1.7,0.8c0,2.4-0.3,4.3-2.4,6.1c-0.4,0.3-0.7,0.4-1.1,0.4c-0.8,0-1.4-0.6-1.4-1.2
				c0-0.3,0.2-0.6,0.5-0.9c1.6-1,1.9-2.2,1.9-4.2c0-0.3,0-0.6,0-0.9c0,0,0,0,0-0.1c0-2.1,2.4-2.2,3.6-2.2C96,2.4,97,2.5,97,5.5
				C97,6.4,97,7.1,97,7.8C97,8.4,97,9,97.8,9c0.8,0,1.3,0,1.3-1.6C99.1,7.3,99.1,7.2,99.1,7.1L99.1,7.1z"/>
		</g>
		<g class="st0">
			<path class="st1" d="M111.4,23.7c0,0.7-0.6,1.1-1.2,1.1s-1.2-0.4-1.2-1.1v0l0.1-8.7c-1.7,3.3-2.2,3.7-2.9,3.7s-1.3-0.6-1.3-1.2
				c0-0.3,0.1-0.6,0.4-0.8c1.2-1.3,2.9-3.7,3.9-6l0-0.7l-2.3,0.1h0c-0.8,0-1.1-0.5-1.1-1.1c0-0.6,0.4-1.1,1.1-1.1h2.3l-0.1-2.4
				c-1.1,0.3-1.9,0.3-2.2,0.3c-0.7,0-1.1-0.6-1.1-1.2c0-0.5,0.3-0.9,0.8-1c2-0.2,3.8-0.6,5.8-1.5c0.1,0,0.2-0.1,0.3-0.1
				c0.6,0,1.2,0.6,1.2,1.2c0,0.8-0.9,1.1-2.4,1.5c0,0.5-0.1,1.7-0.1,3.1h1.8c0.7,0,1.1,0.5,1.1,1.1c0,0.6-0.3,1.1-1,1.1h0l-1.8-0.1
				c0,0.6,0,1.1,0,1.7c0.7,0,2.4,1.7,2.8,2.2c0,0,0.1,0.1,0.1,0.1c0.3-0.8,1-1.2,2.3-1.2c1.1,0,3.1,0,5,0c1.4,0,2.7,0,3.5,0
				c1.7,0.1,2.5,1.1,2.5,2.4c0.1,0.9,0.1,1.5,0.1,2c0,1.1,0,1.2,0,1.4c0,0.4,0,2,0,2.9c0,0,0,0.1,0,0.1c0,1.6-1,3.2-3.8,3.2
				c-2.1,0-2.7-0.4-2.7-1.3c0-0.6,0.4-1.2,1.1-1.2c0.1,0,0.2,0,0.3,0c0.5,0.1,0.9,0.2,1.4,0.2c0.8,0,1.4-0.3,1.4-1.5c0,0,0,0,0-0.1
				c0,0,0-0.5,0-1.3c0-1.1,0-2.8-0.1-4.2c0-0.8-0.3-0.8-4.2-0.8c-1.5,0-3.1,0-3.8,0.1c-0.6,0-0.8,0.3-0.8,0.8c0,1.4-0.1,2.9-0.1,4.6
				c0,1.2,0,2.5,0.1,3.8c0,0,0,0,0,0.1c0,0.7-0.6,1-1.2,1c-0.6,0-1.2-0.3-1.2-1.1c0-1.2,0-2.4,0-3.6c0-1.6,0-3.3,0-4.8
				c-0.2,0.2-0.5,0.4-0.8,0.4c-0.3,0-0.6-0.2-0.8-0.5c-0.3-0.4-0.7-1-1.1-1.4C111.3,17.8,111.4,23.6,111.4,23.7L111.4,23.7z
				 M114.9,6.3c-0.8,0-1.1-0.5-1.1-1c0-0.5,0.4-1,1.1-1h0l4.6,0.1l0-1.6c0-0.7,0.6-1.1,1.3-1.1c0.6,0,1.3,0.4,1.3,1.1l0,1.6l4.9-0.1
				c0.8,0,1.1,0.5,1.1,1c0,0.5-0.4,1-1.1,1H114.9z M120.7,11.8c-4.3,0-4.8-0.2-4.8-2.3c0-2.2,0.3-2.2,5.1-2.2c4,0,4.4,0,4.4,2.2
				C125.5,11.5,125.1,11.8,120.7,11.8z M120.5,21c-2.6,0-3-0.3-3-2.6c0-2.7,0-2.9,3.4-2.9c2.9,0,3.1,0.2,3.1,3
				C123.9,20.8,123.4,21,120.5,21z M120.7,8.7c-2.5,0-2.5,0-2.5,0.8c0,0.8,0,0.8,2.5,0.8c2.6,0,2.6,0,2.6-0.8
				C123.2,8.7,123.2,8.7,120.7,8.7z M121.8,17.5c0-0.4-0.5-0.4-1.2-0.4c-1,0-1.2,0.1-1.2,1.1c0,1,0,1.2,1.3,1.2c1,0,1.1-0.1,1.1-1.1
				C121.9,18.1,121.9,17.9,121.8,17.5z"/>
		</g>
		<g class="st0">
			<path class="st1" d="M139,16.4c-0.9-2.5,0.5-4.4,2.1-4.9c0.8-0.2,1.5-0.3,2.2-0.2c0-0.6-0.1-1.4-0.1-2.1
				c-2.2,0.2-4.3,0.5-5.7,0.7c-1.9,0.3-3.1,0.6-3.9,0.8c-1.7,0.3-2.3-2.3-0.2-2.6c1-0.2,2.7-0.4,3.8-0.5c1.3-0.2,3.6-0.5,5.9-0.7
				c0-0.2,0-0.3,0-0.5c0-1.6-0.1-1.7-0.1-2.5c0-1.9,2.6-1.7,2.7-0.1c0,0.6-0.1,1.8-0.1,2.5c0,0.1,0,0.3,0,0.4c0.8-0.1,1.4-0.1,2-0.1
				c1.3,0,2.2,0,4,0c2.2,0.1,2.1,2.8,0,2.7C149.8,9,149.1,9,147.5,9c-0.6,0-1.2,0-1.9,0.1c0,0.8,0.1,1.6,0.1,2.4
				c0,0.4,0.1,0.9,0.1,1.5c2.3,3.6-0.4,9.2-3.2,11.4c-1.7,1.4-4-0.5-1.7-2.1c1.2-0.9,2.3-2.3,3-3.8C142.1,19.3,139.8,18.8,139,16.4z
				 M143.3,13.7c-0.4-0.3-1.1-0.4-1.7-0.1c-0.6,0.3-1,1.1-0.8,2c0.5,1.4,2.7,1.4,3-0.4c0.1-0.5,0-0.8-0.2-1
				C143.6,14,143.5,13.8,143.3,13.7z"/>
		</g>
		<g class="st0">
			<path class="st1" d="M165.8,20.1c1.9-1.7,1.8-4.2,0.3-5.1c-1.4-0.9-4.2-1.1-6.8,0.4c-1,0.6-1.6,1.1-2.2,2
				c-0.9,1.4-3.5-0.2-1.9-1.7c2.9-2.8,5-4.8,7.9-8.4c0.3-0.4,0-0.3-0.2-0.2c-0.7,0.4-2.4,0.9-4.4,1.3c-2.1,0.4-2.4-2.1-0.7-2.3
				c1.7-0.2,4.2-0.8,5.7-1.3c2.1-0.6,3.8,1.2,2.5,2.7c-0.8,0.9-1.9,2-2.9,2.9s-2.1,1.9-3,2.8c2.3-1.2,5.4-1.2,7.3-0.1
				c3.7,2.2,2.5,6.8-0.2,8.8c-2.6,1.8-6.6,2-8.6,0.6c-2.8-1.8-1.5-5,1.5-5.1c2.1-0.1,4,1.2,4.1,3.5
				C164.8,20.9,165.4,20.5,165.8,20.1z M160.3,19.3c-1.1,0.1-1.2,1.2-0.4,1.6c0.6,0.3,1.5,0.4,2.2,0.4
				C162.1,20.1,161.4,19.2,160.3,19.3z"/>
		</g>
	</g>
</g>
</svg>
