<?xml version="1.0" encoding="utf-8"?>
<!-- Generator: Adobe Illustrator 22.1.0, SVG Export Plug-In . SVG Version: 6.00 Build 0)  -->
<svg version="1.1" id="レイヤー_1" xmlns="http://www.w3.org/2000/svg" xmlns:xlink="http://www.w3.org/1999/xlink" x="0px"
	 y="0px" viewBox="0 0 688.4 267.7" style="enable-background:new 0 0 688.4 267.7;" xml:space="preserve">
<style type="text/css">
	.st0{enable-background:new    ;}
	.st1{fill:#D3A15F;}
	.st2{fill:#FFFFFF;}
</style>
<title>title</title>
<g id="レイヤー_2_1_">
	<g id="TOP">
		<g class="st0">
			<path class="st1" d="M163,66l6.2-10.9c1.4-2.3,1.8-4.8,1.2-6.5c-1.2-3.6-3.9-4.5-6.8-3.5c-2.8,0.9-4.9,5.3-0.8,8.4l-1,2
				c-6.2-1.8-6-10.1,1.5-12.6c4.2-1.4,8.9-0.2,10.3,3.9c1.3,3.9-1.7,8.1-1.7,8.1l-4.7,7.9l11.2-3.7l0.4,3l-15.4,5.1L163,66z"/>
		</g>
		<g class="st0">
			<path class="st1" d="M194.2,58.4c-4.7,1.3-9.9-2.8-11.7-9.2c-1.8-6.3,0.5-12.6,5.2-13.9c4.6-1.3,9.9,2.8,11.7,9.1
				C201.2,50.9,198.9,57.1,194.2,58.4z M188.2,37.2c-3.4,1-3.7,5.7-2.1,11.1c1.5,5.4,4.3,9.3,7.6,8.3c3.3-0.9,3.6-5.7,2.1-11.1
				C194.3,40.1,191.5,36.2,188.2,37.2z"/>
		</g>
		<g class="st0">
			<path class="st1" d="M208.6,53.6l-0.3-1c3.3-0.8,3.7-1.8,2.5-6.8l-1.8-7.6c-1.2-5-2.5-5.2-6.1-4.2l-0.3-1l7.9-3.7l3.8,15.7
				c1.2,5,2.1,5.7,5.4,4.9l0.3,1L208.6,53.6z"/>
		</g>
		<g class="st0">
			<path class="st1" d="M234.8,48.6c-4.4,0.9-8.9-1.4-9.6-4.6c-0.7-3.5,1.8-5.8,4.2-7.4c-2.3-0.9-4.9-2.1-5.4-4.4
				c-0.6-3.2,2.3-6.3,6-7c3.8-0.8,7.7,0.8,8.2,3.7c0.5,2.5-1.8,4.5-4,6.1c3.3,0.8,6.7,1.9,7.4,5.4C242.5,44.1,239.2,47.7,234.8,48.6
				z M230.4,27c-2.2,0.4-3.5,2.2-3.2,3.9c0.4,2,3.1,2.9,5.3,3.6c1.4-1.2,2.8-3,2.3-5.1C234.5,27.6,232.6,26.5,230.4,27z M231.3,37.1
				c-1.7,1.5-3.3,3.3-2.7,6.2c0.5,2.5,2.7,4,5.8,3.4c3.1-0.6,4.6-2.9,4.1-5.2C238,38.8,234.4,38,231.3,37.1z"/>
		</g>
		<g class="st0">
			<path class="st1" d="M253,44.8c-1.6,0.3-3-0.8-3.2-2.2c-0.2-1.5,0.8-2.9,2.3-3.2c1.5-0.3,3.1,0.7,3.3,2.2
				C255.6,43.1,254.5,44.5,253,44.8z"/>
		</g>
		<g class="st0">
			<path class="st1" d="M263.1,42.7l-0.1-1.1c3.4-0.5,3.9-1.4,3.2-6.5l-1.1-7.8c-0.7-5.1-1.9-5.4-5.6-4.8l-0.1-1.1l8.2-2.8l2.2,16
				c0.7,5.1,1.5,5.9,4.8,5.4l0.1,1.1L263.1,42.7z"/>
		</g>
		<g class="st0">
			<path class="st1" d="M281.1,40.4l-0.1-1.1c3.4-0.4,3.9-1.3,3.4-6.4l-0.8-7.8c-0.5-5.1-1.8-5.5-5.4-5l-0.1-1.1l8.3-2.6l1.7,16
				c0.5,5.1,1.3,5.9,4.6,5.5l0.1,1.1L281.1,40.4z"/>
		</g>
		<g class="st0">
			<path class="st1" d="M303,38.8c-1.6,0.1-2.9-1-3-2.5c-0.1-1.5,1-2.8,2.6-2.9c1.5-0.1,3,1,3.1,2.5C305.8,37.3,304.6,38.7,303,38.8
				z"/>
		</g>
		<g class="st0">
			<path class="st1" d="M313.3,36.4l9-8.8c1.9-1.8,3-4.1,3-5.9c-0.2-3.8-2.5-5.4-5.6-5.3c-2.9,0.1-6.2,3.7-3.1,7.8l-1.5,1.7
				c-5.5-3.5-3-11.4,4.9-11.7c4.4-0.2,8.6,2.3,8.8,6.5c0.2,4.1-3.9,7.4-3.9,7.4l-6.7,6.3L330,34l-0.4,3l-16.2,0.6L313.3,36.4z"/>
		</g>
		<g class="st0">
			<path class="st1" d="M344,37.7c-4.8,0-7.4-2.9-7.4-4.6c0-0.7,0.5-1.2,1.4-1.2c1.8,0,1.1,3.6,5.9,3.6c3.6,0,5.6-2.6,5.6-5.8
				c0-3.2-1.6-5.9-5.2-5.9c-2.1,0-4.4,1.3-5,3.7l-2.1,0l1.4-13l13.3,0.1l-0.5,3l-11.1-0.1l-0.6,5.9c1.2-1.1,3.1-1.7,4.9-1.7
				c4.9,0,8.4,3.7,8.3,8.1C353.3,34.2,349.1,37.7,344,37.7z"/>
		</g>
		<g class="st0">
			<path class="st1" d="M363.6,37.6c-1.6-0.1-2.8-1.3-2.7-2.8c0.1-1.5,1.3-2.7,2.9-2.6c1.5,0.1,2.8,1.3,2.8,2.8
				C366.5,36.4,365.1,37.6,363.6,37.6z"/>
		</g>
		<g class="st0">
			<path class="st1" d="M395.4,26.4l-5.8,13l-0.9-0.1l-3.3-12.1l-5.2,11.5l-0.9-0.1l-3.7-13.7c-0.7-2.7-1.3-3.5-3.9-3.7l0.1-1
				l9.7,0.7l-0.1,1c-2.5-0.2-3.1,0.5-2.5,2.7l2.2,7.7l5-11.1l1.2,0.1l3.2,11.8l3.3-7.4c0.9-2,0.6-2.8-2-3l0.1-1l8.1,0.6l-0.1,1
				C397.2,23,396.5,23.8,395.4,26.4z"/>
		</g>
		<g class="st0">
			<path class="st1" d="M417.2,29.2l-0.8-0.1l-0.1-1c-0.3-1.7-0.8-2.4-4.4-2.8l-2.8-0.3l-0.7,5.7c4,0.5,4.3,0.1,4.6-2.5l1,0.1
				l-0.9,7.6l-1-0.1c0.3-2.7,0-3-3.9-3.5l-0.3,2.3c-0.4,3.6,0,4.3,2.6,4.6l0.7,0.1c3.6,0.4,4.3-0.1,4.9-1.8l0.4-0.9l0.8,0.1
				l-0.9,4.8l-16-1.9l0.1-1c2.9,0.3,3.4-0.3,3.8-3.9l0.8-6.5c0.4-3.6,0-4.3-2.8-4.6l0.1-1l15,1.8L417.2,29.2z"/>
		</g>
		<g class="st0">
			<path class="st1" d="M421.1,41.1c2.8,0.5,3.4-0.1,4-3.7l1-6.5c0.6-3.6,0.2-4.3-2.6-4.7l0.2-1l9.1,1.4c7.3,1.1,9.8,5.5,9.1,10.1
				s-4.5,8-11.8,6.8l-9.1-1.4L421.1,41.1z M432.6,28.1c-0.2,0-2.4-0.4-2.4-0.4l-1.7,11c-0.4,2.3-0.2,2.8,1.6,3.1l0.4,0.1
				c5.3,0.8,6.9-2.9,7.3-6C438.3,33,437.9,29,432.6,28.1z"/>
		</g>
		<g class="st0">
			<path class="st1" d="M445.1,45c2.8,0.6,3.4,0,4.1-3.6l1.3-6.4c0.7-3.6,0.4-4.3-2.4-4.8l0.2-1l9,1.8c7.2,1.5,9.6,5.9,8.6,10.5
				c-0.9,4.6-4.8,7.8-12,6.3l-9-1.8L445.1,45z M457.2,32.6c-0.2,0-2.4-0.5-2.4-0.5L452.6,43c-0.5,2.3-0.3,2.8,1.5,3.2l0.4,0.1
				c5.2,1.1,7-2.6,7.6-5.6C462.6,37.6,462.5,33.6,457.2,32.6z"/>
		</g>
		<g class="st0">
			<path class="st1" d="M468.8,51L469,50c2.8,0.7,3.4,0.1,4.3-3.4l1.6-6.4c0.9-3.5,0.6-4.2-2.2-4.9l0.2-0.9l9.9,2.4l-0.2,0.9
				c-2.8-0.7-3.4-0.2-4.2,3.3l-1.6,6.4c-0.9,3.5-0.6,4.3,2.2,5l-0.2,0.9L468.8,51z"/>
		</g>
		<g class="st0">
			<path class="st1" d="M503.3,47.8l-3.3,12l-1-0.3L490.8,44l-1.8,6.6c-1,3.5-0.7,4.3,2,5l-0.3,0.9l-7.9-2.2l0.3-0.9
				c2.8,0.8,3.4,0.3,4.4-3.2l1.8-6.3c1-3.5,0.7-4.2-2.1-5l0.3-0.9l4.9,1.4l7.6,14.5l1.8-6.5c1-3.5,0.7-4.2-2.1-5l0.3-0.9l7.9,2.2
				l-0.3,0.9C504.9,43.8,504.3,44.3,503.3,47.8z"/>
		</g>
		<g class="st0">
			<path class="st1" d="M510.1,53.2c1.6-4.8,7-7.4,12.1-5.7c1.9,0.6,3.7,2.2,4.5,4c0.4-0.3,0.8-0.9,1.2-1.5l0.9,0.3l-2.2,6.7l-1-0.3
				c0.4-3.9-0.9-6.7-3.9-7.7c-4.4-1.4-6.9,2.3-7.9,5.4s-1.2,7.6,3.2,9c2.5,0.8,4.8,0.6,5.6-1.6c0.5-1.7,0-2.5-2.3-3.3l0.3-0.9l9.2,3
				l-0.3,0.9c-2.7-0.9-3.4-0.4-4.5,3l-0.5,1.5c-2.1-0.7-5.9-0.3-8-1C511.4,63.4,508.5,58.1,510.1,53.2z"/>
		</g>
		<g class="st0">
			<path class="st2" d="M211.1,108.3c3.8,0.2,7.6,1,11,2.2c0.3-2.1,0.1-4-0.7-5.3c-1.4-2.4,3.1-4.3,4.8-1.2c1.1,2,1.3,5.1,0.5,8.4
				c2.6,1.3,5,2.8,7,4.3c3.2,2.5-0.3,7.1-3.1,4.5c-1.7-1.5-3.5-2.9-5.5-4.1c-1.9,3.8-5.1,7.6-9.6,10.3c-3.5,2.1-6.1-1.9-2.8-3.9
				c3.8-2.3,6.4-5.5,8-8.6c-3.8-1.6-7.8-2.5-11.8-2.5c-1.9,3.9-3.6,7-6.5,9.3c-3,2.4-7.5,2.7-9.7,0c-2.6-3.2-0.7-8.5,5.1-11.1
				c2.7-1.2,5.5-1.9,8.3-2.2c1.8-3.8,4.1-8.4,5.5-11.6c0.3-0.7,0.5-1.1-0.3-0.9c-2,0.5-3.9,1.2-6,1.2c-3.3,0.1-3.2-4.6-0.2-4.8
				c2-0.1,5.1-0.9,7.3-1.3c4.6-0.9,6.6,2.1,4.4,5.8c-2.1,3.5-4.2,7.7-6,11.5H211.1z M199.2,114.4c-1.3,0.7-3.7,2.8-2.8,4.1
				c0.6,0.9,2.4,0.6,3.3-0.2c1.7-1.3,3-3.3,4.2-5.4C202.6,113.1,201,113.5,199.2,114.4z"/>
		</g>
		<g class="st0">
			<path class="st2" d="M262.7,120.4c0-2.3,0.4-3.8,0.3-6c-0.3-5.6-8-0.9-9.4,1.7c-1.2,2.2-2.6,4.4-3.2,6.9c-0.9,3.9-2,4.2-3,4.3
				c-1.8,0.3-4.2-1-3-3.9c2.3-5.7,5.2-10.8,8.1-15.4s5.6-8.9,8.1-12.8c0.9-1.4,2.2-3.2,2.8-4.2c1.7-3,6.4-0.5,4.7,2.7
				c-0.4,0.7-0.8,1.3-1.2,1.8c-0.4,0.5-0.9,1.1-1.5,1.7c-2.4,2.7-4.1,4.9-5.4,6.7c-1.3,1.9-2.3,3.5-3.4,5.2
				c-0.4,0.5-0.2,0.4,0.2,0.1c1.8-1.6,10.6-4,11.3,4.6c0.2,2-0.3,3.7-0.3,5.6c0,4.5,4.4,4,7.4,1.3c2.6-2.3,3.7-4.8,4.6-7.1
				c1.5-3.8,6.8-1.2,4.9,2.6c-1.4,2.8-3.4,6.1-6.4,8.4C272.7,128.9,262.6,130,262.7,120.4z"/>
		</g>
		<g class="st0">
			<path class="st2" d="M298.2,99.4c-3.1-0.9-2.1-5.5,1.5-4.4c1.7,0.6,4.3,0.5,6.9-0.2c0.5-1.7,0.8-3.3,1-5.1c0.5-3,4.9-2.4,4.8,0.5
				c-0.1,0.8-0.4,1.9-0.7,3.1c0.6-0.3,1.2-0.6,1.6-0.9c2.3-1.6,5.5,1.5,2.2,3.9c-1.3,0.9-3.3,1.7-5.4,2.3
				c-2.4,5.7-5.8,11.8-9.1,17.1c-1.9,3-6.7,1.1-4.5-2.2c2.8-4.2,5.8-8.5,8.3-13.8C302.3,100.2,300.2,100,298.2,99.4z M306.9,128
				c-4.7-2.4-5.3-7.9-0.1-10.2c3.1-1.4,6.6-1.5,9.7-1c0-0.6,0-1.1,0-1.8c0-1.3-0.1-2.5-0.2-3.8c-0.1-1,0.1-2.4,0.3-3.4
				c0.6-2.8,5.1-2.1,4.6,0.9c-0.2,0.8-0.3,1.3-0.3,2.4c0,1.2,0,2.4,0.1,3.9c0.1,1,0.2,2,0.2,3.1c2.7,1.1,4.9,2.7,6.2,4.1
				c2.9,3.2-1.2,6.8-3.7,3.9c-0.8-0.9-1.7-1.8-2.9-2.6C319.4,127.5,313.1,131.1,306.9,128z M308.6,121.3c-1.4,0.7-1.5,2.2,0.1,2.9
				c3,1.5,7.1,0.1,7.7-2.7c0.1-0.2,0-0.4,0.1-0.5C313.8,120.2,311.1,120.1,308.6,121.3z M319.9,102.6c-2.8,0.2-3-4.1,0.3-4.4
				c3.3-0.3,6.9,0.3,9.3,1.8c3.4,2.1,0.8,6.3-1.7,4.7C325.4,103.2,322.8,102.5,319.9,102.6z"/>
		</g>
		<g class="st0">
			<path class="st2" d="M360.4,103.9c0.5-1,1-1.8,1.6-2.6c0.8-1.1,0.6-1-0.4-0.7c-3.8,1.2-2.9,1.2-6.4,2.5c-1.6,0.6-3,1.1-4.6,1.5
				c-4.5,1.2-5.8-4.6-1.8-5.5c1.1-0.3,4-0.8,5.6-1.2c2.5-0.6,6.9-1.6,12.1-3.1c5.2-1.5,9.3-2.7,13.8-3c3.1-0.2,4,2.3,3.4,3.9
				c-0.3,0.9-1.4,1.9-5,1.7c-2.6-0.2-5.8,0.8-7.5,1.4c-2.8,1-5.4,4.1-6.5,5.9c-4.5,7.5-1.1,18.1,10.3,17.7c5.3-0.2,5.7,5.8,0.3,5.7
				C360.1,128.1,354.9,114.1,360.4,103.9z M376,107.3c-2.7-1.2-0.7-4.3,1.8-3.4c1.4,0.5,4.2,1.9,5.3,3.2c2.1,2.2-1.1,5.5-2.8,3.4
				C379.6,109.6,377.1,107.7,376,107.3z M381.1,102.8c-2.7-1.1-0.8-4.3,1.7-3.5c1.4,0.5,4.2,1.8,5.4,3c2.1,2.1-0.9,5.5-2.7,3.4
				C384.8,105,382.2,103.2,381.1,102.8z"/>
		</g>
		<g class="st0">
			<path class="st2" d="M408.4,128.5l0.5-24.2c-4,5.1-5.5,5.8-6.7,5.8c-1.3,0-2.4-1.1-2.4-2.3c0-0.6,0.3-1.3,0.9-1.8
				c5-4.4,9.6-11,12.2-17.9c0.4-1.1,1.3-1.5,2.2-1.5c1.4,0,2.8,1.1,2.8,2.5c0,1.1-2.3,5.3-4.1,8.1l-0.6,31.3c0,1.6-1.3,2.3-2.4,2.3
				C409.6,130.8,408.4,130.1,408.4,128.5L408.4,128.5z M431.2,119.4v8.8c0,1.7-1.2,2.5-2.4,2.5s-2.4-0.8-2.4-2.5V99.5h-1.9
				c-1.5,2.9-3.3,5.7-5.5,8.6c-0.7,0.9-1.6,1.3-2.3,1.3c-1.3,0-2.3-1-2.3-2.2c0-0.5,0.2-1.1,0.7-1.6c3.3-4,6.7-9.8,8.6-17.2
				c0.3-1.3,1.3-1.9,2.3-1.9c1.3,0,2.6,0.9,2.6,2.3c0,0.8-1.5,4.9-2.1,6.3h17.5c1.4,0,2.2,1.1,2.2,2.2c0,1.1-0.7,2.2-2.2,2.2h-12.8
				v5.5h10.4c1.4,0,2.2,1.1,2.2,2.2c0,1.1-0.7,2.2-2.2,2.2h-10.4v5.6h11c1.4,0,2.2,1.1,2.2,2.2c0,1.1-0.7,2.2-2.2,2.2H431.2z"/>
		</g>
		<g class="st0">
			<path class="st2" d="M474.5,121.8c3.7-3.3,3.5-8.1,0.7-10c-2.6-1.8-8.1-2.1-13.2,0.9c-2,1.2-3.1,2.1-4.3,3.8
				c-1.8,2.7-6.9-0.3-3.8-3.4c5.6-5.5,9.7-9.4,15.3-16.4c0.6-0.7,0-0.5-0.4-0.3c-1.4,0.8-4.8,1.8-8.5,2.6c-4,0.9-4.8-4.2-1.3-4.6
				c3.4-0.4,8.3-1.6,11.2-2.5c4.1-1.2,7.4,2.4,4.9,5.3c-1.6,1.8-3.7,3.8-5.7,5.7s-4.1,3.7-5.9,5.5c4.5-2.4,10.5-2.4,14.2-0.2
				c7.3,4.4,4.9,13.3-0.4,17.1c-5,3.6-12.9,3.8-16.8,1.3c-5.4-3.5-3-9.8,3-10c4.1-0.2,7.9,2.3,8,6.8
				C472.5,123.2,473.6,122.6,474.5,121.8z M463.7,120.2c-2.2,0.2-2.3,2.3-0.7,3.1c1.2,0.6,2.8,0.8,4.3,0.8
				C467.3,121.8,465.9,120,463.7,120.2z"/>
		</g>
		<g class="st0">
			<path class="st2" d="M104.2,202.7c17.2-5.5,27.5-19.7,31-31.1c0.6-2.1,0.4-4.1-2.5-4.1c-7.6-0.2-20,0.2-31.2,0.6
				c-5.1,0.2-5.7-7.5-0.2-7.7c10.3-0.5,24.9-0.5,34.8-0.4c6.3,0.1,10.8,4.8,8.5,11.2c-5.5,15.6-15,30.7-36.8,39.1
				C101.2,212.8,98.3,204.6,104.2,202.7z"/>
		</g>
		<g class="st0">
			<path class="st2" d="M190.3,200c0.1,1.8,0.1,2.8,0.2,4.4c0.2,4.9-2.7,8.7-11.9,7.1c-2.9-0.5-3.9-2.6-3.5-4.4
				c0.4-1.7,2.1-3.2,4.3-2.5c2,0.6,4.6,1.2,4.5-1.3c-0.1-3.1-0.2-8.4-0.3-13.9c-5.6,7.2-10.2,11.7-17.6,16.5
				c-5.4,3.5-8.8-3.1-4.5-5.4c7.5-3.9,13.5-9.8,18.3-16.7c-4.7,0.1-9.3,0.2-13.7,0.4c-4.6,0.2-5.2-6.2-0.2-6.3
				c5.5-0.2,11.5-0.4,17.5-0.5c-0.1-3-0.2-5.5-0.3-6.9c-0.2-5.1,6.7-4.7,6.7-0.2c0,1.6,0,4.1,0.1,7.1c3,0,6,0,8.9,0
				c5.2,0.1,4.8,6.8-0.2,6.6c-2.8-0.2-5.6-0.2-8.5-0.2C189.9,189.5,190.1,195.8,190.3,200z"/>
		</g>
		<g class="st0">
			<path class="st2" d="M232.1,208.2c0.2,6.3-8.7,6.6-8.4,0.3c0.5-12.6,0.8-43.2,0.5-54.4c-0.2-5.3,8.3-5.2,8.1,0.1
				c-0.1,3.8-0.2,10.6-0.2,18.3c0.4,0,0.9,0,1.3,0.1c4.4,0.7,14.5,3.2,18.7,6.8c4.1,3.4-0.4,10.2-4.8,6.9
				c-3.4-2.5-11.1-5.5-15.2-6.3C232,190.6,232,201.9,232.1,208.2z"/>
		</g>
		<g class="st0">
			<path class="st2" d="M296.5,210.9c-3.1,2-6,1.1-7.3-0.7s-1-4.5,2.1-6.1c13.1-6.5,17.6-19.3,16.4-30.7c-0.3-3.3,1.8-4.8,4.3-4.8
				c2.4,0,4.8,1.2,4.7,4.4c0,0.9,0,1.9-0.1,2.9c0.2-0.1,0.4-0.2,0.6-0.3c5.2-2.1,11.2-5.6,14.2-9.8c1.2-1.6,1.2-2.8-0.9-2.8
				c-8.7-0.1-25.7,0.2-36.7,0.7c-6.9,0.3-6.5-7.2-0.6-7.5c11.3-0.5,28.3-0.5,40-0.5c8.1,0,11.9,6.8,6.4,12.9
				c-5.1,5.8-10.8,10.8-19.3,13.9c-1.8,0.6-3.4,0.5-4.4-0.2C313.9,194.4,308,203.7,296.5,210.9z"/>
		</g>
		<g class="st0">
			<path class="st2" d="M353.9,199.5c11.5-5.1,18.5-17.2,17.8-32.1c-0.3-6,7.9-5.6,8-0.6c0.5,14.7-6.2,31-21.5,39.5
				C352.2,209.6,348,202.1,353.9,199.5z M394.8,202.3c-5.1,2.5-10.6,0.5-10.1-6.2c0.5-7,1.1-25.6,1.1-30.2c0-5.7,7.9-5.6,7.8,0
				c-0.1,3-0.9,23.6-0.9,26.3c-0.1,1.7,0.9,1.9,2.3,1c6.7-3.8,12.9-11.1,17.4-19.5c2.8-5.2,9.8-0.9,7.1,3.9
				C414.2,187.2,405.4,196.9,394.8,202.3z"/>
		</g>
		<g class="st0">
			<path class="st2" d="M437.8,193.1c7.3-4.5,13.3-12.6,16.5-20.8c2.3-6.1,10.2-2,7.9,3.1c-4.5,9.8-10.6,18.5-19.5,24.7
				C437.5,203.7,432.4,196.4,437.8,193.1z M490.8,196.3c-2.3-7.5-10-17.3-15.1-21.7c-3.7-3.2,1.5-8.8,6.2-4.7
				c6.8,6,15.5,16.1,17.4,23.2C500.8,199.2,492.6,202.4,490.8,196.3z M483,165.4c-4-1.6-0.9-6.4,2.7-5.1c2.1,0.8,6,2.9,7.7,4.8
				c3,3.3-1.5,8-4.1,4.9C488.4,168.8,484.5,166.2,483,165.4z M490.1,158.7c-4-1.6-1.2-6.3,2.5-5.1c2.1,0.7,6.1,2.7,7.9,4.5
				c3.1,3.1-1.2,8-3.9,5C495.5,161.9,491.6,159.4,490.1,158.7z"/>
			<path class="st2" d="M522.6,209.3c-5.8,0.9-7.7-7-1.5-7.9c1.2-0.2,2.7-0.3,4-0.5c3.8-8.1,12-29.7,14-39.5
				c1.3-6.6,10.1-4.4,8.4,1.6c-2.3,8.5-8.9,25.7-13.4,36.3c8.1-1.5,16.7-3.4,22.8-4.8c-2-2.7-4.2-4.9-5.9-6.4
				c-3.6-3.1,1.5-8.6,5.9-4.7c3.7,3.4,11.9,11.3,14.4,18.3c0.9,2.7-0.7,4.9-2.5,5.7c-1.9,0.8-4.3,0.2-5.3-2.3
				c-0.5-1.3-1.2-2.7-2-4.1C551.2,203.7,534.7,207.3,522.6,209.3z"/>
		</g>
		<g class="st0">
			<path class="st2" d="M207.2,248.1c1.4,0,2.6,0.2,3.6,1c1,0.9,1.3,2.2,1.3,3.1c0,2-1.3,4-4.5,4h-1.4v6.2h-1.6v-14.2H207.2z
				 M206.2,254.6h1.3c1.9,0,3-0.9,3-2.6c0-2.3-2.1-2.5-3.1-2.5h-1.2V254.6z"/>
		</g>
		<g class="st0">
			<path class="st2" d="M215.9,253.5h1.5v1c0.1-0.2,0.8-1.2,2-1.2c0.5,0,1,0.2,1.4,0.4l-0.7,1.4c-0.3-0.2-0.7-0.3-0.9-0.3
				c-0.6,0-1,0.3-1.2,0.6c-0.3,0.3-0.5,0.9-0.5,2.4v4.7h-1.5V253.5z"/>
		</g>
		<g class="st0">
			<path class="st2" d="M231.5,260.1c-0.3,0.5-0.6,1-1.1,1.4c-0.8,0.7-1.8,1.1-2.9,1.1c-2.1,0-4.4-1.3-4.4-4.6
				c0-2.6,1.6-4.7,4.3-4.7c1.7,0,2.8,0.9,3.4,1.6c0.6,0.8,0.9,2.2,0.8,3.3h-6.9c0,1.8,1.3,3,2.8,3c0.7,0,1.3-0.2,1.8-0.6
				c0.4-0.3,0.7-0.8,0.9-1.2L231.5,260.1z M230,256.9c-0.3-1.4-1.3-2.3-2.6-2.3c-1.3,0-2.4,1-2.6,2.3H230z"/>
			<path class="st2" d="M239.5,255.5c-0.2-0.5-0.7-0.9-1.2-0.9c-0.6,0-1.1,0.3-1.1,1c0,0.6,0.4,0.8,1.4,1.3c1.3,0.5,1.9,0.9,2.2,1.4
				c0.4,0.5,0.5,0.9,0.5,1.4c0,1.9-1.3,2.9-3.1,2.9c-0.4,0-2.3,0-3.1-2.3l1.3-0.6c0.2,0.5,0.7,1.5,1.8,1.5c1,0,1.5-0.7,1.5-1.4
				c0-0.8-0.6-1.1-1.4-1.5c-1.1-0.5-1.8-0.8-2.2-1.3c-0.3-0.4-0.4-0.9-0.4-1.3c0-1.6,1.1-2.5,2.6-2.5c0.5,0,1.7,0.1,2.4,1.6
				L239.5,255.5z"/>
			<path class="st2" d="M253.1,260.1c-0.3,0.5-0.6,1-1.1,1.4c-0.8,0.7-1.8,1.1-2.9,1.1c-2.1,0-4.4-1.3-4.4-4.6
				c0-2.6,1.6-4.7,4.3-4.7c1.7,0,2.8,0.9,3.4,1.6c0.6,0.8,0.9,2.2,0.8,3.3h-6.9c0,1.8,1.3,3,2.8,3c0.7,0,1.3-0.2,1.8-0.6
				c0.4-0.3,0.7-0.8,0.9-1.2L253.1,260.1z M251.6,256.9c-0.3-1.4-1.3-2.3-2.6-2.3s-2.4,1-2.6,2.3H251.6z"/>
			<path class="st2" d="M257.4,253.5h1.5v1c0.3-0.4,1.1-1.2,2.5-1.2c1,0,2,0.4,2.5,1.2c0.4,0.7,0.5,1.4,0.5,2.4v5.5H263v-5.4
				c0-0.5,0-1.2-0.4-1.6c-0.3-0.4-0.8-0.6-1.5-0.6c-0.5,0-1.1,0.1-1.6,0.7c-0.6,0.7-0.6,1.8-0.6,2.4v4.6h-1.5V253.5z"/>
			<path class="st2" d="M271,254.9v7.5h-1.5v-7.5h-0.9v-1.4h0.9v-3.2h1.5v3.2h1.5v1.4H271z"/>
			<path class="st2" d="M283.7,260.1c-0.3,0.5-0.6,1-1.1,1.4c-0.8,0.7-1.8,1.1-2.9,1.1c-2.1,0-4.4-1.3-4.4-4.6
				c0-2.6,1.6-4.7,4.3-4.7c1.7,0,2.8,0.9,3.4,1.6c0.6,0.8,0.9,2.2,0.8,3.3h-6.9c0,1.8,1.3,3,2.8,3c0.7,0,1.3-0.2,1.8-0.6
				c0.4-0.3,0.7-0.8,0.9-1.2L283.7,260.1z M282.2,256.9c-0.3-1.4-1.3-2.3-2.6-2.3c-1.3,0-2.4,1-2.6,2.3H282.2z"/>
			<path class="st2" d="M294.9,246.8h1.5v15.6h-1.5v-1.2c-0.5,0.7-1.5,1.5-3,1.5c-2.2,0-4.3-1.6-4.3-4.7c0-3.1,2-4.6,4.3-4.6
				c1.7,0,2.6,0.9,3,1.5V246.8z M289.1,257.9c0,1.9,1.1,3.3,2.9,3.3c1.9,0,2.9-1.6,2.9-3.3c0-2.3-1.6-3.3-2.9-3.3
				C290.5,254.6,289.1,255.7,289.1,257.9z"/>
			<path class="st2" d="M309.6,262.3h-1.5v-15.6h1.5v7.9c1-1.3,2.4-1.5,3-1.5c2.8,0,4.3,2.3,4.3,4.7c0,2.4-1.6,4.6-4.2,4.6
				c-1.4,0-2.4-0.6-3.1-1.5V262.3z M315.4,258c0-2.2-1.5-3.3-2.9-3.3c-1.4,0-2.9,1.2-2.9,3.3c0,1.8,1.2,3.3,3,3.3
				C314.3,261.2,315.4,259.7,315.4,258z"/>
			<path class="st2" d="M324,261.5l-4.1-8h1.8l3.1,6.3l2.9-6.3h1.7l-6.5,13.8h-1.7L324,261.5z"/>
		</g>
		<g class="st0">
			<path class="st2" d="M341.8,254.2l6.1-6.1h2.1l-6.7,6.6l6.9,7.6h-2.2l-5.8-6.5l-0.4,0.4v6.1h-1.6v-14.2h1.6V254.2z"/>
		</g>
		<g class="st0">
			<path class="st2" d="M352.5,257.9c0-2.7,2-4.7,4.7-4.7s4.7,2,4.7,4.7s-2,4.7-4.7,4.7S352.5,260.6,352.5,257.9z M354.1,257.9
				c0,2.2,1.5,3.3,3.1,3.3c1.6,0,3.1-1.1,3.1-3.3c0-2.2-1.5-3.3-3.1-3.3S354.1,255.8,354.1,257.9z"/>
		</g>
		<g class="st0">
			<path class="st2" d="M366.2,246.8h1.5v7.7c0.3-0.4,1.1-1.2,2.5-1.2c1,0,2,0.4,2.5,1.2c0.4,0.7,0.5,1.4,0.5,2.4v5.5h-1.5v-5.4
				c0-0.5,0-1.2-0.4-1.6c-0.3-0.4-0.8-0.6-1.5-0.6c-0.5,0-1.1,0.1-1.6,0.7c-0.6,0.7-0.6,1.8-0.6,2.4v4.6h-1.5V246.8z"/>
		</g>
		<g class="st0">
			<path class="st2" d="M385.8,260.1c-0.3,0.5-0.6,1-1.1,1.4c-0.8,0.7-1.8,1.1-2.9,1.1c-2.1,0-4.4-1.3-4.4-4.6
				c0-2.6,1.6-4.7,4.3-4.7c1.7,0,2.8,0.9,3.4,1.6c0.6,0.8,0.9,2.2,0.8,3.3h-6.9c0,1.8,1.3,3,2.8,3c0.7,0,1.3-0.2,1.8-0.6
				c0.4-0.3,0.7-0.8,0.9-1.2L385.8,260.1z M384.2,256.9c-0.3-1.4-1.3-2.3-2.6-2.3c-1.3,0-2.4,1-2.6,2.3H384.2z"/>
			<path class="st2" d="M390.9,249c0.6,0,1.1,0.5,1.1,1.1s-0.5,1.1-1.1,1.1s-1.1-0.5-1.1-1.1S390.3,249,390.9,249z M391.6,253.5v8.9
				h-1.5v-8.9H391.6z"/>
			<path class="st2" d="M414.7,257.1c-0.4,0.5-0.9,1.2-1.8,2.1l2.4,3.1h-2l-1.5-2c-1.2,1.2-3,2.2-4.6,2.2c-2.3,0-4.1-1.7-4.1-3.9
				c0-1.5,0.8-2.5,1.3-2.9c0.7-0.7,2.1-1.6,2.4-1.8c-1-1.2-1.4-2.1-1.4-3.1c0-1.5,1-3,3.1-3c2,0,3,1.4,3,2.9c0,0.7-0.2,1.6-1.3,2.6
				c-0.4,0.3-0.2,0.2-1.2,0.9l3,3.8c0.8-0.8,1.2-1.3,1.6-1.9L414.7,257.1z M407.6,255.1c-1,0.6-1.6,1.1-2,1.5c-0.4,0.4-1,0.9-1,2
				c0,1.4,1,2.5,2.5,2.5c1.5,0,3.1-1.5,3.7-2L407.6,255.1z M408,253.1l0.9-0.7c0.8-0.6,1-1.2,1-1.6c0-1-0.8-1.5-1.5-1.5
				c-0.9,0-1.6,0.7-1.6,1.6c0,0.6,0.3,1,0.6,1.4L408,253.1z"/>
			<path class="st2" d="M426.1,262.3v-14.8l11.1,11.6v-11h1.6V263l-11.1-11.6v11H426.1z"/>
			<path class="st2" d="M450.8,253.5h1.5v8.9h-1.5v-1.2c-0.5,0.7-1.5,1.5-3,1.5c-2.2,0-4.3-1.6-4.3-4.7c0-3.1,2-4.6,4.3-4.6
				c1.7,0,2.6,0.9,3,1.5V253.5z M445,257.9c0,1.9,1.1,3.3,2.9,3.3c1.9,0,2.9-1.6,2.9-3.3c0-2.3-1.6-3.3-2.9-3.3
				C446.4,254.6,445,255.7,445,257.9z"/>
			<path class="st2" d="M456.6,257.9c0-2.7,2-4.7,4.7-4.7s4.7,2,4.7,4.7s-2,4.7-4.7,4.7S456.6,260.6,456.6,257.9z M458.2,257.9
				c0,2.2,1.5,3.3,3.1,3.3c1.6,0,3.1-1.1,3.1-3.3c0-2.2-1.5-3.3-3.1-3.3S458.2,255.8,458.2,257.9z"/>
		</g>
		<g class="st0">
			<path class="st2" d="M471.8,246.8v10l3.2-3.3h2l-3.8,3.8l4.5,5.1h-2l-3.5-4l-0.4,0.4v3.7h-1.5v-15.6H471.8z"/>
		</g>
		<g class="st0">
			<path class="st2" d="M480.3,257.9c0-2.7,2-4.7,4.7-4.7s4.7,2,4.7,4.7s-2,4.7-4.7,4.7S480.3,260.6,480.3,257.9z M481.9,257.9
				c0,2.2,1.5,3.3,3.1,3.3c1.6,0,3.1-1.1,3.1-3.3c0-2.2-1.5-3.3-3.1-3.3S481.9,255.8,481.9,257.9z"/>
		</g>
	</g>
</g>
</svg>
