<?xml version="1.0" encoding="utf-8"?>
<!-- Generator: Adobe Illustrator 22.1.0, SVG Export Plug-In . SVG Version: 6.00 Build 0)  -->
<svg version="1.1" id="レイヤー_1" xmlns="http://www.w3.org/2000/svg" xmlns:xlink="http://www.w3.org/1999/xlink" x="0px"
	 y="0px" viewBox="0 0 628.8 188.7" style="enable-background:new 0 0 628.8 188.7;" xml:space="preserve">
<style type="text/css">
	.st0{enable-background:new    ;}
	.st1{fill:#D3A15F;}
</style>
<title>text_success_2</title>
<g id="レイヤー_2_1_">
	<g id="レイヤー_6">
		<g class="st0">
			<path class="st1" d="M81.7,15c-1.2,4-2.4,7.8-3.5,11.6c-1.2,3.8-2.3,7.6-3.5,11.3c-1.2,3.8-2.4,7.6-3.7,11.4
				c-1.2,3.8-2.5,7.8-3.8,11.9c-0.5,1.5-1.1,3.5-1.8,6.1c-0.7,2.5-1.5,5.5-2.5,8.7c-0.9,3.3-2,6.8-3.2,10.6
				c-1.2,3.8-2.4,7.7-3.8,11.7c-1.4,4-2.9,8-4.5,11.9c-1.6,4-3.4,7.8-5.2,11.4c-1.9,3.6-3.8,7-5.9,10.2c-2.1,3.1-4.3,5.8-6.6,8.1
				c-2.3,2.3-4.7,4-7.3,5.2c-2.5,1.2-5.2,1.8-8,1.6c-3.4-0.2-6.4-0.8-8.8-1.9c-2.5-1.1-4.5-2.8-6-5.3c-1.6-2.5-2.7-5.5-3.3-9
				c-0.3-1.3-0.3-2.3,0.1-3.1c0.4-0.8,1-1.3,1.7-1.5c0.7-0.2,1.4-0.1,2.2,0.4c0.8,0.5,1.3,1.3,1.7,2.6c0.1,1.2,0.4,2.5,0.8,3.8
				c0.5,1.3,1.1,2.4,1.9,3.2c2,2.1,4.1,3.1,6.2,3.2c2.1,0.1,4.2-0.6,6.2-2.1s4.1-3.5,6-6.2c2-2.7,3.9-5.8,5.8-9.3
				c1.9-3.5,3.7-7.2,5.5-11.2c1.7-4,3.4-8.1,4.9-12.2c1.5-4.1,3-8.1,4.3-12c1.3-3.9,2.5-7.5,3.5-10.7c1-3.2,1.9-6,2.6-8.4
				c0.7-2.4,1.2-4,1.5-5c1.4-4.3,2.7-8.6,4-12.7c1.3-4.1,2.6-8.2,3.8-12.2c1.2-4,2.5-8.1,3.7-12.1s2.5-8.2,3.7-12.5
				c-5.1-1.1-10.3-2.1-15.4-2.9S44.7,8.4,39.6,8.5c-3.4,0.1-6.4,0.5-9.2,1.2c-2.8,0.7-5.3,1.6-7.6,2.6c-2.3,1.1-4.3,2.3-6,3.6
				c-1.8,1.4-3.3,2.7-4.7,4.1c-1.6,2.1-2.7,4.1-3.3,6C8.2,28,7.9,29.9,8,31.6s0.5,3.4,1.2,4.8c0.7,1.5,1.6,2.7,2.7,3.8
				c1.5,1.5,3.1,2.4,4.9,2.9c1.8,0.5,3.6,0.6,5.5,0.3c1.8-0.3,3.6-0.8,5.3-1.7c1.7-0.8,3.3-1.8,4.6-2.9s2.4-2.3,3.2-3.6
				c0.8-1.3,1.2-2.5,1.2-3.7c0-1.2,0.3-2,0.8-2.4c0.5-0.4,1.1-0.6,1.8-0.5c0.6,0.1,1.2,0.4,1.8,0.9c0.5,0.5,0.8,1.2,0.8,2
				c0,1.5-0.3,2.9-1,4.4c-0.6,1.5-1.5,2.9-2.7,4.2c-1.1,1.3-2.5,2.6-4,3.7C32.6,45,31,46,29.2,46.8c-1.8,0.8-3.6,1.4-5.5,1.8
				C21.9,49,20,49.1,18.2,49c-1.9-0.1-3.6-0.5-5.4-1.3c-1.7-0.7-3.3-1.8-4.7-3.3c-2.3-2.3-3.8-4.9-4.6-7.7c-0.7-2.8-0.8-5.6-0.3-8.5
				c0.5-2.8,1.5-5.6,3.1-8.2c1.5-2.6,3.4-5,5.6-7c2-1.8,4.1-3.4,6.3-5c2.2-1.5,4.6-2.9,7.2-4.1c2.6-1.2,5.4-2.1,8.4-2.8
				c3-0.7,6.2-1.1,9.7-1.2c4-0.1,8,0.1,12,0.7c4,0.5,8.1,1.3,12.2,2.1c4.1,0.9,8.1,1.8,12.2,2.8c4.1,1,8.2,1.9,12.2,2.7
				c4,0.8,8.1,1.4,12.1,1.8c4,0.4,8,0.5,11.9,0.2c3.9-0.3,7.8-1.1,11.6-2.2c3.8-1.2,7.5-3,11.2-5.4c0.8-0.5,1.5-0.6,2.1-0.4
				c0.6,0.2,1.2,0.7,1.6,1.3c0.4,0.6,0.6,1.3,0.6,2.1c0,0.8-0.2,1.5-0.8,2c-3.2,2.4-6.5,4.3-9.7,5.8c-3.3,1.5-6.6,2.6-9.9,3.4
				c-3.3,0.8-6.7,1.3-10.1,1.4c-3.4,0.2-6.8,0.1-10.2-0.1C99,18,95.6,17.6,92.1,17C88.6,16.4,85.2,15.8,81.7,15z"/>
			<path class="st1" d="M85.2,100.8c-0.3,1.5-0.5,3-0.6,4.3c0.3-0.5,0.7-1.1,1.2-1.8c0.5-0.7,1.1-1.6,1.8-2.5
				c1.1-1.5,2.4-3.3,3.8-5.3c1.5-2,3-4,4.7-6c1.7-2,3.4-4,5.3-5.9c1.8-1.9,3.6-3.6,5.4-5.2c1.8-1.5,3.5-2.7,5.3-3.6
				c1.7-0.9,3.3-1.4,4.8-1.4c2.7,0,4.9,0.3,6.6,1c1.7,0.7,3,1.6,4,2.9c0.9,1.2,1.5,2.7,1.7,4.4c0.2,1.7,0.2,3.6-0.1,5.6
				c-0.3,2-0.8,4.2-1.5,6.5c-0.7,2.3-1.5,4.6-2.4,7c-0.8,2-1.6,4.1-2.5,6.1c-0.9,2.1-1.7,4.1-2.5,6.2c-0.8,2-1.6,4-2.4,6
				c-0.8,2-1.4,3.8-2,5.6c-0.8,2.3-1.3,4.4-1.6,6.4c-0.3,1.9-0.4,3.6-0.1,5.1c0.3,1.4,0.9,2.6,1.9,3.4c1,0.9,2.5,1.3,4.5,1.4
				c2.5,0,4.9-0.5,7.3-1.4c2.4-0.9,4.6-2,6.8-3.5c2.2-1.5,4.3-3.2,6.3-5.1c2-2,3.9-4.1,5.7-6.3c1.5-1.9,2.9-3.8,4.3-5.8
				c1.4-2,2.7-4,4-6.1c1.3-2.1,2.5-4.1,3.6-6.1c1.1-2,2.2-4,3.3-5.8c0.2-0.4,0.4-0.8,0.7-1.2c0.2-0.4,0.5-0.8,0.7-1.2
				c0.2-0.4,0.6-0.7,1.1-0.8c0.5-0.1,0.9-0.1,1.4-0.1c0.5,0.1,0.8,0.2,1.1,0.5c0.3,0.2,0.3,0.5,0.2,0.8c-0.2,0.4-0.3,0.7-0.5,1.1
				c-0.2,0.3-0.3,0.7-0.5,1.1c-1.8,3.8-3.9,7.8-6.3,11.9c-2.3,4.1-5,8.1-7.9,12c-2.1,2.8-4.4,5.5-6.8,7.9c-2.4,2.5-4.9,4.6-7.6,6.4
				c-2.7,1.8-5.5,3.2-8.5,4.2c-3,1-6.1,1.5-9.5,1.4c-3.5-0.1-6.3-0.7-8.4-1.9c-2.2-1.2-3.8-2.7-4.9-4.6c-1.1-1.9-1.8-4-2-6.3
				s-0.1-4.8,0.4-7.2c0.2-0.9,0.4-1.8,0.6-2.7c0.2-0.9,0.5-1.7,0.8-2.5c0.3-1.1,0.8-2.3,1.3-3.7c0.5-1.4,1.1-2.9,1.8-4.5
				c0.6-1.6,1.3-3.3,2.1-5.1c0.7-1.8,1.5-3.5,2.2-5.4c0.9-2.1,1.7-4.2,2.5-6.3c0.8-2.1,1.5-4,2.1-5.8c0.6-1.8,1.1-3.4,1.4-4.8
				c0.3-1.4,0.4-2.5,0.3-3.3c-0.2-1.8-0.9-3-2.2-3.4c-1.3-0.4-2.9,0-4.8,1.1c-1.5,0.9-3.1,2.2-4.8,3.8c-1.7,1.7-3.5,3.5-5.3,5.6
				c-1.8,2.1-3.6,4.2-5.3,6.5c-1.7,2.3-3.4,4.4-5,6.5c-1.1,1.5-2.1,2.9-3.1,4.2c-1,1.3-1.9,2.4-2.6,3.4c-0.8,1-1.5,1.7-2.1,2.3
				c-0.6,0.6-1,0.9-1.3,0.9c-0.7,0.1-1.5,0-2.3-0.2c-0.8-0.2-1.6-0.6-2.3-1.3c-0.7-0.7-1.3-1.7-1.7-3c-0.5-1.3-0.7-3-0.7-5.1v-1.1
				c0-1.7,0.2-3.5,0.6-5.6c0.3-2,0.8-4.2,1.4-6.5c0.6-2.3,1.2-4.8,2-7.3c0.8-2.6,1.7-5.2,2.6-7.9c1.2-3.3,2.5-6.7,3.8-10.2
				c1.4-3.4,2.8-6.9,4.4-10.3c0.4-0.9,0.7-1.8,1.1-2.6c0.4-0.9,0.7-1.7,1.2-2.5c1.9-4.3,4-8.4,6.3-12.5c2.2-4,4.5-7.8,6.9-11.4
				c2.4-3.5,4.7-6.8,7.1-9.7c2.4-3,4.7-5.5,7-7.6c2.3-2.1,4.5-3.7,6.6-4.9c2.1-1.2,4-1.8,5.8-1.8h0.1c1.7,0,3.2,0.6,4.5,1.9
				c1.2,0.9,2.2,2.2,2.9,3.8c0.3,0.7,0.6,1.5,0.9,2.4c0.3,0.9,0.5,1.9,0.6,3.1c0.1,1.1,0.1,2.4,0.1,3.8c-0.1,1.4-0.3,2.9-0.6,4.6
				c-1.1,5.5-3.7,11-7.7,16.6c-4,5.6-9.2,11.2-15.6,16.7c-3.1,2.6-6.4,5.2-9.8,7.8c-3.5,2.6-7.1,5.1-11.1,7.6
				c-0.3,0.9-0.6,1.8-0.9,2.6s-0.6,1.7-0.9,2.5c-1.1,2.7-2.1,5.3-3.1,7.8c-1,2.5-1.9,4.8-2.8,7.1c-0.9,2.3-1.6,4.4-2.3,6.5
				C86.1,96.9,85.6,98.9,85.2,100.8z M103.6,53c-1.2,2.5-2.3,4.6-3.1,6.3c-0.8,1.7-1.3,2.9-1.5,3.5c1.7-1.1,3.7-2.5,5.8-4.2
				c2.2-1.7,4.5-3.5,7-5.6c2.4-2.1,4.9-4.3,7.4-6.8c2.5-2.4,4.8-5,7-7.6c2.2-2.6,4.2-5.3,6-8.1c1.8-2.8,3.2-5.5,4.2-8.3
				c1-2.8,1.6-5.5,1.7-8.3c0.1-2.7-0.4-5.3-1.5-7.9c-0.8-0.4-1.8-0.4-2.9,0.3s-2.4,1.6-3.7,3c-1.4,1.4-2.8,3.2-4.4,5.3
				c-1.5,2.1-3.1,4.4-4.7,6.9c-1.6,2.5-3.2,5.1-4.8,7.9c-1.6,2.8-3.1,5.5-4.6,8.3c-1.5,2.8-2.9,5.4-4.3,8
				C105.8,48.4,104.6,50.8,103.6,53z"/>
			<path class="st1" d="M194.7,84.2c0.4-0.9,0.8-1.8,1.2-2.7c0.3-0.7,0.7-1.5,1.1-2.2c0.4-0.8,0.7-1.4,1.1-1.9
				c0.3-0.4,0.7-0.8,1.2-1c0.5-0.2,1.1-0.4,1.7-0.5c0.6-0.1,1.3-0.1,1.9,0c0.7,0.1,1.3,0.2,2,0.4c0.6,0.2,1.2,0.5,1.7,0.9
				c0.5,0.5,0.9,1,1.2,1.5c0.3,0.5,0.5,1.1,0.5,1.7c0.1,0.6,0,1-0.3,1.4c-1.6,2.7-3.2,5.4-4.7,7.9c-1.6,2.5-2.9,5.1-4,7.7
				c-1.1,2.6-1.8,5.4-2.2,8.3c-0.3,2.9-0.1,6,0.9,9.4c0.5,1.8,1.2,3.2,2.3,4.1c1.1,1,2.3,1.7,3.7,2.1c1.4,0.4,2.8,0.5,4.4,0.4
				c1.5-0.1,3-0.4,4.5-0.8c1.2-0.3,2.4-0.9,3.8-1.7c1.4-0.8,2.8-1.8,4.2-2.9c1.4-1.1,2.8-2.4,4.1-3.7c1.3-1.3,2.6-2.7,3.7-4.1
				c1.1-1.4,2.1-2.7,3-4c0.8-1.3,1.4-2.5,1.8-3.6c0.1-0.4,0.4-0.8,0.9-1c0.4-0.2,0.9-0.3,1.4-0.2c0.5,0.1,0.9,0.2,1.2,0.5
				c0.3,0.3,0.5,0.7,0.5,1.3c0,0.5-0.3,1.2-0.9,2.2c-0.6,1-1.3,2-2.2,3.2c-0.9,1.2-2,2.4-3.2,3.7c-1.2,1.3-2.4,2.6-3.6,3.8
				c-1.2,1.2-2.5,2.3-3.7,3.4s-2.3,1.8-3.3,2.5c-1.5,1-2.8,1.7-3.8,2.3c-1,0.6-2.1,1-3.3,1.3c-1.1,0.3-2.4,0.5-3.9,0.6
				c-1.5,0.1-3.3,0.2-5.7,0.2c-1.7,0-3.4-0.3-5-0.8c-1.6-0.5-3.1-1.3-4.5-2.2c-1.4-1-2.6-2.1-3.7-3.4c-1.1-1.3-2-2.7-2.7-4.3
				c-1.1-2.3-1.8-4.8-1.9-7.5c-0.1-2.7,0.5-5.4,1.8-8.1c-0.5,0.4-1.2,1-2.2,1.9c-1,0.9-2.3,1.9-3.7,2.8c-1.5,0.9-3.2,1.8-5.2,2.5
				c-2,0.7-4.2,1.1-6.6,1.1c-1.6,0-3-0.4-4.3-1.3c-1.3-0.9-2.3-2-3.2-3.3c-0.9-1.3-1.5-2.9-1.8-4.5c-0.4-1.7-0.5-3.3-0.3-4.9
				c0.1-1.1,0.4-2.3,0.8-3.6c0.4-1.3,1-2.7,1.7-4.1c0.7-1.4,1.6-2.8,2.6-4.1c1-1.3,2.2-2.6,3.6-3.6c1.4-1.1,2.9-1.9,4.6-2.6
				c1.7-0.7,3.6-1.1,5.7-1.2c1.4,0,2.7,0.1,3.9,0.4c1.2,0.3,2.3,0.7,3.2,1.2c1,0.5,1.8,1.1,2.6,1.7c0.8,0.6,1.5,1.3,2.1,2
				C192.7,80.3,193.8,82.2,194.7,84.2z M182.8,79.9c-1.9,0.9-3.7,2-5.1,3.4c-1.5,1.4-2.7,2.9-3.7,4.4c-1,1.6-1.7,3.2-2.2,4.7
				c-0.5,1.6-0.6,3-0.6,4.3c0.1,1.3,0.5,2.3,1.1,3.1c0.6,0.8,1.6,1.2,2.8,1.2c1.2-0.1,2.4-0.5,3.7-1.1c1.2-0.6,2.5-1.3,3.7-2.1
				s2.5-1.7,3.7-2.7c1.2-1,2.5-1.9,3.7-2.9c0.3-0.8,0.5-1.6,0.6-2.6c0.1-1,0-2-0.2-3c-0.2-1-0.5-2-1-2.9c-0.4-0.9-1-1.7-1.6-2.4
				c-0.6-0.7-1.4-1.2-2.2-1.5C184.7,79.8,183.8,79.7,182.8,79.9z"/>
			<path class="st1" d="M248.5,73.5c0.5,0,1,0.1,1.4,0.3c0.4,0.2,0.8,0.5,1.1,0.8s0.5,0.6,0.7,1c0.2,0.4,0.2,0.7,0.3,1
				c0,0.4-0.1,0.7-0.2,0.9c-0.1,0.3-0.3,0.5-0.4,0.8c-0.4,0.8-0.8,1.9-1.4,3.2c-0.5,1.3-1.1,2.7-1.8,4.4c-0.6,1.6-1.3,3.4-1.9,5.3
				c-0.7,1.9-1.3,3.9-2,6c0.7-1.1,1.5-2.4,2.5-4c0.9-1.6,1.9-3.2,3-4.9c1.1-1.7,2.2-3.4,3.4-5.2c1.2-1.7,2.5-3.3,3.8-4.7
				c1.3-1.4,2.7-2.5,4.2-3.4c1.5-0.9,3-1.4,4.5-1.5c2.5-0.1,4.5,0.2,5.9,1.1c1.4,0.9,2.4,2.1,3,3.7c0.6,1.6,0.8,3.6,0.7,5.8
				c-0.1,2.2-0.4,4.7-1,7.3c-0.5,2.6-1.2,5.3-2,8.2c-0.8,2.8-1.6,5.7-2.3,8.5c-0.8,2.8-1.5,5.5-2.1,8.2c-0.6,2.6-1,5.1-1.2,7.3
				c-0.2,2.2,0,4.2,0.4,5.8c0.4,1.7,1.3,2.9,2.6,3.8c1.5,1,3.1,1.3,4.9,0.8c1.7-0.4,3.5-1.3,5.3-2.6c1.8-1.3,3.5-2.9,5.3-4.8
				c1.7-1.9,3.3-3.9,4.8-5.8c1.5-2,2.8-3.8,4-5.6c1.2-1.7,2.1-3.1,2.8-4.1c1.1-1.6,2.2-3.3,3.2-5c1-1.7,2-3.4,2.9-5
				c0.8-1.4,1.6-2.2,2.2-2.5c0.6-0.3,1.2-0.4,1.6-0.1c0.4,0.2,0.7,0.6,0.8,1.2c0.2,0.6,0.1,1.1,0,1.5c-0.9,1.5-1.8,3.2-2.8,4.9
				c-1,1.7-2,3.4-3,5c-1,1.5-2.2,3.3-3.5,5.3c-1.3,2-2.7,4.1-4.3,6.2c-1.5,2.1-3.2,4.1-4.9,6.1c-1.7,2-3.5,3.8-5.3,5.3
				c-1.8,1.5-3.6,2.7-5.4,3.5c-1.8,0.9-3.6,1.2-5.3,1c-3.8-0.4-6.9-1.3-9.1-2.7c-2.3-1.4-3.9-3.1-5-5.2c-1.1-2.1-1.7-4.4-1.8-7
				c-0.1-2.6,0.1-5.3,0.5-8.2c0.5-2.9,1.2-5.7,2.1-8.7c0.9-2.9,1.8-5.8,2.7-8.5c0.9-2.7,1.8-5.3,2.5-7.6c0.8-2.4,1.2-4.4,1.5-6.1
				c0.2-1.7,0.1-3-0.4-3.9c-0.5-0.9-1.6-1.3-3.2-1.1c-1,0.1-2.1,0.7-3.3,1.8c-1.2,1.1-2.5,2.5-3.9,4.3c-1.4,1.7-2.8,3.7-4.3,6
				c-1.5,2.2-2.9,4.6-4.4,6.9c-0.7,1.2-1.5,2.7-2.5,4.5c-0.9,1.8-1.8,3.6-2.7,5.6c-0.9,2-1.6,4-2.3,6.2c-0.7,2.1-1.1,4.1-1.2,6.1
				c0,0.5-0.1,0.9-0.3,1.4c-0.2,0.5-0.5,0.9-0.8,1.3c-0.3,0.4-0.7,0.7-1.2,1c-0.5,0.3-0.9,0.4-1.5,0.4H234c-1.5,0-2.6-0.7-3.2-2.1
				c-0.6-1.4-0.9-3.2-0.8-5.4c0.1-2.2,0.4-4.7,1.1-7.6c0.6-2.8,1.4-5.7,2.3-8.7c0.9-2.8,1.8-5.6,2.8-8.3c1-2.7,2-5.3,2.9-7.6
				c0.9-2.3,1.8-4.3,2.6-6c0.8-1.7,1.3-2.9,1.7-3.6c0.5-0.8,1.2-1.3,2.2-1.6C246.6,73.7,247.5,73.5,248.5,73.5z"/>
			<path class="st1" d="M324.2,68.4c-0.3,0.9-0.6,1.7-0.9,2.6s-0.6,1.7-0.9,2.6c-0.6,1.4-1.1,2.8-1.7,4.2c-0.5,1.4-1.1,2.7-1.6,4
				c0.9-1,1.9-2,2.9-2.9c1-0.9,2-1.7,3-2.5c1-0.7,2-1.3,3-1.8c1-0.5,2-0.8,2.9-1c0.6-0.1,1.1-0.2,1.6-0.2c0.5,0,1,0,1.5,0.2
				c0.8,0.2,1.5,0.5,2.2,0.9c0.7,0.5,1.4,1.1,2,2c1.3,2.1,1.8,4.4,1.7,6.7c-0.1,2.4-0.7,4.7-1.8,6.9c-1.1,2.2-2.5,4.3-4.3,6.2
				c-1.8,1.9-3.7,3.4-5.8,4.6c0,3.1,0.1,6.3,0.3,9.5c0.2,3.2,0.6,6.2,1.1,9.2c0.5,3,1.1,5.7,1.9,8.3c0.8,2.6,1.7,4.8,2.7,6.7
				c1.1,1.9,2.3,3.4,3.6,4.6c1.4,1.1,2.9,1.7,4.6,1.7c2.1,0.1,4.1-0.3,5.9-1.1c1.8-0.8,3.6-1.8,5.2-3.2c1.6-1.4,3.1-3,4.4-4.9
				c1.3-1.9,2.6-3.9,3.7-6c1.1-2.1,2.2-4.3,3.2-6.6c1-2.3,1.8-4.5,2.6-6.7c0.8-2.2,1.5-4.3,2.1-6.3c0.6-2,1.2-3.7,1.7-5.3
				c0.2-0.8,0.5-1.3,1-1.6c0.5-0.3,1.1-0.5,1.6-0.5c0.6,0,1.1,0.2,1.6,0.6c0.5,0.4,0.9,0.9,1.2,1.6c-0.5,1.8-1.1,3.6-1.7,5.6
				c-0.6,2-1.3,4-2,6s-1.5,4.1-2.3,6.2c-0.8,2.1-1.7,4.1-2.6,6.1c-1.4,2.9-2.9,5.6-4.4,8.1c-1.5,2.5-3.3,4.8-5.4,6.7
				c-2.1,1.9-4.5,3.4-7.3,4.5c-2.8,1.1-6.1,1.7-10,1.7c-3.4,0.1-6.3-0.6-8.8-2c-2.4-1.4-4.5-3.3-6.2-5.6c-1.7-2.3-3-5-4-8.1
				c-1-3-1.7-6.2-2.3-9.4c-0.5-3.2-0.8-6.3-1-9.5c-0.2-3.1-0.2-5.9-0.2-8.5c-0.9-0.2-1.8-0.4-2.6-0.6c-0.9-0.3-1.7-0.5-2.4-0.8
				c-0.5,2.6-0.9,5.1-1.3,7.5c-0.4,2.4-0.6,4.4-0.8,5.9c-0.1,0.7-0.1,1.6-0.1,2.7c0,1.1,0,2.2-0.1,3.3c-0.1,1.1-0.2,2-0.5,2.8
				c-0.3,0.8-0.7,1.2-1.4,1.2c-1.3,0-2.5-0.1-3.5-0.3c-1-0.2-1.8-0.6-2.4-1.3c-0.6-0.7-1.1-1.6-1.4-2.9c-0.3-1.3-0.5-3-0.5-5.1
				c0-1.4,0-2.9,0.1-4.3c0.1-1.5,0.2-2.9,0.3-4.5c0.1-0.9,0.2-1.8,0.3-2.7c0.1-0.9,0.2-1.8,0.4-2.7c0.1-0.2,0.1-0.3,0.1-0.5
				s0-0.3,0.1-0.4c0.7-4.4,1.6-8.9,2.8-13.3c1.2-4.4,2.5-8.9,4-13.2c1.2-3.7,2.5-7.2,3.9-10.6c1.3-3.4,2.7-6.7,4.1-9.9
				c0.4-0.9,0.8-1.8,1.2-2.6c0.4-0.8,0.8-1.7,1.2-2.5c1.9-4.2,4-8.3,6.2-12.3c2.2-4,4.5-7.7,6.8-11.3c2.3-3.5,4.7-6.7,7-9.7
				c2.4-2.9,4.7-5.5,6.9-7.6c2.3-2.1,4.4-3.8,6.5-5c2.1-1.2,4-1.9,5.7-2h0.9c0.8,0.1,1.5,0.3,2.2,0.6c0.7,0.3,1.3,0.8,1.9,1.4
				c1.2,0.9,2.2,2.2,2.9,3.8c0.3,0.7,0.6,1.5,0.9,2.4c0.3,0.9,0.5,1.9,0.6,3.1c0.1,1.1,0.1,2.4,0.1,3.8c-0.1,1.4-0.3,2.9-0.6,4.6
				c-0.9,4.6-2.9,9.3-6,14c-3.1,4.7-7,9.4-11.8,14.2c-0.9,0.8-1.8,1.7-2.8,2.5s-1.9,1.7-2.9,2.6c-3,2.6-6.3,5.2-9.7,7.8
				C331.8,63.4,328.2,65.9,324.2,68.4z M315.7,91c-0.2,0.8-0.4,1.7-0.6,2.6c-0.2,0.9-0.4,1.9-0.6,2.9c0.8,0.6,1.8,1,3,0.9
				c1.2,0,2.5-0.3,3.9-0.9c1.4-0.6,2.8-1.4,4.2-2.5c1.4-1.1,2.7-2.3,3.9-3.7c1.2-1.4,2.2-3,3.1-4.6c0.9-1.7,1.4-3.4,1.7-5.2
				c0.3-1.9,0.1-3.2-0.4-3.8c-0.5-0.6-1.4-0.8-2.4-0.5c-1.1,0.3-2.3,1-3.7,2.1c-1.4,1.1-2.9,2.3-4.4,3.7c-1.5,1.4-2.9,2.9-4.2,4.5
				C317.8,88.1,316.6,89.6,315.7,91z M326.4,62.8c1.6-1.1,3.6-2.5,5.8-4.2c2.2-1.7,4.5-3.5,6.9-5.6c1.9-1.6,3.8-3.3,5.7-5.1
				c2.2-2.1,4.3-4.2,6.3-6.4c2.1-2.2,4-4.5,5.7-6.9c1.7-2.4,3.3-4.8,4.6-7.2c1.3-2.4,2.3-4.8,3.1-7.3c0.7-2.4,1-4.8,1-7.1
				c0-2.3-0.5-4.6-1.5-6.8c-1-0.5-2.2-0.3-3.7,0.7c-1.5,1-3,2.5-4.8,4.6c-1.7,2.1-3.6,4.6-5.5,7.5c-1.9,2.9-3.9,6-5.8,9.3
				c-1.9,3.3-3.8,6.6-5.6,10c-1.8,3.4-3.5,6.6-5,9.6c-0.5,0.9-0.9,1.8-1.4,2.6c-0.4,0.9-0.8,1.7-1.2,2.5c-1.2,2.5-2.3,4.5-3.1,6.3
				C327.1,61,326.6,62.2,326.4,62.8z"/>
			<path class="st1" d="M432.9,101c-0.8,2.4-1.5,4.7-2.1,6.9c-0.6,2.2-1,4.1-1.1,5.8c-0.2,1.7-0.1,3,0.3,3.9c0.3,1,1.1,1.4,2.2,1.3
				c1,0,2.1-0.6,3.4-1.6c1.3-1,2.7-2.4,4.2-4c1.5-1.7,3.1-3.6,4.7-5.7c1.6-2.2,3.2-4.4,4.8-6.7c2.4-3.7,4.9-7.6,7.5-11.8
				c2.6-4.2,5-8.8,7.2-13.7c0.3-0.5,0.7-0.9,1.4-1.3c0.6-0.3,1.3-0.6,2.1-0.7h1.4c0.5,0,1.1,0.1,1.5,0.4c0.5,0.2,0.8,0.6,1.1,0.9
				c0.3,0.4,0.5,0.8,0.6,1.3c0.1,0.5,0.1,0.9,0,1.4c-0.2,0.8-0.5,2-1.1,3.6c-0.6,1.6-1.3,3.5-2.1,5.6c-0.8,2.1-1.7,4.4-2.7,6.9
				c-1,2.5-2,4.9-3,7.4c-0.9,2.1-1.7,4.2-2.6,6.2c-0.8,2-1.6,3.9-2.3,5.7c-0.7,1.8-1.3,3.3-1.9,4.7c-0.5,1.4-1,2.5-1.3,3.4
				c3.9-1.9,7.6-3.6,11.1-5.1s6.8-2.9,9.9-4.4s6.1-3,8.9-4.6c2.8-1.6,5.5-3.6,8.1-5.9h0.1c0.5-0.5,1.2-1,1.9-1.2
				c0.7-0.3,1.3-0.4,1.9-0.4c0.6,0,1,0.2,1.4,0.4c0.4,0.3,0.5,0.7,0.4,1.2c0,0.5-0.4,1.3-1.3,2.2c-1.7,1.6-3.6,3.1-5.8,4.6
				c-2.2,1.5-4.6,2.9-7,4.2c-2.5,1.3-5.1,2.6-7.7,3.8c-2.6,1.2-5.2,2.4-7.7,3.4c-2.5,1.1-4.9,2.1-7.2,3c-2.3,0.9-4.3,1.8-6,2.6
				l-2.1,1c-0.5,1.5-1.1,3.2-1.7,5c-0.6,1.8-1.3,3.8-2,5.9c-0.7,2.1-1.5,4.3-2.3,6.6c-0.8,2.3-1.7,4.7-2.7,7c-1.2,3-2.5,6.1-3.9,9.2
				c-1.4,3.1-2.9,6-4.5,8.8c-1.6,2.8-3.3,5.5-5.2,7.9c-1.8,2.4-3.8,4.6-5.9,6.4c-2.1,1.8-4.3,3.2-6.6,4.3c-2.3,1.1-4.8,1.6-7.3,1.6
				c-2.7,0-5-0.5-6.8-1.5c-1.8-1-3.2-2.5-4.2-4.3c-1-1.8-1.5-4-1.6-6.5c-0.1-2.5,0.2-5.2,1-8c0.7-2.8,1.9-5.8,3.5-8.8
				c1.6-3.1,3.5-6.1,5.9-9c0.5-0.6,1-1.2,1.5-1.7c0.5-0.6,1-1.2,1.6-1.7c2.3-2.5,4.6-4.7,6.9-6.6c2.4-1.9,4.8-3.7,7.4-5.4
				s5.2-3.2,7.9-4.6c2.7-1.4,5.6-2.9,8.6-4.3l0.4-1.2c0.2-0.6,0.6-1.7,1.2-3.2c0.6-1.5,1.2-3.3,2-5.5c0.8-2.1,1.6-4.5,2.5-7
				c0.9-2.5,1.9-5.2,2.9-7.8c-0.5,0.8-0.9,1.4-1.3,2c-0.3,0.5-0.6,0.9-0.7,1.1l0.1-0.2c0,0-0.3,0.5-0.9,1.5c-0.6,1-1.4,2.3-2.4,3.8
				c-1,1.5-2.2,3.2-3.6,5c-1.4,1.8-2.8,3.5-4.2,5c-1.5,1.5-3,2.8-4.5,3.8c-1.5,1-3,1.5-4.4,1.5c-1.8,0-3.4-0.2-4.7-0.7
				c-1.3-0.5-2.4-1.2-3.2-2.1s-1.4-2-1.9-3.3c-0.4-1.3-0.7-2.7-0.7-4.2c-0.2-1.9-0.1-4,0.3-6.2c0.4-2.2,0.8-4.6,1.5-7
				c0.1,0,0.1-0.1,0.1-0.2c0.5-2,1.2-4,1.9-6.1c0.7-2,1.5-4,2.3-5.9c0.8-1.9,1.6-3.8,2.5-5.5s1.6-3.3,2.4-4.8
				c0.4-0.8,0.9-1.5,1.3-2.2c0.4-0.6,0.9-1.2,1.4-1.6c0.5-0.4,1.2-0.8,1.9-1c0.7-0.2,1.6-0.3,2.7-0.3c0.5,0,1,0.1,1.5,0.3
				c0.4,0.2,0.8,0.5,1.1,0.8c0.3,0.3,0.5,0.7,0.7,1.1c0.2,0.4,0.3,0.7,0.3,1.1c0,0.1-0.3,0.9-0.9,2.4c-0.6,1.5-1.4,3.3-2.4,5.6
				c-0.9,2.3-2,4.9-3.1,7.7C434.9,95.3,433.9,98.1,432.9,101z M415.2,150.4c-2.7,3-4.9,6-6.5,9c-1.7,3-2.9,5.7-3.6,8.3
				c-0.7,2.5-1.1,4.8-0.9,6.8c0.1,2,0.6,3.6,1.4,4.8c0.8,1.2,1.9,1.9,3.4,2.1c1.4,0.2,3.1-0.3,5.1-1.4c2.3-1.3,4.4-3.1,6.4-5.2
				c2-2.1,3.8-4.5,5.5-7.1c1.7-2.6,3.3-5.4,4.7-8.3c1.5-2.9,2.8-5.9,4-8.9c1.4-3.5,2.7-6.8,3.8-10.1c1.2-3.3,2.2-6.2,3.2-8.9
				c-6,2.8-11.2,5.8-15.5,9C421.9,143.7,418.2,147,415.2,150.4z"/>
			<path class="st1" d="M506.4,124.7c-2.7,0-5-0.6-6.8-1.7c-1.8-1.2-3.3-2.7-4.3-4.6c-1.1-1.9-1.8-4-2.2-6.4
				c-0.4-2.4-0.5-4.8-0.2-7.3c0.2-2.5,0.7-4.9,1.5-7.2c0.8-2.3,1.7-4.4,2.9-6.1c-0.3-1.5-0.4-2.9-0.2-4.4c0.2-1.5,0.6-2.9,1.3-4.3
				c0.7-1.4,1.7-2.7,3.1-3.9s3-2.4,5-3.4c2.5-1.3,5.1-2.1,7.6-2.4c2.5-0.2,5,0,7.2,0.7c2.3,0.7,4.3,1.8,6.2,3.3
				c1.8,1.5,3.3,3.4,4.5,5.6c1.1,2.2,1.9,4.7,2.2,7.5c0.3,2.8,0.1,5.8-0.7,9c-0.6,2.3-1.4,4.5-2.4,6.7c-1,2.2-2.2,4.2-3.5,6
				c0.4,0.1,1.2,0.2,2.1,0.3c1,0.1,2.1,0.2,3.4,0.2c1.3,0.1,2.8,0.1,4.3,0c1.6-0.1,3.1-0.2,4.7-0.5c1.6-0.3,3.2-0.6,4.8-1.2
				c1.6-0.5,3.1-1.2,4.4-2.1c1.4-0.9,2.6-1.9,3.7-3.2c1.1-1.3,1.9-2.8,2.5-4.6c0.1-0.5,0.4-0.9,0.7-1.1c0.4-0.2,0.7-0.3,1.1-0.3
				c0.4,0,0.7,0.2,1.1,0.4c0.3,0.2,0.5,0.6,0.5,1c-0.6,2.8-1.8,5.1-3.5,7c-1.7,1.8-3.7,3.3-5.9,4.4c-2.3,1.1-4.7,1.9-7.3,2.4
				s-5.1,0.8-7.6,0.9s-4.7,0.1-6.8-0.1c-2.1-0.2-3.7-0.3-4.8-0.5c-1.2,1.2-2.5,2.4-3.9,3.6c-1.4,1.2-3,2.2-4.6,3.1
				c-1.6,0.9-3.3,1.6-5,2.2C509.9,124.5,508.2,124.7,506.4,124.7z M500.5,88c1.4-1.8,2.6-3.1,3.7-3.8c1.1-0.7,2.1-1,3-1
				c0.5,0,1.1,0.2,1.6,0.6c0.5,0.4,0.9,0.9,1.2,1.4c0.3,0.5,0.5,1.1,0.6,1.6c0.1,0.5,0.1,0.9,0,1.2c-0.3,0.5-0.7,1.2-1.3,2.1
				c-0.5,0.9-1.1,2-1.6,3c-0.6,1.1-1.1,2.2-1.6,3.3c-0.5,1.1-0.9,2-1.2,2.7c1.2,1.4,2.5,2.7,4,4c1.5,1.3,3.1,2.5,4.8,3.5
				c1.7,1.1,3.4,2,5.1,2.7c1.7,0.8,3.4,1.3,5.1,1.7c1.4-1.8,2.7-3.8,3.8-6c1.1-2.2,1.9-4.5,2.6-6.9c0.6-2.7,0.9-5.2,0.6-7.5
				c-0.2-2.3-0.8-4.4-1.7-6.3c-0.9-1.8-2.1-3.4-3.6-4.7c-1.5-1.3-3.2-2.2-5-2.8c-1.9-0.6-3.8-0.7-5.9-0.5c-2.1,0.2-4.2,0.9-6.3,1.9
				c-2.6,1.3-4.4,2.8-5.6,4.4C501.3,84.5,500.7,86.2,500.5,88z M503.6,102.9c-0.5,1.8-0.9,3.6-1.1,5.5c-0.2,1.8-0.2,3.5,0.1,5.1
				c0.3,1.5,0.8,2.9,1.6,4c0.8,1.1,2.1,1.9,3.7,2.4c1.3,0.4,2.6,0.5,3.8,0.3c1.2-0.2,2.4-0.6,3.5-1.2c1.1-0.6,2.1-1.3,3.2-2.2
				c1-0.9,2-1.7,2.8-2.6c-1.6-0.4-3.1-1-4.7-1.7c-1.6-0.7-3.1-1.6-4.6-2.5c-1.5-1-3-2-4.4-3.2C506,105.4,504.7,104.2,503.6,102.9z"
				/>
			<path class="st1" d="M601.1,84.5c0.1,0.9-0.1,2.3-0.5,4.1c-0.4,1.8-1,3.8-1.7,5.9c-0.7,2.2-1.3,4.5-2,6.9c-0.7,2.4-1.1,4.8-1.4,7
				c-0.3,2.2-0.3,4.3-0.1,6.1c0.3,1.8,1,3.2,2.2,4.2c1.1,0.9,2.4,1.3,4.1,1.2c1.7-0.1,3.5-0.6,5.4-1.4c1.9-0.8,3.8-1.9,5.8-3.3
				c1.9-1.4,3.7-2.9,5.4-4.5c1.6-1.6,3-3.3,4.2-5c1.2-1.7,1.9-3.3,2.3-4.8c0.4-0.4,0.8-0.8,1.2-0.9c0.4-0.2,0.9-0.2,1.3-0.2
				c0.4,0.1,0.8,0.2,1.1,0.4c0.3,0.2,0.5,0.4,0.5,0.7c-0.9,1.9-1.9,3.8-3.2,5.7c-1.3,1.9-2.7,3.8-4.3,5.5c-1.6,1.8-3.3,3.4-5.2,4.9
				c-1.8,1.5-3.8,2.8-5.7,4c-2,1.1-4,2-6,2.7c-2.1,0.7-4.1,1-6,1c-3,0-5.5-0.6-7.4-1.7c-1.9-1.1-3.3-2.7-4.3-4.6s-1.4-4.2-1.4-6.7
				c0-2.5,0.4-5.2,1.1-7.9c-1.3,2.3-2.8,4.7-4.5,7.2c-1.7,2.5-3.4,4.7-5.1,6.8c-1.8,2.1-3.5,3.7-5.3,5c-1.8,1.3-3.5,2-5,2
				c-2,0-3.6-0.3-5-0.9c-1.4-0.6-2.4-1.4-3.3-2.5c-0.8-1.1-1.4-2.4-1.8-3.8c-0.4-1.5-0.5-3.1-0.5-4.9c0-1.8,0.2-3.6,0.6-5.6
				c0.4-2,0.8-4,1.4-6c0.5-2,1.2-4,1.9-6.1c0.7-2,1.5-4,2.3-5.9c0.8-1.9,1.6-3.7,2.4-5.5s1.6-3.3,2.4-4.8c0.4-0.9,0.9-1.6,1.3-2.3
				c0.4-0.6,0.9-1.2,1.5-1.6c0.6-0.4,1.2-0.8,2-1c0.8-0.2,1.7-0.3,2.8-0.3c0.5,0,1,0.1,1.4,0.3c0.4,0.2,0.8,0.5,1.1,0.8
				s0.6,0.6,0.7,1c0.2,0.4,0.3,0.7,0.4,1c0,0.1-0.1,0.5-0.4,1.2c-0.3,0.7-0.7,1.6-1.2,2.8c-0.5,1.2-1.1,2.5-1.7,4.1
				c-0.6,1.6-1.3,3.2-2,5c-0.7,1.8-1.4,3.6-2.1,5.5c-0.7,1.9-1.4,3.8-2,5.7c-0.8,2.4-1.5,4.7-2.1,6.9c-0.6,2.2-1,4.1-1.1,5.8
				c-0.2,1.7-0.1,3,0.3,4c0.3,1,1.1,1.5,2.2,1.4c1,0,2.1-0.6,3.4-1.6c1.3-1,2.7-2.4,4.2-4c1.5-1.7,3.1-3.6,4.7-5.7
				c1.6-2.2,3.2-4.4,4.8-6.7c0.7-1.1,1.4-2.3,2.1-3.8c0.7-1.5,1.4-3,2.1-4.7c0.7-1.6,1.4-3.2,2.2-4.8c0.7-1.6,1.5-3.1,2.3-4.4
				c0.4-0.8,1.1-1.3,2.1-1.6c1-0.2,1.9-0.4,2.8-0.4c0.5,0,1,0.1,1.4,0.3c0.4,0.2,0.7,0.5,0.9,0.8c0.2,0.3,0.4,0.7,0.5,1.1
				S601,84.2,601.1,84.5z"/>
		</g>
	</g>
</g>
</svg>
