<?xml version="1.0" encoding="utf-8"?>
<!-- Generator: Adobe Illustrator 22.1.0, SVG Export Plug-In . SVG Version: 6.00 Build 0)  -->
<svg version="1.1" id="レイヤー_1" xmlns="http://www.w3.org/2000/svg" xmlns:xlink="http://www.w3.org/1999/xlink" x="0px"
	 y="0px" viewBox="0 0 128.7 30.1" style="enable-background:new 0 0 128.7 30.1;" xml:space="preserve">
<style type="text/css">
	.st0{enable-background:new    ;}
	.st1{fill:#131B2D;}
</style>
<title>btn_s_text_top</title>
<g id="レイヤー_2_1_">
	<g id="レイヤー_7">
		<g class="st0">
			<path class="st1" d="M7,21.8c0.1-2,0.1-5.8,0.1-9.2c0-2.3,0-4.4-0.1-5.8C7,6.2,7,6.2,5.4,6.2c-1,0-2.2,0.1-3.4,0.1
				c-1,0-1.5-0.7-1.5-1.4S1,3.5,2,3.5c0,0,0,0,0.1,0c1.6,0,4.3,0.1,7,0.1c2.2,0,4.4,0,5.9-0.1c1,0,1.4,0.8,1.4,1.4
				c0,0.7-0.4,1.4-1.2,1.4c-0.1,0-0.1,0-0.1,0c-0.9-0.1-1.6-0.1-2.3-0.1c-2.6,0-2.6,0-2.6,0.5C10,8.5,10,11,10,13.5
				c0,3.1,0.1,6.3,0.1,8.2c0.1,0.9-0.8,1.4-1.6,1.4C7.8,23.1,7,22.7,7,21.8L7,21.8z"/>
		</g>
		<g class="st0">
			<path class="st1" d="M18.1,13.3c0-5.8,4.3-10.1,10-10.1s10,4.2,10,10.1c0,6.1-4.3,10.1-10,10.1S18.1,19.3,18.1,13.3z M35,13.3
				c0-4.5-3.1-7.4-7-7.4s-7,2.9-7,7.4c0,4.5,3.1,7.4,7,7.4S35,17.8,35,13.3z"/>
		</g>
		<g class="st0">
			<path class="st1" d="M44,23.1c-0.7,0-1.5-0.5-1.5-1.3c0,0,0-0.1,0-0.1c0.1-2,0.1-4.3,0.1-6.5c0-2.7-0.1-5.2-0.1-7
				c0-3.2,0-4.9,5.1-4.9c0.5,0,1.1,0,1.5,0.1c4.1,0.3,6,3,6,5.9c0,2.9-2,5.8-5.6,6.2c-0.6,0.1-1.2,0.1-1.9,0.1
				c-0.6,0-1.2-0.1-1.9-0.2c-0.1,0-0.1,0-0.2,0c-0.1,0-0.2,0.1-0.2,0.3c0,1.6,0.1,3.5,0.1,5.2c0,0.3,0,0.7,0,1
				C45.5,22.6,44.8,23.1,44,23.1z M47.7,5.9c-2.1,0-2.3,0.3-2.3,2.7c0,0.9,0,2,0,2.9c0,0.2,0,0.3,0,0.4c0,0.5,0.5,0.7,2.1,0.7
				c0.5,0,1,0,1.6-0.1c2-0.2,3.2-2,3.2-3.6c0-1.6-1-3-3.4-3C49,6,48.3,5.9,47.7,5.9z"/>
		</g>
		<g class="st0">
			<path class="st1" d="M67.3,12.8c-1.3-1-2-0.9-3.1-0.1c-1.2,1-2.5,2.1-3.8,2.9c-1.7,1-3.6-1.4-1.5-2.4c0.6-0.3,2.6-1.5,4-2.5
				c2.3-1.6,4-1.3,5.9,0.1c3.3,2.4,6.9,5.5,10.6,7.4c1.7,0.9,0.3,3.6-1.7,2.6C74.5,19.3,70.4,15.1,67.3,12.8z"/>
		</g>
		<g class="st0">
			<path class="st1" d="M86.7,23.2c-0.4,0.5-0.9,0.8-1.4,0.8c-0.7,0-1.3-0.5-1.3-1.1c0-0.2,0.1-0.5,0.3-0.8c2.3-3,2.7-6.1,2.7-9.5
				c0-1.3-0.1-2.7-0.1-4.2c0,0,0,0,0-0.1c0-1.2,0.8-2.1,2.5-2.2c1.8-0.1,4-0.1,6.2-0.1c2.2,0,4.4,0,6.3,0.1c2.8,0.1,2.9,1.5,2.9,3.1
				c0,1.8-0.3,2.9-2.8,2.9c-2.2,0.1-4.8,0.1-7.6,0.1c-1.6,0-3.3,0-5,0C89.4,16.3,89,20.1,86.7,23.2z M86.4,4.6
				c-0.8,0-1.2-0.5-1.2-1.1c0-0.5,0.4-1.1,1.2-1.1h18.8c0.8,0,1.1,0.5,1.1,1.1c0,0.5-0.4,1.1-1.1,1.1H86.4z M104.4,17.7l-6.3-0.1
				c1,2.6,3.7,3.7,6.7,4.3c0.8,0.2,1.1,0.7,1.1,1.3c0,0.6-0.5,1.3-1.4,1.3c-1,0-5.6-1.4-7.7-4.7c-2.2,4.2-7.5,4.9-7.7,4.9
				c-0.8,0-1.3-0.6-1.3-1.2c0-0.5,0.3-1,1.1-1.2c3.7-0.7,5.6-1.9,6.3-4.7l-4.7,0.1h0c-0.7,0-1.1-0.6-1.1-1.1c0-0.6,0.4-1.1,1.1-1.1
				l4.9,0.1v-0.3c0-0.4,0-0.9,0-1.4c0-0.7,0.7-1.1,1.3-1.1s1.2,0.3,1.2,1.1c0,0,0,0,0,0.1c0,0,0,0,0,1.3c0,0.1,0,0.2,0,0.3l6.4-0.1
				c0.7,0,1,0.6,1,1.1C105.5,17.1,105.1,17.7,104.4,17.7L104.4,17.7z M89.5,10.3c1.3,0,2.5,0,3.7,0c3.1,0,5.8-0.1,8.2-0.1
				c0.9,0,0.9-0.3,0.9-1.1c0-0.1,0-0.3,0-0.4c-0.1-0.6-0.4-0.6-5.6-0.6c-2.2,0-4.3,0-6.2,0.1c-0.6,0-1,0.4-1,1V10.3z"/>
		</g>
		<g class="st0">
			<path class="st1" d="M118.5,20.1c1.9-1.7,1.8-4.2,0.3-5.1c-1.4-0.9-4.2-1.1-6.8,0.4c-1,0.6-1.6,1.1-2.2,2
				c-0.9,1.4-3.5-0.2-1.9-1.7c2.9-2.8,5-4.8,7.9-8.4c0.3-0.4,0-0.3-0.2-0.2c-0.7,0.4-2.4,0.9-4.4,1.3c-2.1,0.4-2.4-2.1-0.7-2.3
				c1.7-0.2,4.2-0.8,5.7-1.3c2.1-0.6,3.8,1.2,2.5,2.7c-0.8,0.9-1.9,2-2.9,2.9s-2.1,1.9-3,2.8c2.3-1.2,5.4-1.2,7.3-0.1
				c3.7,2.2,2.5,6.8-0.2,8.8c-2.6,1.8-6.6,2-8.6,0.6c-2.8-1.8-1.5-5,1.5-5.1c2.1-0.1,4,1.2,4.1,3.5C117.5,20.9,118,20.5,118.5,20.1z
				 M112.9,19.3c-1.1,0.1-1.2,1.2-0.4,1.6c0.6,0.3,1.5,0.4,2.2,0.4C114.8,20.1,114.1,19.2,112.9,19.3z"/>
		</g>
	</g>
</g>
</svg>
