<?xml version="1.0" encoding="utf-8"?>
<!-- Generator: Adobe Illustrator 22.1.0, SVG Export Plug-In . SVG Version: 6.00 Build 0)  -->
<svg version="1.1" id="レイヤー_1" xmlns="http://www.w3.org/2000/svg" xmlns:xlink="http://www.w3.org/1999/xlink" x="0px"
	 y="0px" viewBox="0 0 385 103" style="enable-background:new 0 0 385 103;" xml:space="preserve">
<style type="text/css">
	.st0{enable-background:new    ;}
	.st1{fill:#FFFFFF;}
	.st2{fill:#D3A15F;}
</style>
<title>title_post_photo</title>
<g id="レイヤー_2_1_">
	<g id="POST2">
		<g class="st0">
			<path class="st1" d="M49.3,35.8C47,46,39.7,47.2,35.9,47.2c-2.3,0-4.8-0.4-7.4-1.2c-1.2-0.3-1.8-1.3-1.8-2.3c0-1.3,1-2.6,2.6-2.6
				c0.4,0,0.9,0.1,1.4,0.2c1.9,0.7,3.9,1.2,5.8,1.2c3.6,0,6.5-1.8,8-6.8l-24.8,0c-1.5,0-2.2-1.1-2.2-2.2c0-1,0.8-2.2,2.2-2.2l25.6,0
				c0.1-1.4,0.2-2.5,0.2-3.2c0,0,0,0,0-0.1c0-1.2-1-1.7-2-1.7c-1.9,0-3.8,0-5.7,0c-1.9,0-3.8,0-5.7,0l-0.3,0.9
				c-0.4,1.2-1.6,1.8-2.8,1.8c-1.2,0-2.4-0.7-2.4-1.9c0-0.3,0.1-0.6,0.2-1c1.7-3.9,3.2-9.3,3.9-13.6c0.2-1.2,1.2-1.8,2.3-1.8
				c1.3,0,2.5,0.8,2.5,2.2c0,0.2,0,0.3-0.1,0.5l-0.1,0.7h13.4c1.5,0,2.2,1.1,2.2,2.2s-0.7,2-2.2,2H34.3c-0.4,1.4-0.6,2.7-1,4.1
				c2-0.1,4-0.1,6-0.1c2.1,0,4.1,0,6.1,0.1c3.1,0,5,1.9,5,4.8c0,0.2,0,2.4-0.2,4.3l8.3,0c1.4,0,2.1,1.2,2.1,2.2
				c0,1.1-0.7,2.1-2.1,2.1H49.3z M24.2,15.7c0,1.4-1.2,2.2-2.5,2.2c-1.3,0-2.5-0.8-2.5-2.3c0-0.7,0-1.5,0-2.3c0-0.8,0-1.6,0-2.4
				c0.1-2.9,2.3-4.9,6.3-5c5.1,0,10-0.1,14.9-0.1c4,0,8.1,0,12.3,0.1c3.5,0.1,6,1.9,6.1,4.9c0,0.8,0,1.8,0,2.8c0,2,0,4.1-2.6,4.1
				c-1.2,0-2.4-0.8-2.4-2.1c0-0.1,0-0.1,0-0.1c0-4.9,0-5.3-3.1-5.4c-4,0-8.5-0.1-12.9-0.1c-3.7,0-7.2,0-10.2,0.1
				c-2.7,0-3.1,0.8-3.2,2.6C24.2,12.7,24.2,12.7,24.2,15.7L24.2,15.7z"/>
			<path class="st1" d="M113.6,39l-12.4-0.2c3.2,2,7.4,3.3,10.5,3.7c1.4,0.2,2,1.2,2,2.2c0,1.2-1,2.6-2.6,2.6c-1.2,0-7.3-1.5-13-5.4
				c-0.6-0.4-0.9-1-0.9-1.6c0-0.5,0.2-1.1,0.6-1.5h-7.9c0.5,0.4,0.8,1.1,0.8,1.8c0,0.5-0.2,1.1-0.9,1.6c-4.2,3-11.1,5.4-13.2,5.4
				c-1.6,0-2.5-1.2-2.5-2.4c0-1,0.6-2,2.1-2.2c3.2-0.5,7.3-1.8,10.5-4.2l-12.4,0.2h0c-1.4,0-2-1-2-2c0-1,0.7-2,2-2h39.2
				c1.4,0,2.1,1,2.1,2C115.6,38,114.9,39,113.6,39L113.6,39z M96.6,11.2v2.3c2,0,4,0,5.8,0.1c3.1,0.1,5.1,1.5,5.2,3.5
				c0.1,1.9,0.2,4,0.2,6s-0.1,4.1-0.2,5.9c-0.1,2.2-2.1,3.7-5.5,3.8c-2.8,0-5.7,0.1-8.4,0.1c-2.8,0-5.5-0.1-8-0.1
				c-3.7-0.1-5.5-1.6-5.6-3.7c-0.1-1.8-0.1-3.7-0.1-5.5c0-2.1,0.1-4.2,0.1-6c0.1-2.2,1.5-3.9,5.5-4c1.9-0.1,3.8-0.1,5.9-0.1v-2.3
				l-14.4,0c-1.5,0-2.3-1-2.3-2c0-1,0.8-2,2.3-2l14.3,0.1V5.1c0-1.5,1.3-2.4,2.6-2.4c1.3,0,2.6,0.8,2.6,2.4l0,2.2l14.2-0.1
				c1.5,0,2.2,1,2.2,2s-0.8,2-2.2,2L96.6,11.2z M103.1,21.8H84.6v2.3h18.5V21.8z M103,18.4c0-1-0.7-1.5-2.3-1.6
				c-2.3,0-4.6-0.1-6.8-0.1c-2.3,0-4.6,0.1-6.9,0.1c-1.5,0-2.2,0.8-2.2,1.6l0,0.6H103L103,18.4z M84.7,27l0,0.8
				c0,1.7,1.2,1.8,8.6,1.8c8.6,0,9.5,0,9.7-1.8c0-0.2,0.1-0.5,0.1-0.8H84.7z"/>
			<path class="st1" d="M144.6,10.2c0.8-0.3,1.6-0.6,2.1-0.9c2.8-1.7,5.5,2.5,1.8,4.4c-1.2,0.6-3.4,1.2-5.5,1.6
				c-0.6,1.6-1.5,3.4-2.4,5.1c3.5-0.6,6.8,0.7,8.4,4.4c2-1.1,4.1-2.1,6.1-3c1.2-0.5,2.6-1.1,3.9-1.9c3.8-2.1,6,2.9,2.8,4.5
				c-1.6,0.8-2.8,1.1-5.4,2.1c-2.1,0.8-4.4,1.8-6.4,2.8c0.1,1.7,0.2,3.7,0.1,5.5c-0.1,2-1.4,3.1-2.6,3.1c-1.3,0-2.4-0.9-2.3-2.9
				c0.1-1,0.1-2.2,0.1-3.2c-0.5,0.2-0.9,0.5-1.3,0.8c-6.2,4-5.5,7-2.7,8.4c2.7,1.4,7.6,0.4,9.9-0.4c4.4-1.4,5.8,4,1.2,5.2
				c-3,0.8-9.8,1.5-13.7-0.7c-6.8-3.8-5.6-10.6,3.5-16.5c0.7-0.5,1.5-1,2.5-1.5c-1.4-4.2-5.2-3.7-8.5,0c0,0-0.1,0.2-0.2,0.2
				c-0.4,0.5-0.8,1-1.1,1.3c-2.8,2.5-6.4-0.4-3.4-3.1c1.3-1.2,3-3,4.1-4.7c0.9-1.4,1.7-2.9,2.4-4.5c-2.7,0.4-4.6,0.2-6.2-0.5
				c-3.6-1.8-1.1-6.5,2.4-4.2c1,0.7,3,0.4,4.7,0.1c0.2-0.1,0.5-0.1,0.8-0.1c0.4-1.5,0.5-2.5,0.6-4.2c0.2-3,4.9-2.7,5-0.2
				c0.1,1-0.1,2-0.4,2.9L144.6,10.2z"/>
			<path class="st1" d="M182.1,30.6c-1.8,0.9-3.6,1.8-4.5,1.8c-1.5,0-2.4-1.2-2.4-2.4c0-0.8,0.5-1.6,1.5-2c2-0.8,3.8-1.6,5.4-2.4v-8
				h-4.2c-1.5,0-2.2-1.1-2.2-2.2c0-1.1,0.8-2.2,2.2-2.2h4.2l0-7.7c0-1.5,1.2-2.4,2.4-2.4c1.1,0,2.3,0.8,2.3,2.4v7.8h3.2
				c1.5,0,2.2,1.1,2.2,2.2c0,1.1-0.7,2.2-2.2,2.2h-3.2v5.6c0.6-0.4,1.2-0.8,1.8-1.2c0.4-0.2,0.8-0.3,1.1-0.3c1,0,2,0.9,2,2
				c0,1.1-0.7,1.9-4.9,4.3v6c0,0.8,0.2,5.3,0.2,7c0,0.1,0,0.2,0,0.2c0,3.1-2,5.5-6.3,5.5c-3.4,0-4.6-0.9-4.6-2.7
				c0-1.2,0.7-2.3,2-2.3c0.1,0,0.3,0,0.4,0.1c0.5,0.1,1.1,0.2,1.6,0.2c1.1,0,2.1-0.3,2.1-1.6V30.6z M193.9,27.4
				c-1.2,0-1.9-1.1-1.9-2.1c0-1,0.6-2,1.8-2c2.1,0,4.8,0,7.5,0c2.8,0,5.7,0,8,0c3.6,0,5.1,2,5.1,4c0,2.5-3.3,7.1-6.7,10.4
				c2.8,1.8,6.2,3.1,10.3,4c1.4,0.3,2.1,1.4,2.1,2.4c0,1.2-1,2.5-2.8,2.5c-2.6,0-8.3-2.6-12.9-6c-7.4,5.8-14.1,6.5-14.6,6.5
				c-1.5,0-2.6-1.2-2.6-2.5c0-1,0.7-1.9,2.2-2.1c4.4-0.8,8.3-2.7,11.5-5c-2.6-2.5-5.2-6-5.2-7.2s1.2-2,2.4-2c0.7,0,1.4,0.3,1.9,1
				c1.2,2.1,2.6,3.9,4.2,5.4c3.2-3.2,4.6-6.5,4.6-7c0-0.6-0.9-0.6-1.2-0.6c-1,0-2.2,0-3.4,0C200.8,27.3,196.8,27.4,193.9,27.4
				L193.9,27.4z M215,13.7c0-1.2,1-1.8,2.1-1.8c1.2,0,2.4,0.7,2.4,1.9c0,0.1,0,0.2,0,0.4c0,6.5-2.8,7.2-7.1,7.2
				c-5.4,0-6.1-1.5-6.1-5.8c0-1.8,0.1-4,0.1-5.5c0-1.1-0.6-1.5-3-1.5c-2.9,0-3.2,0.7-3.2,1.6c0,4.6-0.5,8.3-4.7,11.7
				c-0.7,0.5-1.4,0.8-2,0.8c-1.6,0-2.8-1.2-2.8-2.4c0-0.6,0.3-1.2,1.1-1.7c3.1-1.8,3.7-4.2,3.7-8c0-0.6-0.1-1.2-0.1-1.8
				c0,0,0,0,0-0.1c0-4.1,4.7-4.2,7-4.2c6.9,0,8.8,0.2,8.8,6c0,1.6-0.1,2.9-0.1,4.3c0,1.2,0,2.2,1.5,2.2c1.5,0,2.5,0,2.5-3.1
				C215,14,215,13.9,215,13.7L215,13.7z"/>
			<path class="st1" d="M242.1,45.5c0,1.4-1.2,2.1-2.4,2.1c-1.2,0-2.4-0.7-2.4-2.1v0l0.1-16.7c-3.4,6.2-4.3,7.1-5.6,7.1
				c-1.3,0-2.5-1.1-2.5-2.4c0-0.5,0.2-1.1,0.7-1.6c2.4-2.5,5.5-7.1,7.5-11.6l-0.1-1.4l-4.4,0.1h0c-1.5,0-2.1-1.1-2.1-2.1
				c0-1.1,0.8-2.2,2.2-2.2h4.4l-0.1-4.7c-2.1,0.5-3.7,0.7-4.1,0.7c-1.3,0-2-1.2-2-2.3c0-1,0.5-1.8,1.6-2c3.9-0.5,7.4-1.2,11.2-2.9
				c0.1,0,0.3-0.1,0.5-0.1c1.1,0,2.3,1.2,2.3,2.4c0,1.5-1.8,2.1-4.7,3c0,1.1-0.1,3.3-0.1,5.9h3.5c1.4,0,2,1.1,2,2.1
				c0,1.1-0.6,2.2-2,2.2h0l-3.6-0.1c0,1.1,0,2.2,0,3.2c1.3,0,4.7,3.2,5.4,4.2c0,0.1,0.1,0.2,0.1,0.2c0.6-1.5,1.9-2.3,4.5-2.3
				c2.1,0,6,0,9.6,0c2.6,0,5.1,0,6.8,0c3.3,0.1,4.8,2,4.9,4.7c0.1,1.8,0.1,2.9,0.1,3.8c0,2.1,0,2.3,0,2.6c0,0.8,0,3.8,0.1,5.6
				c0,0,0,0.1,0,0.2c0,3.1-2,6.1-7.4,6.1c-4,0-5.2-0.8-5.2-2.5c0-1.2,0.8-2.2,2.2-2.2c0.2,0,0.3,0,0.5,0c0.9,0.2,1.8,0.3,2.7,0.3
				c1.5,0,2.7-0.6,2.7-2.8c0,0,0,0,0-0.1c0,0,0-1,0-2.5c0-2.2,0-5.5-0.1-8.1c0-1.6-0.6-1.6-8-1.6c-2.9,0-5.9,0.1-7.2,0.1
				c-1.2,0-1.6,0.5-1.6,1.5c-0.1,2.6-0.1,5.7-0.1,8.9c0,2.3,0,4.8,0.1,7.3c0,0.1,0,0.1,0,0.1c0,1.3-1.1,2-2.2,2
				c-1.2,0-2.3-0.7-2.4-2.1c0-2.3,0-4.6,0-7c0-3.2,0-6.4,0-9.3c-0.4,0.4-1,0.7-1.5,0.7s-1.1-0.3-1.5-0.9c-0.6-0.9-1.4-1.9-2.1-2.7
				C241.9,34.3,242.1,45.5,242.1,45.5L242.1,45.5z M248.9,12.2c-1.5,0-2.2-1-2.2-2s0.7-2,2.1-2h0.1l8.8,0.1l0-3
				c0-1.4,1.2-2.1,2.6-2.1c1.2,0,2.5,0.7,2.5,2.1l0,3l9.5-0.1c1.5,0,2.2,1,2.2,2c0,1-0.7,2-2.2,2H248.9z M260.1,22.6
				c-8.4,0-9.2-0.4-9.2-4.5c0-4.2,0.5-4.3,9.8-4.3c7.7,0,8.5,0,8.5,4.3C269.2,22.2,268.6,22.6,260.1,22.6z M259.6,40.5
				c-5,0-5.8-0.6-5.8-5c0-5.2,0-5.6,6.5-5.6c5.7,0,6.1,0.3,6.1,5.8C266.3,40,265.3,40.5,259.6,40.5z M260,16.7c-4.8,0-4.9,0-4.9,1.5
				c0,1.5,0,1.5,4.8,1.5c4.9,0,4.9,0,4.9-1.5S264.9,16.7,260,16.7z M262.3,33.7c0-0.7-0.9-0.8-2.3-0.8c-1.9,0-2.3,0.1-2.3,2.2
				c0,1.8,0,2.2,2.5,2.2c2,0,2.2-0.2,2.2-2.1C262.3,34.7,262.3,34.3,262.3,33.7z"/>
			<path class="st1" d="M299.7,31.6c-1.8-4.9,1-8.5,4-9.4c1.5-0.4,3-0.6,4.3-0.4c-0.1-1.1-0.1-2.6-0.2-4.1c-4.2,0.4-8.3,1-11,1.4
				c-3.6,0.5-6,1.2-7.5,1.5c-3.4,0.6-4.4-4.4-0.4-5.1c2-0.3,5.2-0.7,7.3-1c2.5-0.4,7-1,11.4-1.4c0-0.3,0-0.6,0-0.9
				c0-3.1-0.2-3.3-0.2-4.9c0-3.7,5.1-3.3,5.2-0.2c0.1,1.2-0.1,3.5-0.2,4.8c0,0.2-0.1,0.5-0.1,0.8c1.5-0.1,2.8-0.2,3.9-0.2
				c2.5,0,4.2,0,7.6,0c4.2,0.1,4,5.4,0,5.1c-3.6-0.3-4.8-0.3-7.9-0.3c-1.2,0-2.4,0-3.7,0.1c0,1.6,0.1,3.2,0.1,4.6
				c0,0.7,0.1,1.8,0.1,2.8c4.5,7-0.8,17.6-6.2,21.9c-3.3,2.7-7.7-0.9-3.3-4c2.4-1.7,4.5-4.5,5.7-7.4C305.7,37,301.3,36.1,299.7,31.6
				z M308.1,26.3c-0.7-0.6-2.2-0.7-3.2-0.2c-1.2,0.6-2,2.1-1.5,3.8c0.9,2.7,5.2,2.7,5.8-0.9c0.2-1,0-1.5-0.3-1.9
				C308.7,26.9,308.4,26.6,308.1,26.3z"/>
			<path class="st1" d="M359.9,38.7c3.6-3.2,3.5-8,0.6-9.9c-2.6-1.8-8-2.1-13.1,0.9c-2,1.1-3,2-4.2,3.8c-1.8,2.7-6.8-0.3-3.7-3.4
				c5.5-5.5,9.6-9.3,15.1-16.2c0.5-0.7,0-0.5-0.4-0.3c-1.4,0.8-4.7,1.8-8.4,2.6c-4,0.8-4.7-4.1-1.3-4.5c3.3-0.4,8.2-1.6,11-2.5
				c4-1.2,7.3,2.4,4.8,5.2c-1.6,1.8-3.6,3.7-5.6,5.6c-2,1.9-4,3.7-5.8,5.4c4.4-2.3,10.4-2.3,14.1-0.1c7.2,4.3,4.8,13.1-0.4,16.9
				c-5,3.6-12.8,3.8-16.6,1.3c-5.3-3.5-3-9.7,3-9.9c4-0.2,7.8,2.2,7.9,6.8C357.9,40.1,359,39.5,359.9,38.7z M349.2,37.2
				c-2.2,0.2-2.3,2.3-0.7,3.1c1.1,0.6,2.8,0.8,4.2,0.8C352.8,38.8,351.4,37,349.2,37.2z"/>
		</g>
		<g class="st0">
			<path class="st2" d="M93.4,88v1h-11v-1c3.2,0,3.8-0.8,3.8-5.6v-7.7c0-4.8-0.6-5.6-3.8-5.6v-1h9.9c4.9,0,7.7,2.5,7.7,6
				c0,3.3-2.7,5.9-7.7,5.9h-2.7v2.4C89.6,87.2,90.2,88,93.4,88z M92.3,69.9h-2.7v8.4h2.7c2.7,0,3.9-1.9,3.9-4.1
				C96.3,71.9,95,69.9,92.3,69.9z"/>
			<path class="st2" d="M115.8,89.8c-6.4,0-11.7-5-11.7-11.2c0-6.1,5.3-11.2,11.7-11.2s11.7,5.1,11.7,11.2
				C127.5,84.8,122.2,89.8,115.8,89.8z M115.8,69.2c-5.7,0-7.8,5.2-7.8,9.4c0,4.2,2.1,9.4,7.8,9.4c5.7,0,7.8-5.2,7.8-9.4
				C123.5,74.5,121.4,69.2,115.8,69.2z"/>
			<path class="st2" d="M140.3,89.8c-2.5,0-4.5-1.2-5.4-1.8c-0.3,0.3-0.8,1-0.9,1.8h-0.9v-8.3h1c0.4,4.1,3,6.4,6.6,6.4
				c2.1,0,3.7-1.2,3.7-3.2c0-1.7-1.3-3-3.9-4.3l-3.3-1.7c-2.3-1.2-3.9-3.2-3.9-5.9c0-3,2.5-5.5,6-5.5c2,0,3.5,0.7,4.5,1.4
				c0.3-0.3,0.6-0.7,0.8-1.5h0.9v8.1h-1c-0.3-2.9-1.6-6.3-5-6.3c-1.9,0-3.5,1-3.5,2.8c0,1.7,1.2,2.6,4.2,4.1l3.2,1.7
				c2.7,1.4,3.8,3.6,3.8,5.4C147.2,87.2,144,89.8,140.3,89.8z"/>
			<path class="st2" d="M156.2,70.1c-4.4,0-4.8,0.8-5.4,3.1l-0.2,1h-1l0.3-5.9h21.4l0.3,5.9h-1l-0.2-1c-0.6-2.3-1-3.1-5.4-3.1h-2.7
				v12.3c0,4.8,0.6,5.6,3.8,5.6v1h-11.1v-1c3.2,0,3.8-0.8,3.8-5.6V70.1H156.2z"/>
			<path class="st2" d="M196.1,88v1h-11v-1c3.2,0,3.8-0.8,3.8-5.6v-7.7c0-4.8-0.6-5.6-3.8-5.6v-1h9.9c4.9,0,7.7,2.5,7.7,6
				c0,3.3-2.7,5.9-7.7,5.9h-2.7v2.4C192.3,87.2,192.9,88,196.1,88z M195.1,69.9h-2.7v8.4h2.7c2.7,0,3.9-1.9,3.9-4.1
				C199,71.9,197.8,69.9,195.1,69.9z"/>
			<path class="st2" d="M224.5,77.1v-2.4c0-4.8-0.6-5.6-3.8-5.6v-1h11v1c-3.2,0-3.8,0.8-3.8,5.6v7.7c0,4.8,0.6,5.6,3.8,5.6v1h-11v-1
				c3.2,0,3.8-0.8,3.8-5.6v-3.6h-10.9v3.6c0,4.8,0.6,5.6,3.8,5.6v1h-11v-1c3.2,0,3.8-0.8,3.8-5.6v-7.7c0-4.8-0.6-5.6-3.8-5.6v-1h11
				v1c-3.2,0-3.8,0.8-3.8,5.6v2.4H224.5z"/>
			<path class="st2" d="M248.2,89.8c-6.4,0-11.7-5-11.7-11.2c0-6.1,5.3-11.2,11.7-11.2S260,72.5,260,78.6
				C260,84.8,254.7,89.8,248.2,89.8z M248.2,69.2c-5.7,0-7.8,5.2-7.8,9.4c0,4.2,2.1,9.4,7.8,9.4c5.7,0,7.8-5.2,7.8-9.4
				C256,74.5,253.9,69.2,248.2,69.2z"/>
			<path class="st2" d="M269.2,70.1c-4.4,0-4.8,0.8-5.4,3.1l-0.2,1h-1l0.3-5.9h21.4l0.3,5.9h-1l-0.2-1c-0.6-2.3-1-3.1-5.4-3.1h-2.7
				v12.3c0,4.8,0.6,5.6,3.8,5.6v1h-11.1v-1c3.2,0,3.8-0.8,3.8-5.6V70.1H269.2z"/>
			<path class="st2" d="M299,89.8c-6.4,0-11.7-5-11.7-11.2c0-6.1,5.3-11.2,11.7-11.2s11.7,5.1,11.7,11.2
				C310.7,84.8,305.4,89.8,299,89.8z M299,69.2c-5.7,0-7.8,5.2-7.8,9.4c0,4.2,2.1,9.4,7.8,9.4c5.7,0,7.8-5.2,7.8-9.4
				C306.8,74.5,304.6,69.2,299,69.2z"/>
		</g>
	</g>
</g>
</svg>
