epoch,time,time_per_steps,loss,accuracy,val_loss,val_accuracy
1,949,172,0.4749,0.8036,0.7614,0.6843
2,390,71,0.3377,0.8552,0.5211,0.7868
3,410,75,0.2865,0.8813,0.4051,0.8454
4,404,73,0.2437,0.9004,0.3126,0.8755
5,404,74,0.2142,0.9153,0.5556,0.7726
6,410,74,0.1907,0.9262,0.6186,0.7910
7,397,72,0.1654,0.9363,0.3019,0.8961
8,403,73,0.1478,0.9444,0.3038,0.8790
9,394,72,0.1277,0.9517,0.8245,0.8342
10,400,73,0.1097,0.9587,1.2294,0.7227
11,403,73,0.0927,0.9656,0.3519,0.8830
12,405,74,0.0802,0.9710,1.7847,0.6993
13,406,74,0.0707,0.9743,0.7949,0.8403
14,410,74,0.0624,0.9771,0.4375,0.8932
15,405,74,0.0549,0.9802,0.9904,0.7831
16,407,74,0.0502,0.9821,0.8828,0.8346
17,406,74,0.0463,0.9833,0.8046,0.8385
18,404,73,0.0422,0.9849,0.7106,0.8463
19,403,73,0.0377,0.9866,0.8932,0.8298
20,406,74,0.0364,0.9871,1.6697,0.8061
21,406,74,0.0341,0.9878,0.3419,0.9070
22,401,73,0.0320,0.9886,0.8117,0.8203
23,396,72,0.0307,0.9894,2.1258,0.7169
24,393,71,0.0284,0.9900,0.3536,0.9164
25,402,73,0.0270,0.9903,0.9824,0.8667
26,404,73,0.0255,0.9911,0.8160,0.8472
27,407,74,0.0253,0.9913,0.6045,0.8729
28,403,73,0.0241,0.9918,1.5189,0.7884
29,405,74,0.0217,0.9922,0.5159,0.8852
30,391,71,0.0217,0.9926,0.5246,0.8938
31,370,67,0.0217,0.9926,0.7239,0.8863
32,364,66,0.0202,0.9931,1.2510,0.8577
33,365,66,0.0208,0.9929,0.6044,0.8970
34,367,67,0.0187,0.9934,0.6729,0.8735
35,375,68,0.0206,0.9930,1.2054,0.8354
36,378,69,0.0172,0.9941,0.8119,0.8841
37,382,69,0.0182,0.9938,1.1997,0.8279
38,394,72,0.0178,0.9938,0.5087,0.8992
39,404,73,0.0163,0.9944,0.5591,0.9084
40,401,73,0.0178,0.9940,1.7945,0.7830
41,405,74,0.0148,0.9949,0.4809,0.9058
42,393,71,0.0146,0.9952,0.5452,0.8828
43,402,73,0.0146,0.9949,0.5415,0.9046
44,411,75,0.0139,0.9953,1.5535,0.8456
45,400,73,0.0136,0.9954,1.9018,0.8174
46,399,73,0.0137,0.9951,0.8113,0.8915
47,406,74,0.0139,0.9953,0.6913,0.9065
48,398,72,0.0128,0.9959,0.9125,0.8728
49,397,72,0.0138,0.9954,0.7670,0.8837
50,392,71,0.0124,0.9957,0.7752,0.8722
