(footprint "AE-TPS63802" (version 20221018) (generator pcbnew)
  (layer "F.Cu")
  (attr through_hole)
  (fp_text reference "REF**" (at 5 -5) (layer "F.SilkS")
      (effects (font (size 1 1) (thickness 0.15)))
    (tstamp d315d17a-774b-43c9-84e2-778e656c75b3)
  )
  (fp_text value "AE-TPS63802" (at 8 -3) (layer "F.Fab")
      (effects (font (size 1 1) (thickness 0.15)))
    (tstamp e8abbbf1-711a-4490-b01c-6a86e06ebce6)
  )
  (fp_text user "." (at 0 1 unlocked) (layer "F.SilkS")
      (effects (font (size 2 2) (thickness 0.3)))
    (tstamp 2de90f14-4d8b-485b-a8f4-712fb4da81c2)
  )
  (fp_text user "${REFERENCE}" (at 0 0) (layer "F.Fab")
      (effects (font (size 1 1) (thickness 0.15)))
    (tstamp 09a9b97f-b0e8-4321-a3cc-6267671481d8)
  )
  (fp_line (start -1.8 -10.1) (end 18 -10.1)
    (stroke (width 0.12) (type solid)) (layer "F.SilkS") (tstamp 06780379-b248-45c4-8226-79c9f6802fd2))
  (fp_line (start -1.8 2.6) (end -1.8 -10.1)
    (stroke (width 0.12) (type solid)) (layer "F.SilkS") (tstamp ff2933e9-b18b-468a-969b-1f8cceed074e))
  (fp_line (start 18 -10.1) (end 18 2.6)
    (stroke (width 0.12) (type solid)) (layer "F.SilkS") (tstamp 036af009-d925-4d64-9cbd-28db09aa0783))
  (fp_line (start 18 2.6) (end -1.8 2.6)
    (stroke (width 0.12) (type solid)) (layer "F.SilkS") (tstamp 07ef1a13-2442-461b-9677-488e89569511))
  (fp_line (start -1.9 -10.25) (end 18.1 -10.25)
    (stroke (width 0.12) (type solid)) (layer "F.CrtYd") (tstamp c055804e-cd1f-4abb-b75c-c9043e3a6131))
  (fp_line (start -1.9 2.75) (end -1.9 -10.25)
    (stroke (width 0.12) (type solid)) (layer "F.CrtYd") (tstamp dd2d65a8-07eb-426d-be82-7a78211866f6))
  (fp_line (start 18.1 -10.25) (end 18.1 2.75)
    (stroke (width 0.12) (type solid)) (layer "F.CrtYd") (tstamp 2cbb7d17-12b4-470a-9c17-57a8402eface))
  (fp_line (start 18.1 2.75) (end -1.9 2.75)
    (stroke (width 0.12) (type solid)) (layer "F.CrtYd") (tstamp 5d66f4d6-e496-45d7-a34b-feded460776d))
  (fp_line (start -1.8 -10.1) (end 18 -10.1)
    (stroke (width 0.12) (type solid)) (layer "F.Fab") (tstamp 4a30d769-760a-472d-98b3-078893cac0e9))
  (fp_line (start -1.8 2.6) (end -1.8 -10.1)
    (stroke (width 0.12) (type solid)) (layer "F.Fab") (tstamp ae4b2377-3b20-46cc-bea0-fff5ab70880f))
  (fp_line (start 18 -10.1) (end 18 2.6)
    (stroke (width 0.12) (type solid)) (layer "F.Fab") (tstamp de5042f3-7c07-4744-846b-5a8e5cef7b59))
  (fp_line (start 18 2.6) (end -1.8 2.6)
    (stroke (width 0.12) (type solid)) (layer "F.Fab") (tstamp f0de72be-206d-4e0f-b045-e783fec14c5f))
  (pad "" thru_hole circle (at 10.16 -7.62) (size 2 2) (drill 1) (layers "*.Cu" "*.Mask") (tstamp 4dc2a87b-0fa6-468a-b04a-3a2da203297d))
  (pad "" thru_hole circle (at 10.16 0) (size 2 2) (drill 1) (layers "*.Cu" "*.Mask") (tstamp f5aa2d54-8ec3-4ee7-88a3-c1dd8f5163cc))
  (pad "1" thru_hole circle (at 0 0.05) (size 2 2) (drill 1) (layers "*.Cu" "*.Mask") (tstamp 2423713f-3496-469d-8eec-0c38cb792ed0))
  (pad "2" thru_hole circle (at 0 -2.54) (size 2 2) (drill 1) (layers "*.Cu" "*.Mask") (tstamp a7851d0a-473b-4c5e-ba27-d7b0ccf1db01))
  (pad "3" thru_hole circle (at 0 -5.08) (size 2 2) (drill 1) (layers "*.Cu" "*.Mask") (tstamp c79d7e0c-38e9-4091-912d-234cf116ee25))
  (pad "4" thru_hole circle (at 0 -7.62) (size 2 2) (drill 1) (layers "*.Cu" "*.Mask") (tstamp dd0f9626-5251-4046-99eb-d783c67d0e20))
  (model "../3D/AE_TPS63802_v7_cp.wrl"
    (offset (xyz 0 0 0))
    (scale (xyz 1 1 1))
    (rotate (xyz 0 0 90))
  )
  (model "../3D/AE_TPS63802_v7_cp.step" hide
    (offset (xyz 0 0 0))
    (scale (xyz 1 1 1))
    (rotate (xyz 0 0 90))
  )
)
