(footprint "SHDR5W64P0X250_1X5_1490X575X700P" (version 20221018) (generator pcbnew)
  (layer "F.Cu")
  (descr "B5B-XH-A (LF)(SN)")
  (tags "Connector")
  (attr through_hole)
  (fp_text reference "J**" (at 0 0) (layer "F.SilkS")
      (effects (font (size 1.27 1.27) (thickness 0.254)))
    (tstamp f2a23869-112a-4268-b2b2-439bda465a54)
  )
  (fp_text value "SHDR5W64P0X250_1X5_1490X575X700P" (at 0 0) (layer "F.SilkS") hide
      (effects (font (size 1.27 1.27) (thickness 0.254)))
    (tstamp 4510a4db-fb9b-498c-9169-2c73960b37f3)
  )
  (fp_text user "${REFERENCE}" (at 0 0) (layer "F.Fab")
      (effects (font (size 1.27 1.27) (thickness 0.254)))
    (tstamp 63fe2ff7-caa8-478d-bf03-960a3b6e0aee)
  )
  (fp_line (start -2.45 -3.4) (end -2.45 0)
    (stroke (width 0.2) (type solid)) (layer "F.SilkS") (tstamp 84a663ea-aebc-49f2-8780-33cd2248a38c))
  (fp_line (start 0 2.35) (end 12.45 2.35)
    (stroke (width 0.2) (type solid)) (layer "F.SilkS") (tstamp a98f416e-c809-4877-afd5-4a7844a89cc6))
  (fp_line (start 12.45 -3.4) (end -2.45 -3.4)
    (stroke (width 0.2) (type solid)) (layer "F.SilkS") (tstamp 7b87177f-5507-4d94-b026-075e89871d99))
  (fp_line (start 12.45 2.35) (end 12.45 -3.4)
    (stroke (width 0.2) (type solid)) (layer "F.SilkS") (tstamp 48dff28b-6ce1-4b68-b097-fec76611f4f8))
  (fp_line (start -2.7 -3.65) (end 12.7 -3.65)
    (stroke (width 0.05) (type solid)) (layer "F.CrtYd") (tstamp f7537c55-c2ee-45bd-805c-24b506c58db1))
  (fp_line (start -2.7 2.6) (end -2.7 -3.65)
    (stroke (width 0.05) (type solid)) (layer "F.CrtYd") (tstamp 23339a23-1986-4297-9a3a-61f40fa5a201))
  (fp_line (start 12.7 -3.65) (end 12.7 2.6)
    (stroke (width 0.05) (type solid)) (layer "F.CrtYd") (tstamp d28f402d-c0f0-43aa-918c-e17d9b894633))
  (fp_line (start 12.7 2.6) (end -2.7 2.6)
    (stroke (width 0.05) (type solid)) (layer "F.CrtYd") (tstamp 08fe100d-39a7-4048-bb78-0dabe1cbf2a7))
  (fp_line (start -2.45 -3.4) (end 12.45 -3.4)
    (stroke (width 0.1) (type solid)) (layer "F.Fab") (tstamp d15fbd8f-fe77-467e-b2cc-b9ba6e098625))
  (fp_line (start -2.45 2.35) (end -2.45 -3.4)
    (stroke (width 0.1) (type solid)) (layer "F.Fab") (tstamp a779cf14-c27e-4051-b4ae-e6c82d613c73))
  (fp_line (start 12.45 -3.4) (end 12.45 2.35)
    (stroke (width 0.1) (type solid)) (layer "F.Fab") (tstamp 42e7172b-cf57-4aae-ac9b-0445b932ef56))
  (fp_line (start 12.45 2.35) (end -2.45 2.35)
    (stroke (width 0.1) (type solid)) (layer "F.Fab") (tstamp 18bf892e-a922-4bc1-9625-5d521c1a1fac))
  (pad "1" thru_hole rect (at 0 0) (size 1.65 1.65) (drill 1) (layers "*.Cu" "*.Mask") (tstamp 9c72a53d-4d3e-436f-8406-6b565693b1e2))
  (pad "2" thru_hole circle (at 2.5 0) (size 1.65 1.65) (drill 1) (layers "*.Cu" "*.Mask") (tstamp 33d230be-2c19-4d66-bb34-374ec385c598))
  (pad "3" thru_hole circle (at 5 0) (size 1.65 1.65) (drill 1) (layers "*.Cu" "*.Mask") (tstamp 256529e3-ba6a-489b-9c8e-996ca224049a))
  (pad "4" thru_hole circle (at 7.5 0) (size 1.65 1.65) (drill 1) (layers "*.Cu" "*.Mask") (tstamp e87c76f1-524b-4907-87f0-d3c87701562e))
  (pad "5" thru_hole circle (at 10 0) (size 1.65 1.65) (drill 1) (layers "*.Cu" "*.Mask") (tstamp 40740b9c-89a8-4d40-af39-f920d562974d))
  (model "../3D/B5B-XH-A__LF__SN_.stp"
    (offset (xyz 0 0 0))
    (scale (xyz 1 1 1))
    (rotate (xyz 0 0 0))
  )
)
