(footprint "M5atom" (version 20211014) (generator pcbnew)
  (layer "F.Cu")
  (tedit 0)
  (attr smd)
  (fp_text reference "REF**" (at 7.62 -5.08 unlocked) (layer "F.SilkS")
    (effects (font (size 1 1) (thickness 0.15)))
    (tstamp e1a8c357-1332-4760-ad39-b10f83fec72d)
  )
  (fp_text value "M5atom" (at 7.62 -8.89 unlocked) (layer "F.Fab")
    (effects (font (size 1 1) (thickness 0.15)))
    (tstamp 1d3d3fb2-99c8-460e-924a-1a06294a29ff)
  )
  (fp_text user "${REFERENCE}" (at 7.62 -5.08 unlocked) (layer "F.Fab")
    (effects (font (size 1 1) (thickness 0.15)))
    (tstamp 0450d219-285c-4e3a-b2f7-f0f01dcf6e4a)
  )
  (fp_rect (start -4.5 -12.04) (end 19.5 11.96) (layer "F.SilkS") (width 0.12) (fill none) (tstamp a54cf065-1a9b-4721-ba3d-804ebd7ddb23))
  (pad "1" thru_hole circle (at 0 0) (size 2 2) (drill 1) (layers *.Cu *.Mask) (tstamp a86c0df5-5968-4850-8483-63d27db8b173))
  (pad "2" thru_hole circle (at 0 2.54) (size 2 2) (drill 1) (layers *.Cu *.Mask) (tstamp 851090d3-4479-4bc0-9d9e-4767c756121b))
  (pad "3" thru_hole circle (at 0 5.08) (size 2 2) (drill 1) (layers *.Cu *.Mask) (tstamp 1e7a0f04-50ce-4a67-bf83-56045f31528e))
  (pad "4" thru_hole circle (at 0 7.62) (size 2 2) (drill 1) (layers *.Cu *.Mask) (tstamp f0a1d7db-61bf-48e0-8201-f363d5ac0a1c))
  (pad "5" thru_hole circle (at 15 7.62) (size 2 2) (drill 1) (layers *.Cu *.Mask) (tstamp d0c93ef8-7770-49ac-a43a-97ecb7d7ed6c))
  (pad "6" thru_hole circle (at 15 5.08) (size 2 2) (drill 1) (layers *.Cu *.Mask) (tstamp 2b1635c0-2d24-481e-898b-d4f6e0af459b))
  (pad "7" thru_hole circle (at 15 2.54) (size 2 2) (drill 1) (layers *.Cu *.Mask) (tstamp a72969b7-4902-4aea-b32b-483e141f21e1))
  (pad "8" thru_hole circle (at 15 0) (size 2 2) (drill 1) (layers *.Cu *.Mask) (tstamp 747a48d1-0402-46a6-883d-11c7f9faa194))
  (pad "9" thru_hole circle (at 15 -2.54) (size 2 2) (drill 1) (layers *.Cu *.Mask) (tstamp f3452485-8b46-4590-a075-ce66d56c76e8))
)
