(footprint "CP_Radial_D5.0mm_P2.50mm" (version 20221018) (generator pcbnew)
  (layer "F.Cu")
  (descr "CP, Radial series, Radial, pin pitch=2.50mm, , diameter=5mm, Electrolytic Capacitor")
  (tags "CP Radial series Radial pin pitch 2.50mm  diameter 5mm Electrolytic Capacitor")
  (attr through_hole)
  (fp_text reference "REF**" (at 1.25 -3.75) (layer "F.SilkS")
      (effects (font (size 1 1) (thickness 0.15)))
    (tstamp 12f6c973-876e-4f5d-a55f-c90ef8ecda5f)
  )
  (fp_text value "CP_Radial_D5.0mm_P2.50mm" (at 1.25 3.75) (layer "F.Fab")
      (effects (font (size 1 1) (thickness 0.15)))
    (tstamp c439661e-668d-488e-a522-8d515c850906)
  )
  (fp_text user "${REFERENCE}" (at 1.25 0) (layer "F.Fab")
      (effects (font (size 1 1) (thickness 0.15)))
    (tstamp 4e54ca7e-dbcd-4ee5-8a1f-31f4a9d63e58)
  )
  (fp_line (start -1.554775 -1.475) (end -1.054775 -1.475)
    (stroke (width 0.12) (type solid)) (layer "F.SilkS") (tstamp 1b665472-e664-4e3d-bd4f-d4c9e8aa3ab6))
  (fp_line (start -1.304775 -1.725) (end -1.304775 -1.225)
    (stroke (width 0.12) (type solid)) (layer "F.SilkS") (tstamp 376c103f-2eb3-401c-83b3-44d8dcb3ae8a))
  (fp_line (start 1.25 -2.58) (end 1.25 2.58)
    (stroke (width 0.12) (type solid)) (layer "F.SilkS") (tstamp 0b5f4add-8ef6-476e-978b-edf4b9a43985))
  (fp_line (start 1.29 -2.58) (end 1.29 2.58)
    (stroke (width 0.12) (type solid)) (layer "F.SilkS") (tstamp c1edb5fc-0631-4ea2-b317-88a9910b3816))
  (fp_line (start 1.33 -2.579) (end 1.33 2.579)
    (stroke (width 0.12) (type solid)) (layer "F.SilkS") (tstamp 55a2569f-49f3-4878-9c9e-4b0b01fece85))
  (fp_line (start 1.37 -2.578) (end 1.37 2.578)
    (stroke (width 0.12) (type solid)) (layer "F.SilkS") (tstamp 609966ff-598b-481b-9cbb-28e2c6a5931c))
  (fp_line (start 1.41 -2.576) (end 1.41 2.576)
    (stroke (width 0.12) (type solid)) (layer "F.SilkS") (tstamp 84e2de31-bd37-4edf-87cb-a9a80cd8c2f4))
  (fp_line (start 1.45 -2.573) (end 1.45 2.573)
    (stroke (width 0.12) (type solid)) (layer "F.SilkS") (tstamp 8cc39d47-5ff1-41fc-9ad2-25e0f1db4bc4))
  (fp_line (start 1.49 -2.569) (end 1.49 -1.04)
    (stroke (width 0.12) (type solid)) (layer "F.SilkS") (tstamp 6ea5b5ab-1363-44bb-920f-ce688661ed45))
  (fp_line (start 1.49 1.04) (end 1.49 2.569)
    (stroke (width 0.12) (type solid)) (layer "F.SilkS") (tstamp 3cace437-00bf-4e04-ac7c-8bc3cf2b1cc6))
  (fp_line (start 1.53 -2.565) (end 1.53 -1.04)
    (stroke (width 0.12) (type solid)) (layer "F.SilkS") (tstamp 24f5d5ed-7822-4b4a-bd5d-978efe89e766))
  (fp_line (start 1.53 1.04) (end 1.53 2.565)
    (stroke (width 0.12) (type solid)) (layer "F.SilkS") (tstamp 3010a10a-7ac9-46a8-bbfa-94396ac0619e))
  (fp_line (start 1.57 -2.561) (end 1.57 -1.04)
    (stroke (width 0.12) (type solid)) (layer "F.SilkS") (tstamp f989ae54-3095-40a6-aa2a-586fb37582dd))
  (fp_line (start 1.57 1.04) (end 1.57 2.561)
    (stroke (width 0.12) (type solid)) (layer "F.SilkS") (tstamp 6fb9ff3b-0689-4e8c-9d57-5710512ce1b5))
  (fp_line (start 1.61 -2.556) (end 1.61 -1.04)
    (stroke (width 0.12) (type solid)) (layer "F.SilkS") (tstamp 7c68aa9a-cf43-4715-8525-a1a9b7997d3c))
  (fp_line (start 1.61 1.04) (end 1.61 2.556)
    (stroke (width 0.12) (type solid)) (layer "F.SilkS") (tstamp dcd54277-9c08-40cd-b013-1d0e9aa113ac))
  (fp_line (start 1.65 -2.55) (end 1.65 -1.04)
    (stroke (width 0.12) (type solid)) (layer "F.SilkS") (tstamp 31245f8e-e8ea-43cb-be28-0204374ee8c2))
  (fp_line (start 1.65 1.04) (end 1.65 2.55)
    (stroke (width 0.12) (type solid)) (layer "F.SilkS") (tstamp ec685a83-16c2-4980-a82b-94ffaae1d91d))
  (fp_line (start 1.69 -2.543) (end 1.69 -1.04)
    (stroke (width 0.12) (type solid)) (layer "F.SilkS") (tstamp 6ef9b3ca-b39e-4a00-8c8e-6061edbe5f15))
  (fp_line (start 1.69 1.04) (end 1.69 2.543)
    (stroke (width 0.12) (type solid)) (layer "F.SilkS") (tstamp 2b496e3b-7059-4186-9016-a1bf470e470f))
  (fp_line (start 1.73 -2.536) (end 1.73 -1.04)
    (stroke (width 0.12) (type solid)) (layer "F.SilkS") (tstamp e28442b1-5ca7-4d02-9a32-d28a72ecc3d1))
  (fp_line (start 1.73 1.04) (end 1.73 2.536)
    (stroke (width 0.12) (type solid)) (layer "F.SilkS") (tstamp 884d2da8-5bff-4e1c-9504-259074907eaf))
  (fp_line (start 1.77 -2.528) (end 1.77 -1.04)
    (stroke (width 0.12) (type solid)) (layer "F.SilkS") (tstamp d22c7e55-eb2f-4cee-bdf2-68096fab30a0))
  (fp_line (start 1.77 1.04) (end 1.77 2.528)
    (stroke (width 0.12) (type solid)) (layer "F.SilkS") (tstamp 74e5133b-7033-400c-92c3-52cc53e7de7c))
  (fp_line (start 1.81 -2.52) (end 1.81 -1.04)
    (stroke (width 0.12) (type solid)) (layer "F.SilkS") (tstamp 4d5c13a0-1752-4e6b-9db2-54df245bc12a))
  (fp_line (start 1.81 1.04) (end 1.81 2.52)
    (stroke (width 0.12) (type solid)) (layer "F.SilkS") (tstamp 0d11478b-8c7d-41b6-a038-5371d525eb22))
  (fp_line (start 1.85 -2.511) (end 1.85 -1.04)
    (stroke (width 0.12) (type solid)) (layer "F.SilkS") (tstamp b6616054-ace2-4632-a12d-393245817f93))
  (fp_line (start 1.85 1.04) (end 1.85 2.511)
    (stroke (width 0.12) (type solid)) (layer "F.SilkS") (tstamp ed47cbd2-39a9-4118-b74d-dfbbf1857973))
  (fp_line (start 1.89 -2.501) (end 1.89 -1.04)
    (stroke (width 0.12) (type solid)) (layer "F.SilkS") (tstamp 6c486689-9658-41c8-84f9-04e478020f02))
  (fp_line (start 1.89 1.04) (end 1.89 2.501)
    (stroke (width 0.12) (type solid)) (layer "F.SilkS") (tstamp 56307311-9881-4387-b932-8869963d6c61))
  (fp_line (start 1.93 -2.491) (end 1.93 -1.04)
    (stroke (width 0.12) (type solid)) (layer "F.SilkS") (tstamp 2659b3be-439f-4f1c-9976-fe38c8f4a7de))
  (fp_line (start 1.93 1.04) (end 1.93 2.491)
    (stroke (width 0.12) (type solid)) (layer "F.SilkS") (tstamp 39b2e193-74f4-4975-bea6-43b420fa3238))
  (fp_line (start 1.971 -2.48) (end 1.971 -1.04)
    (stroke (width 0.12) (type solid)) (layer "F.SilkS") (tstamp b08a1958-fe91-4f02-9be8-c68e6f73cd2f))
  (fp_line (start 1.971 1.04) (end 1.971 2.48)
    (stroke (width 0.12) (type solid)) (layer "F.SilkS") (tstamp d01df7bd-2ba7-44d9-a47c-ca4d4f3c7a1d))
  (fp_line (start 2.011 -2.468) (end 2.011 -1.04)
    (stroke (width 0.12) (type solid)) (layer "F.SilkS") (tstamp 9e318885-129a-4be8-b42f-4b85b5b2a32b))
  (fp_line (start 2.011 1.04) (end 2.011 2.468)
    (stroke (width 0.12) (type solid)) (layer "F.SilkS") (tstamp 133c0985-d691-44a2-bf2c-596c4ccb2305))
  (fp_line (start 2.051 -2.455) (end 2.051 -1.04)
    (stroke (width 0.12) (type solid)) (layer "F.SilkS") (tstamp 0842f0d4-22d8-4977-8d00-ad3b8ad2228d))
  (fp_line (start 2.051 1.04) (end 2.051 2.455)
    (stroke (width 0.12) (type solid)) (layer "F.SilkS") (tstamp c47d25ae-85e6-4269-9565-003a069d86b6))
  (fp_line (start 2.091 -2.442) (end 2.091 -1.04)
    (stroke (width 0.12) (type solid)) (layer "F.SilkS") (tstamp 70e724b1-daad-4f8f-8896-798dd33830b6))
  (fp_line (start 2.091 1.04) (end 2.091 2.442)
    (stroke (width 0.12) (type solid)) (layer "F.SilkS") (tstamp 5e6edaaa-30b9-42f0-af85-aa21e937118f))
  (fp_line (start 2.131 -2.428) (end 2.131 -1.04)
    (stroke (width 0.12) (type solid)) (layer "F.SilkS") (tstamp cb5a45af-4470-4ec0-9aed-03ba0ddbfa9a))
  (fp_line (start 2.131 1.04) (end 2.131 2.428)
    (stroke (width 0.12) (type solid)) (layer "F.SilkS") (tstamp d5d308b9-d94f-4cf5-9522-fe86f5ed41de))
  (fp_line (start 2.171 -2.414) (end 2.171 -1.04)
    (stroke (width 0.12) (type solid)) (layer "F.SilkS") (tstamp 059bb028-fdf5-42e1-ad36-5892b5634ea6))
  (fp_line (start 2.171 1.04) (end 2.171 2.414)
    (stroke (width 0.12) (type solid)) (layer "F.SilkS") (tstamp bdc78054-d034-4214-a1b2-e1152190e82a))
  (fp_line (start 2.211 -2.398) (end 2.211 -1.04)
    (stroke (width 0.12) (type solid)) (layer "F.SilkS") (tstamp aedd52c5-957f-44c0-8353-86783bd3880a))
  (fp_line (start 2.211 1.04) (end 2.211 2.398)
    (stroke (width 0.12) (type solid)) (layer "F.SilkS") (tstamp 6213a137-ca05-4318-9165-0c130b2435a5))
  (fp_line (start 2.251 -2.382) (end 2.251 -1.04)
    (stroke (width 0.12) (type solid)) (layer "F.SilkS") (tstamp fe097bf9-3411-45ca-a7a0-9f31788ccb54))
  (fp_line (start 2.251 1.04) (end 2.251 2.382)
    (stroke (width 0.12) (type solid)) (layer "F.SilkS") (tstamp c445746e-1870-408e-a845-33a258ebfe92))
  (fp_line (start 2.291 -2.365) (end 2.291 -1.04)
    (stroke (width 0.12) (type solid)) (layer "F.SilkS") (tstamp 48e78607-b648-43f0-aa31-36a32113bd37))
  (fp_line (start 2.291 1.04) (end 2.291 2.365)
    (stroke (width 0.12) (type solid)) (layer "F.SilkS") (tstamp 598430b3-2d9c-4862-b9d9-b58ecc53d97f))
  (fp_line (start 2.331 -2.348) (end 2.331 -1.04)
    (stroke (width 0.12) (type solid)) (layer "F.SilkS") (tstamp 983abbcd-f244-42a6-84e1-4f96ee2b07e0))
  (fp_line (start 2.331 1.04) (end 2.331 2.348)
    (stroke (width 0.12) (type solid)) (layer "F.SilkS") (tstamp 7478b064-b3dd-4ba9-9713-00a6b526b90b))
  (fp_line (start 2.371 -2.329) (end 2.371 -1.04)
    (stroke (width 0.12) (type solid)) (layer "F.SilkS") (tstamp a7dff314-784f-4361-8184-400f6c5775b2))
  (fp_line (start 2.371 1.04) (end 2.371 2.329)
    (stroke (width 0.12) (type solid)) (layer "F.SilkS") (tstamp de21374e-935d-430a-b4bc-52014ad9b9c4))
  (fp_line (start 2.411 -2.31) (end 2.411 -1.04)
    (stroke (width 0.12) (type solid)) (layer "F.SilkS") (tstamp 27bd2eed-d65e-4c09-be21-5f9708cca10d))
  (fp_line (start 2.411 1.04) (end 2.411 2.31)
    (stroke (width 0.12) (type solid)) (layer "F.SilkS") (tstamp 5479f33a-5659-427a-b1f6-26ba7c418656))
  (fp_line (start 2.451 -2.29) (end 2.451 -1.04)
    (stroke (width 0.12) (type solid)) (layer "F.SilkS") (tstamp 77da0871-ac2b-4f8d-83aa-2303a17f86e3))
  (fp_line (start 2.451 1.04) (end 2.451 2.29)
    (stroke (width 0.12) (type solid)) (layer "F.SilkS") (tstamp b331a6ce-7012-4faf-ab31-c0eef6942aad))
  (fp_line (start 2.491 -2.268) (end 2.491 -1.04)
    (stroke (width 0.12) (type solid)) (layer "F.SilkS") (tstamp bd54ea80-adce-4835-be5a-12b126e26456))
  (fp_line (start 2.491 1.04) (end 2.491 2.268)
    (stroke (width 0.12) (type solid)) (layer "F.SilkS") (tstamp 75813d40-daf5-42f0-b1d1-b0cd6db3d2b5))
  (fp_line (start 2.531 -2.247) (end 2.531 -1.04)
    (stroke (width 0.12) (type solid)) (layer "F.SilkS") (tstamp 4bb7db36-a074-4e90-81f1-d6437aa4e3b3))
  (fp_line (start 2.531 1.04) (end 2.531 2.247)
    (stroke (width 0.12) (type solid)) (layer "F.SilkS") (tstamp 652a60d3-cc13-43d1-a107-802cf16d647b))
  (fp_line (start 2.571 -2.224) (end 2.571 -1.04)
    (stroke (width 0.12) (type solid)) (layer "F.SilkS") (tstamp 950cbecd-59a1-447d-99b4-5c1df50e83eb))
  (fp_line (start 2.571 1.04) (end 2.571 2.224)
    (stroke (width 0.12) (type solid)) (layer "F.SilkS") (tstamp a0371ae6-9b8d-4bc6-9f79-cd9ed9cb38fc))
  (fp_line (start 2.611 -2.2) (end 2.611 -1.04)
    (stroke (width 0.12) (type solid)) (layer "F.SilkS") (tstamp bdd2e47a-d124-46e0-9c40-70eea6919c3d))
  (fp_line (start 2.611 1.04) (end 2.611 2.2)
    (stroke (width 0.12) (type solid)) (layer "F.SilkS") (tstamp 5150c582-1941-4955-a58a-6031b5446f64))
  (fp_line (start 2.651 -2.175) (end 2.651 -1.04)
    (stroke (width 0.12) (type solid)) (layer "F.SilkS") (tstamp 93298632-19bc-4751-bfed-b61bcb32e34b))
  (fp_line (start 2.651 1.04) (end 2.651 2.175)
    (stroke (width 0.12) (type solid)) (layer "F.SilkS") (tstamp f0c538ff-96c0-41eb-8c77-d777b67fd8e4))
  (fp_line (start 2.691 -2.149) (end 2.691 -1.04)
    (stroke (width 0.12) (type solid)) (layer "F.SilkS") (tstamp 27576732-e43f-448f-a2e6-86939bcfd2b4))
  (fp_line (start 2.691 1.04) (end 2.691 2.149)
    (stroke (width 0.12) (type solid)) (layer "F.SilkS") (tstamp c1889550-eb57-41bc-bc15-02d090863bed))
  (fp_line (start 2.731 -2.122) (end 2.731 -1.04)
    (stroke (width 0.12) (type solid)) (layer "F.SilkS") (tstamp e6cd52de-2c5e-4f1d-b881-55ded9af71c1))
  (fp_line (start 2.731 1.04) (end 2.731 2.122)
    (stroke (width 0.12) (type solid)) (layer "F.SilkS") (tstamp c624d63e-918b-4c1d-9c54-ef1b2ea2950f))
  (fp_line (start 2.771 -2.095) (end 2.771 -1.04)
    (stroke (width 0.12) (type solid)) (layer "F.SilkS") (tstamp 4e1620fd-32e1-4740-bfd5-beb2180260e0))
  (fp_line (start 2.771 1.04) (end 2.771 2.095)
    (stroke (width 0.12) (type solid)) (layer "F.SilkS") (tstamp eb3a1b5a-35c5-410b-873b-828d21d7c850))
  (fp_line (start 2.811 -2.065) (end 2.811 -1.04)
    (stroke (width 0.12) (type solid)) (layer "F.SilkS") (tstamp 70435892-6b42-47dd-aae9-ffd571c4a02a))
  (fp_line (start 2.811 1.04) (end 2.811 2.065)
    (stroke (width 0.12) (type solid)) (layer "F.SilkS") (tstamp a4bd2387-fd19-481c-af54-f91e107f045d))
  (fp_line (start 2.851 -2.035) (end 2.851 -1.04)
    (stroke (width 0.12) (type solid)) (layer "F.SilkS") (tstamp d93bf8a8-b63f-4833-8cf7-96c46e693653))
  (fp_line (start 2.851 1.04) (end 2.851 2.035)
    (stroke (width 0.12) (type solid)) (layer "F.SilkS") (tstamp 75ba14bb-ae41-4382-8323-656e8ac21fb8))
  (fp_line (start 2.891 -2.004) (end 2.891 -1.04)
    (stroke (width 0.12) (type solid)) (layer "F.SilkS") (tstamp a6ec3177-1be4-4af9-9fb1-ae1eda404e2d))
  (fp_line (start 2.891 1.04) (end 2.891 2.004)
    (stroke (width 0.12) (type solid)) (layer "F.SilkS") (tstamp d6292932-e428-4323-84ed-c9059be53708))
  (fp_line (start 2.931 -1.971) (end 2.931 -1.04)
    (stroke (width 0.12) (type solid)) (layer "F.SilkS") (tstamp b4dd0111-6305-4ea6-96cf-f4d56f14000b))
  (fp_line (start 2.931 1.04) (end 2.931 1.971)
    (stroke (width 0.12) (type solid)) (layer "F.SilkS") (tstamp c25ae255-09a5-40df-9a74-b0ac02be5390))
  (fp_line (start 2.971 -1.937) (end 2.971 -1.04)
    (stroke (width 0.12) (type solid)) (layer "F.SilkS") (tstamp 9c4dc359-b0b2-4733-a17f-36ac90028d9d))
  (fp_line (start 2.971 1.04) (end 2.971 1.937)
    (stroke (width 0.12) (type solid)) (layer "F.SilkS") (tstamp a473664f-7d0e-46a7-9613-f593f0d8c5de))
  (fp_line (start 3.011 -1.901) (end 3.011 -1.04)
    (stroke (width 0.12) (type solid)) (layer "F.SilkS") (tstamp ccd5019f-1107-4627-b51f-df5fcd41236e))
  (fp_line (start 3.011 1.04) (end 3.011 1.901)
    (stroke (width 0.12) (type solid)) (layer "F.SilkS") (tstamp f6afaf28-6ecd-47ca-8fcc-78a8b0d49921))
  (fp_line (start 3.051 -1.864) (end 3.051 -1.04)
    (stroke (width 0.12) (type solid)) (layer "F.SilkS") (tstamp afc75a9e-9b3f-4cb7-8074-a75030eabb9b))
  (fp_line (start 3.051 1.04) (end 3.051 1.864)
    (stroke (width 0.12) (type solid)) (layer "F.SilkS") (tstamp 1c642b0b-d2cb-4081-8e40-06b281120be7))
  (fp_line (start 3.091 -1.826) (end 3.091 -1.04)
    (stroke (width 0.12) (type solid)) (layer "F.SilkS") (tstamp 3af0b4c0-1856-41a7-b8c0-c612410674fe))
  (fp_line (start 3.091 1.04) (end 3.091 1.826)
    (stroke (width 0.12) (type solid)) (layer "F.SilkS") (tstamp 32c0295a-33f5-4179-aaed-59b22c986ada))
  (fp_line (start 3.131 -1.785) (end 3.131 -1.04)
    (stroke (width 0.12) (type solid)) (layer "F.SilkS") (tstamp 1502518c-66ff-4764-9eaf-c76609e1cca1))
  (fp_line (start 3.131 1.04) (end 3.131 1.785)
    (stroke (width 0.12) (type solid)) (layer "F.SilkS") (tstamp 98fbeba0-3f98-47c5-a284-d034f992b1a1))
  (fp_line (start 3.171 -1.743) (end 3.171 -1.04)
    (stroke (width 0.12) (type solid)) (layer "F.SilkS") (tstamp 778d9676-0d98-4995-940b-a777c7a5d767))
  (fp_line (start 3.171 1.04) (end 3.171 1.743)
    (stroke (width 0.12) (type solid)) (layer "F.SilkS") (tstamp 4fb74a3f-cee9-4407-9124-c1602de1fc37))
  (fp_line (start 3.211 -1.699) (end 3.211 -1.04)
    (stroke (width 0.12) (type solid)) (layer "F.SilkS") (tstamp e981f552-a804-4ce4-b1ab-17263330498a))
  (fp_line (start 3.211 1.04) (end 3.211 1.699)
    (stroke (width 0.12) (type solid)) (layer "F.SilkS") (tstamp 40589105-4fd8-4265-99ef-de9f481c5561))
  (fp_line (start 3.251 -1.653) (end 3.251 -1.04)
    (stroke (width 0.12) (type solid)) (layer "F.SilkS") (tstamp 63b60fa8-5af6-4fef-a1ea-2e2865e69196))
  (fp_line (start 3.251 1.04) (end 3.251 1.653)
    (stroke (width 0.12) (type solid)) (layer "F.SilkS") (tstamp 919fb267-aecd-4a7d-9a93-b8fe3e3f4b2e))
  (fp_line (start 3.291 -1.605) (end 3.291 -1.04)
    (stroke (width 0.12) (type solid)) (layer "F.SilkS") (tstamp 3f26ce89-3998-48b8-b9fa-4f801ea03b86))
  (fp_line (start 3.291 1.04) (end 3.291 1.605)
    (stroke (width 0.12) (type solid)) (layer "F.SilkS") (tstamp a23fa170-7c3a-4334-869a-7f75c5455631))
  (fp_line (start 3.331 -1.554) (end 3.331 -1.04)
    (stroke (width 0.12) (type solid)) (layer "F.SilkS") (tstamp 45954ba4-76a2-4208-aa20-90405f44472a))
  (fp_line (start 3.331 1.04) (end 3.331 1.554)
    (stroke (width 0.12) (type solid)) (layer "F.SilkS") (tstamp 4b32eae2-1a5b-42c5-914f-f9076dd61fd6))
  (fp_line (start 3.371 -1.5) (end 3.371 -1.04)
    (stroke (width 0.12) (type solid)) (layer "F.SilkS") (tstamp 9bd60fc0-b996-4759-8131-e4f0bf04c2ea))
  (fp_line (start 3.371 1.04) (end 3.371 1.5)
    (stroke (width 0.12) (type solid)) (layer "F.SilkS") (tstamp 6d26487c-45bb-4683-833d-dd4a71fbf75f))
  (fp_line (start 3.411 -1.443) (end 3.411 -1.04)
    (stroke (width 0.12) (type solid)) (layer "F.SilkS") (tstamp bbd5a251-d982-4086-a8a6-1e833d737e46))
  (fp_line (start 3.411 1.04) (end 3.411 1.443)
    (stroke (width 0.12) (type solid)) (layer "F.SilkS") (tstamp d5a555f7-c43b-4a7a-8992-07ce479cbba5))
  (fp_line (start 3.451 -1.383) (end 3.451 -1.04)
    (stroke (width 0.12) (type solid)) (layer "F.SilkS") (tstamp 8c4dacd3-d053-4923-ac20-29af24eef0be))
  (fp_line (start 3.451 1.04) (end 3.451 1.383)
    (stroke (width 0.12) (type solid)) (layer "F.SilkS") (tstamp 1ad949d5-416d-4bb1-8d18-2f398d07b09d))
  (fp_line (start 3.491 -1.319) (end 3.491 -1.04)
    (stroke (width 0.12) (type solid)) (layer "F.SilkS") (tstamp 587cd8b9-239c-475a-a20e-7ccc55172ca9))
  (fp_line (start 3.491 1.04) (end 3.491 1.319)
    (stroke (width 0.12) (type solid)) (layer "F.SilkS") (tstamp 46d624dc-0db8-4edf-96d7-204f36f79774))
  (fp_line (start 3.531 -1.251) (end 3.531 -1.04)
    (stroke (width 0.12) (type solid)) (layer "F.SilkS") (tstamp d19453d5-33ae-469a-95c0-867d1082dc10))
  (fp_line (start 3.531 1.04) (end 3.531 1.251)
    (stroke (width 0.12) (type solid)) (layer "F.SilkS") (tstamp cd7d1f45-c3a8-49a5-bf60-0d5aa1564fd4))
  (fp_line (start 3.571 -1.178) (end 3.571 1.178)
    (stroke (width 0.12) (type solid)) (layer "F.SilkS") (tstamp faea5154-a86a-49a9-abeb-bd014b77d600))
  (fp_line (start 3.611 -1.098) (end 3.611 1.098)
    (stroke (width 0.12) (type solid)) (layer "F.SilkS") (tstamp 2f4b6021-08a7-42e7-b8c8-772d84524e89))
  (fp_line (start 3.651 -1.011) (end 3.651 1.011)
    (stroke (width 0.12) (type solid)) (layer "F.SilkS") (tstamp 0e253435-775e-4980-9306-0cb14c9e8a2a))
  (fp_line (start 3.691 -0.915) (end 3.691 0.915)
    (stroke (width 0.12) (type solid)) (layer "F.SilkS") (tstamp 39884fdb-2f92-4f91-9bf0-f0e2c97fbe0a))
  (fp_line (start 3.731 -0.805) (end 3.731 0.805)
    (stroke (width 0.12) (type solid)) (layer "F.SilkS") (tstamp 0ec230ab-98bf-4278-8a6e-f4e8d16dfe07))
  (fp_line (start 3.771 -0.677) (end 3.771 0.677)
    (stroke (width 0.12) (type solid)) (layer "F.SilkS") (tstamp 47ee523c-cdb1-4e09-a5f1-c0dc4100b99e))
  (fp_line (start 3.811 -0.518) (end 3.811 0.518)
    (stroke (width 0.12) (type solid)) (layer "F.SilkS") (tstamp 949565ca-f04b-41d6-8e0d-5e0c7017bdf3))
  (fp_line (start 3.851 -0.284) (end 3.851 0.284)
    (stroke (width 0.12) (type solid)) (layer "F.SilkS") (tstamp 773bd540-1b7e-4c05-8d5c-47f507530af7))
  (fp_circle (center 1.25 0) (end 3.87 0)
    (stroke (width 0.12) (type solid)) (fill none) (layer "F.SilkS") (tstamp 2648760f-7789-4a29-afd7-99b5f3f3bfd3))
  (fp_circle (center 1.25 0) (end 4 0)
    (stroke (width 0.05) (type solid)) (fill none) (layer "F.CrtYd") (tstamp 2069792a-8dbd-48e0-82d8-8e1d85825adf))
  (fp_line (start -0.883605 -1.0875) (end -0.383605 -1.0875)
    (stroke (width 0.1) (type solid)) (layer "F.Fab") (tstamp 4588c0c2-8a36-462c-a73a-83b217c83aec))
  (fp_line (start -0.633605 -1.3375) (end -0.633605 -0.8375)
    (stroke (width 0.1) (type solid)) (layer "F.Fab") (tstamp 99d9ba2a-0f3e-4fba-bc18-2eb845fe50b4))
  (fp_circle (center 1.25 0) (end 3.75 0)
    (stroke (width 0.1) (type solid)) (fill none) (layer "F.Fab") (tstamp 50814723-8756-41d5-b737-24a960862c5f))
  (pad "1" thru_hole rect (at 0 0) (size 2 2) (drill 0.8) (layers "*.Cu" "*.Mask") (tstamp 952bef68-a5cc-4b7c-9528-928eaaf7f387))
  (pad "2" thru_hole circle (at 2.5 0) (size 2 2) (drill 0.8) (layers "*.Cu" "*.Mask") (tstamp bfebc703-fa19-4faa-86ad-f8a24cf52f2d))
  (model "${KISYS3DMOD}/Capacitor_THT.3dshapes/CP_Radial_D5.0mm_P2.50mm.wrl"
    (offset (xyz 0 0 0))
    (scale (xyz 1 1 1))
    (rotate (xyz 0 0 0))
  )
)
