(footprint "TC33X-2" (version 20221018) (generator pcbnew)
  (layer "F.Cu")
  (descr "TC33X-2_1")
  (tags "Variable Resistor")
  (attr smd)
  (fp_text reference "VR**" (at 0 0.168) (layer "F.SilkS")
      (effects (font (size 1.27 1.27) (thickness 0.254)))
    (tstamp fc285d4b-deb5-459a-a069-401d436fbf3d)
  )
  (fp_text value "TC33X2503E" (at 0 0.168) (layer "F.SilkS") hide
      (effects (font (size 1.27 1.27) (thickness 0.254)))
    (tstamp 9ee3ba9d-9967-4637-ac1f-60b3e20325d3)
  )
  (fp_text user "${REFERENCE}" (at 0 0.168) (layer "F.Fab")
      (effects (font (size 1.27 1.27) (thickness 0.254)))
    (tstamp 1782f7b8-0df6-4390-83e0-4706619213c2)
  )
  (fp_line (start -1.8 -1.9) (end -1.8 1.9)
    (stroke (width 0.2) (type solid)) (layer "F.SilkS") (tstamp 007822c6-d3e9-485b-a2aa-266cc6891484))
  (fp_line (start -1.052 2.625) (end -1.052 2.625)
    (stroke (width 0.022) (type solid)) (layer "F.SilkS") (tstamp 254192a4-78e1-4a5a-90b2-0847e6fe77da))
  (fp_line (start -1.03 2.625) (end -1.03 2.625)
    (stroke (width 0.022) (type solid)) (layer "F.SilkS") (tstamp a9f76d2f-c0e1-4693-80b8-9fdd2530c356))
  (fp_line (start 1.8 1.9) (end 1.8 -1.9)
    (stroke (width 0.2) (type solid)) (layer "F.SilkS") (tstamp 3dbe3e3c-cc0f-4870-9901-c695c4c46f25))
  (fp_arc (start -1.052 2.625) (mid -1.041 2.614) (end -1.03 2.625)
    (stroke (width 0.022) (type solid)) (layer "F.SilkS") (tstamp 8cc90022-fedb-49ee-9eb4-ce9f1ce25ed9))
  (fp_arc (start -1.03 2.625) (mid -1.041 2.636) (end -1.052 2.625)
    (stroke (width 0.022) (type solid)) (layer "F.SilkS") (tstamp cf8524b2-a59c-490a-a4f5-4655e8071e3c))
  (fp_line (start -2.8 -3.3) (end 2.8 -3.3)
    (stroke (width 0.1) (type solid)) (layer "F.CrtYd") (tstamp 562c3eaa-a6c6-498a-a126-aad477433c4b))
  (fp_line (start -2.8 3.636) (end -2.8 -3.3)
    (stroke (width 0.1) (type solid)) (layer "F.CrtYd") (tstamp e2aa80a0-6528-4395-bda0-0bc7dcf49ee4))
  (fp_line (start 2.8 -3.3) (end 2.8 3.636)
    (stroke (width 0.1) (type solid)) (layer "F.CrtYd") (tstamp 1d0827fa-c759-4997-9328-e27a31771721))
  (fp_line (start 2.8 3.636) (end -2.8 3.636)
    (stroke (width 0.1) (type solid)) (layer "F.CrtYd") (tstamp 3d621476-c9f5-4cf8-ba44-ccdda3b054c1))
  (fp_line (start -1.8 -1.9) (end 1.8 -1.9)
    (stroke (width 0.2) (type solid)) (layer "F.Fab") (tstamp 44221b01-6415-4285-962a-c8c0e8f216d4))
  (fp_line (start -1.8 1.9) (end -1.8 -1.9)
    (stroke (width 0.2) (type solid)) (layer "F.Fab") (tstamp 3d8f4cc4-b726-4b79-b043-481a7ab53dd5))
  (fp_line (start 1.8 -1.9) (end 1.8 1.9)
    (stroke (width 0.2) (type solid)) (layer "F.Fab") (tstamp a271c178-8a67-40d1-a6cc-6f03b7cbf934))
  (fp_line (start 1.8 1.9) (end -1.8 1.9)
    (stroke (width 0.2) (type solid)) (layer "F.Fab") (tstamp 92aafe2e-8680-4ce1-a9f0-9712e91b2cad))
  (pad "1" smd rect (at -1 1.7 90) (size 1.2 1.2) (layers "F.Cu" "F.Paste" "F.Mask") (tstamp cb8fe1f0-5854-42b5-95ba-0ec480af1ba5))
  (pad "2" smd rect (at 0 -1.55 90) (size 1.5 1.6) (layers "F.Cu" "F.Paste" "F.Mask") (tstamp ef80a83d-f371-4a01-ae4b-972882aa1bda))
  (pad "3" smd rect (at 1 1.7 90) (size 1.2 1.2) (layers "F.Cu" "F.Paste" "F.Mask") (tstamp c8d6d0b7-141f-46b2-ac33-a8751234a935))
  (model "../3D/TC33X-2-102E.stp"
    (offset (xyz 0 0 0.279999997))
    (scale (xyz 1 1 1))
    (rotate (xyz -90 0 0))
  )
)
