(module DIPS762W50P254L1016H460Q8N (layer F.Cu) (tedit 5F5C2994)
  (descr 2227MC-08-03-18-F1)
  (tags "Undefined or Miscellaneous")
  (fp_text reference U** (at 0 0) (layer F.SilkS)
    (effects (font (size 1.27 1.27) (thickness 0.254)))
  )
  (fp_text value DIPS762W50P254L1016H460Q8N (at 0 0) (layer F.SilkS) hide
    (effects (font (size 1.27 1.27) (thickness 0.254)))
  )
  (fp_line (start -1.27 -1.27) (end -1.27 0) (layer F.SilkS) (width 0.2))
  (fp_line (start 8.89 -1.27) (end -1.27 -1.27) (layer F.SilkS) (width 0.2))
  (fp_line (start -1.27 8.89) (end 8.89 8.89) (layer F.SilkS) (width 0.2))
  (fp_line (start -1.27 0) (end 0 -1.27) (layer F.Fab) (width 0.1))
  (fp_line (start -1.27 8.89) (end -1.27 -1.27) (layer F.Fab) (width 0.1))
  (fp_line (start 8.89 8.89) (end -1.27 8.89) (layer F.Fab) (width 0.1))
  (fp_line (start 8.89 -1.27) (end 8.89 8.89) (layer F.Fab) (width 0.1))
  (fp_line (start -1.27 -1.27) (end 8.89 -1.27) (layer F.Fab) (width 0.1))
  (fp_line (start -1.52 9.14) (end -1.52 -1.52) (layer F.CrtYd) (width 0.05))
  (fp_line (start 9.14 9.14) (end -1.52 9.14) (layer F.CrtYd) (width 0.05))
  (fp_line (start 9.14 -1.52) (end 9.14 9.14) (layer F.CrtYd) (width 0.05))
  (fp_line (start -1.52 -1.52) (end 9.14 -1.52) (layer F.CrtYd) (width 0.05))
  (fp_text user %R (at 0 0) (layer F.Fab)
    (effects (font (size 1.27 1.27) (thickness 0.254)))
  )
  (pad 1 thru_hole rect (at 0 0) (size 1.7 1.7) (drill 0.8) (layers *.Cu *.Mask))
  (pad 2 thru_hole circle (at 0 2.54) (size 1.7 1.7) (drill 0.8) (layers *.Cu *.Mask))
  (pad 3 thru_hole circle (at 0 5.08) (size 1.7 1.7) (drill 0.8) (layers *.Cu *.Mask))
  (pad 4 thru_hole circle (at 0 7.62) (size 1.7 1.7) (drill 0.8) (layers *.Cu *.Mask))
  (pad 5 thru_hole circle (at 7.62 7.62) (size 1.7 1.7) (drill 0.8) (layers *.Cu *.Mask))
  (pad 6 thru_hole circle (at 7.62 5.08) (size 1.7 1.7) (drill 0.8) (layers *.Cu *.Mask))
  (pad 7 thru_hole circle (at 7.62 2.54) (size 1.7 1.7) (drill 0.8) (layers *.Cu *.Mask))
  (pad 8 thru_hole circle (at 7.62 0) (size 1.7 1.7) (drill 0.8) (layers *.Cu *.Mask))
)
