(footprint "LED_D3.0mm" (version 20221018) (generator pcbnew)
  (layer "F.Cu")
  (descr "LED, diameter 3.0mm, 2 pins")
  (tags "LED diameter 3.0mm 2 pins")
  (attr through_hole)
  (fp_text reference "REF**" (at 1.27 -2.96) (layer "F.SilkS")
      (effects (font (size 1 1) (thickness 0.15)))
    (tstamp eac62372-42f9-46a3-9c3c-e987712ee65a)
  )
  (fp_text value "LED_D3.0mm" (at 1.27 2.96) (layer "F.Fab")
      (effects (font (size 1 1) (thickness 0.15)))
    (tstamp 8f115280-5d5d-46bd-a2ce-2be2bb505d66)
  )
  (fp_line (start -0.29 -1.236) (end -0.29 -1.08)
    (stroke (width 0.12) (type solid)) (layer "F.SilkS") (tstamp a06504ec-c9de-4f00-bb1b-598e09c5cd6a))
  (fp_line (start -0.29 1.08) (end -0.29 1.236)
    (stroke (width 0.12) (type solid)) (layer "F.SilkS") (tstamp a26f575d-215b-4815-b70f-68eb9cf78eed))
  (fp_arc (start -0.29 -1.235516) (mid 1.366487 -1.987659) (end 2.942335 -1.078608)
    (stroke (width 0.12) (type solid)) (layer "F.SilkS") (tstamp 8ec8d952-b5de-40fc-b2fc-eb1ecdf3df0c))
  (fp_arc (start 0.229039 -1.08) (mid 1.270117 -1.5) (end 2.31113 -1.079837)
    (stroke (width 0.12) (type solid)) (layer "F.SilkS") (tstamp 28b969ca-31fb-43cf-951d-6f41f892384b))
  (fp_arc (start 2.31113 1.079837) (mid 1.270117 1.5) (end 0.229039 1.08)
    (stroke (width 0.12) (type solid)) (layer "F.SilkS") (tstamp 82584e08-b6c5-4b41-9633-367b89a27f30))
  (fp_arc (start 2.942335 1.078608) (mid 1.366487 1.987659) (end -0.29 1.235516)
    (stroke (width 0.12) (type solid)) (layer "F.SilkS") (tstamp cd2a3a65-ec2f-4a07-9a95-64b145d03147))
  (fp_line (start -1.15 -2.25) (end -1.15 2.25)
    (stroke (width 0.05) (type solid)) (layer "F.CrtYd") (tstamp 2f78a241-e68c-4448-8d27-62eb12a09d3c))
  (fp_line (start -1.15 2.25) (end 3.7 2.25)
    (stroke (width 0.05) (type solid)) (layer "F.CrtYd") (tstamp cc02e4e6-a6a8-4373-ad72-e681f7874fd5))
  (fp_line (start 3.7 -2.25) (end -1.15 -2.25)
    (stroke (width 0.05) (type solid)) (layer "F.CrtYd") (tstamp 84ec24a2-b392-46a9-913d-e564808f7d82))
  (fp_line (start 3.7 2.25) (end 3.7 -2.25)
    (stroke (width 0.05) (type solid)) (layer "F.CrtYd") (tstamp 6d426319-1b01-4cf6-ae88-a2141c664bc8))
  (fp_line (start -0.23 -1.16619) (end -0.23 1.16619)
    (stroke (width 0.1) (type solid)) (layer "F.Fab") (tstamp e0cf9c68-ba0b-44d0-b73f-f9729a3d968a))
  (fp_arc (start -0.23 -1.16619) (mid 3.17 0.000452) (end -0.230555 1.165476)
    (stroke (width 0.1) (type solid)) (layer "F.Fab") (tstamp 64177567-6ea3-4542-9c56-9e9e50aed959))
  (fp_circle (center 1.27 0) (end 2.77 0)
    (stroke (width 0.1) (type solid)) (fill none) (layer "F.Fab") (tstamp f87efd93-57e6-49db-8ee3-7fcba0ba9105))
  (pad "1" thru_hole rect (at 0 0) (size 2 2) (drill 1) (layers "*.Cu" "*.Mask") (tstamp 1ae1c58e-b1f9-419b-b468-1f71bfa2a874))
  (pad "2" thru_hole circle (at 2.54 0) (size 2 2) (drill 1) (layers "*.Cu" "*.Mask") (tstamp 36a5f534-800e-4a91-bc1b-7115a318a593))
  (model "${KISYS3DMOD}/LED_THT.3dshapes/LED_D3.0mm.wrl"
    (offset (xyz 0 0 0))
    (scale (xyz 1 1 1))
    (rotate (xyz 0 0 0))
  )
)
