(footprint "LHL08NB470K" (version 20221018) (generator pcbnew)
  (layer "F.Cu")
  (descr "LHL08NB470K-2")
  (tags "Inductor")
  (attr through_hole)
  (fp_text reference "L**" (at 2 0) (layer "F.SilkS")
      (effects (font (size 1.27 1.27) (thickness 0.254)))
    (tstamp e0ec8d61-aa64-4cec-b0bc-2f4beb6f128f)
  )
  (fp_text value "LHL08NB470K" (at 2 0) (layer "F.SilkS") hide
      (effects (font (size 1.27 1.27) (thickness 0.254)))
    (tstamp 76423a31-0a70-4e3b-b79f-6e8872f01c2f)
  )
  (fp_text user "${REFERENCE}" (at 2 0) (layer "F.Fab")
      (effects (font (size 1.27 1.27) (thickness 0.254)))
    (tstamp 80b0343e-db45-4acd-a70c-326bac8ef22d)
  )
  (fp_line (start -3 0) (end -3 0)
    (stroke (width 0.2) (type solid)) (layer "F.SilkS") (tstamp 3765b6bb-a4fe-405e-8603-ea6cfe1ae694))
  (fp_line (start -3 0) (end -3 0)
    (stroke (width 0.2) (type solid)) (layer "F.SilkS") (tstamp 92613e7c-0212-4752-b60d-a83b53f79604))
  (fp_line (start -2.9 0) (end -2.9 0)
    (stroke (width 0.2) (type solid)) (layer "F.SilkS") (tstamp 8eb8a804-2760-4bed-9b97-3313509572cf))
  (fp_line (start -2 -4.5) (end 7 -4.5)
    (stroke (width 0.1) (type solid)) (layer "F.SilkS") (tstamp 86170b5b-c8ce-4fa6-8232-cc4e8e3e6f4f))
  (fp_line (start -2 4.5) (end -2 -4.5)
    (stroke (width 0.1) (type solid)) (layer "F.SilkS") (tstamp 455f322a-dca9-4ec5-b994-172aaa5debc8))
  (fp_line (start 7 -4.5) (end 7 4.5)
    (stroke (width 0.1) (type solid)) (layer "F.SilkS") (tstamp 4f5a88ce-cfa1-4c54-9463-c8632aaf5be9))
  (fp_line (start 7 4.5) (end -2 4.5)
    (stroke (width 0.1) (type solid)) (layer "F.SilkS") (tstamp 9a537c34-9720-4b2e-9eed-bc12ddb21515))
  (fp_arc (start -3 0) (mid -2.95 -0.05) (end -2.9 0)
    (stroke (width 0.2) (type solid)) (layer "F.SilkS") (tstamp 41204fe2-01d4-4ae2-b980-7bef2f58ca6b))
  (fp_arc (start -2.9 0) (mid -2.95 0.05) (end -3 0)
    (stroke (width 0.2) (type solid)) (layer "F.SilkS") (tstamp 3082e8ff-12bd-4308-8340-07f9bd766584))
  (fp_arc (start -2.9 0) (mid -2.95 0.05) (end -3 0)
    (stroke (width 0.2) (type solid)) (layer "F.SilkS") (tstamp 7d0c71dc-384d-40b2-94ee-ba1c31ff1386))
  (fp_line (start -4 -5.5) (end 8 -5.5)
    (stroke (width 0.1) (type solid)) (layer "F.CrtYd") (tstamp 3acdab30-2778-472e-aa97-f6fd6712956a))
  (fp_line (start -4 5.5) (end -4 -5.5)
    (stroke (width 0.1) (type solid)) (layer "F.CrtYd") (tstamp 32bd7114-e977-4aa3-8f32-44807b0356c4))
  (fp_line (start 8 -5.5) (end 8 5.5)
    (stroke (width 0.1) (type solid)) (layer "F.CrtYd") (tstamp 517b4c7d-fb0c-40f0-b895-05790ffda22e))
  (fp_line (start 8 5.5) (end -4 5.5)
    (stroke (width 0.1) (type solid)) (layer "F.CrtYd") (tstamp 1467ec1a-9c27-4860-909c-dbae2a8228fe))
  (fp_line (start -2 -4.5) (end -2 4.5)
    (stroke (width 0.2) (type solid)) (layer "F.Fab") (tstamp 89e5a3fa-5fb6-4b87-8860-c39fbc07459b))
  (fp_line (start -2 4.5) (end 7 4.5)
    (stroke (width 0.2) (type solid)) (layer "F.Fab") (tstamp 22e84822-9122-4ddc-ad6a-52a4b9db8389))
  (fp_line (start 7 -4.5) (end -2 -4.5)
    (stroke (width 0.2) (type solid)) (layer "F.Fab") (tstamp 55b73cee-e803-4c8a-9821-b255232a2cfa))
  (fp_line (start 7 4.5) (end 7 -4.5)
    (stroke (width 0.2) (type solid)) (layer "F.Fab") (tstamp b65a4b2a-269f-45da-8f50-836e33f895cc))
  (pad "1" thru_hole circle (at 0 0) (size 2 2) (drill 0.8) (layers "*.Cu" "*.Mask") (tstamp c0f7378d-bc7d-4bc5-a7c8-dbc3651f23b8))
  (pad "2" thru_hole circle (at 5 0) (size 2 2) (drill 0.88) (layers "*.Cu" "*.Mask") (tstamp cfe30900-a995-4e0b-bb13-19ef15d6b871))
  (model "../3D/LHL08NB470K.stp"
    (offset (xyz 0 0 0))
    (scale (xyz 1 1 1))
    (rotate (xyz 0 0 0))
  )
)
