(footprint "TO254P470X1028X1955-3P" (version 20211014) (generator pcbnew)
  (layer "F.Cu")
  (tedit 5FE458C3)
  (descr "NDE0003B")
  (tags "Undefined or Miscellaneous")
  (attr through_hole)
  (fp_text reference "U**" (at 0 0) (layer "F.SilkS")
    (effects (font (size 1.27 1.27) (thickness 0.254)))
    (tstamp 4af76680-f744-48db-9ed9-91c7f53fb4fc)
  )
  (fp_text value "TO254P470X1028X1955-3P" (at 0 0) (layer "F.SilkS") hide
    (effects (font (size 1.27 1.27) (thickness 0.254)))
    (tstamp cf1d1c80-e13a-48f9-9497-1ecff318cb83)
  )
  (fp_text user "${REFERENCE}" (at 0 0) (layer "F.Fab")
    (effects (font (size 1.27 1.27) (thickness 0.254)))
    (tstamp c85f7d3a-2e7e-4d52-a274-225d209e349c)
  )
  (fp_line (start 7.81 -3.2) (end -2.73 -3.2) (layer "F.SilkS") (width 0.2) (tstamp 44cac80c-cdbf-41d4-85d5-49c8c4b31caf))
  (fp_line (start 7.81 1.5) (end 7.81 -3.2) (layer "F.SilkS") (width 0.2) (tstamp 8da1467e-f7eb-4ced-be48-10686d8c5443))
  (fp_line (start -2.73 -3.2) (end -2.73 0) (layer "F.SilkS") (width 0.2) (tstamp e52761ca-077f-4f00-8f16-49c1a8aec9c5))
  (fp_line (start -2.98 -3.45) (end 8.06 -3.45) (layer "F.CrtYd") (width 0.05) (tstamp 70096901-83ef-4abc-9077-2839cc2b4daa))
  (fp_line (start 8.06 -3.45) (end 8.06 1.75) (layer "F.CrtYd") (width 0.05) (tstamp 8c47ef89-d2c8-4157-adb7-0b8dc1e13d30))
  (fp_line (start -2.98 1.75) (end -2.98 -3.45) (layer "F.CrtYd") (width 0.05) (tstamp a06ca685-2b75-47be-be3c-6a2072fc6192))
  (fp_line (start 8.06 1.75) (end -2.98 1.75) (layer "F.CrtYd") (width 0.05) (tstamp fb265fd3-eced-4008-9f22-fff44be2655b))
  (fp_line (start 7.81 -3.2) (end 7.81 1.5) (layer "F.Fab") (width 0.1) (tstamp 067b0914-aee8-4e04-9f00-d31992a04f78))
  (fp_line (start 7.81 1.5) (end -2.73 1.5) (layer "F.Fab") (width 0.1) (tstamp 16e294cf-3d44-42e7-a028-cde14f49ad8b))
  (fp_line (start -2.73 1.5) (end -2.73 -3.2) (layer "F.Fab") (width 0.1) (tstamp 18354add-8be8-4160-9cea-727f3944d23a))
  (fp_line (start -2.73 -1.93) (end -1.46 -3.2) (layer "F.Fab") (width 0.1) (tstamp 705e2fc2-413d-4dd9-8cd7-85a3e55a0024))
  (fp_line (start -2.73 -3.2) (end 7.81 -3.2) (layer "F.Fab") (width 0.1) (tstamp a71f7451-ffd3-4ae7-926f-18ce903b13f9))
  (pad "1" thru_hole rect (at 0 0) (size 1.935 1.935) (drill 1) (layers *.Cu *.Mask) (tstamp da45e304-8f17-4209-bc76-72d42588a32c))
  (pad "2" thru_hole circle (at 2.54 0) (size 1.935 1.935) (drill 1) (layers *.Cu *.Mask) (tstamp d1c08a01-cd7f-463b-9f4d-9138cc21049c))
  (pad "3" thru_hole circle (at 5.08 0) (size 1.935 1.935) (drill 1) (layers *.Cu *.Mask) (tstamp d2bdc506-95df-4d56-852e-910a8d01b8b7))
  (model "${SENKOUKA_LIB}/3D/LM2940CT-12_NOPB.stp"
    (offset (xyz 0 0 0))
    (scale (xyz 1 1 1))
    (rotate (xyz 0 0 0))
  )
)
