(footprint "INA260 VOLT CURRENT POWER SENSOR" (version 20211014) (generator pcbnew)
  (layer "F.Cu")
  (tedit 0)
  (attr smd)
  (fp_text reference "REF**" (at 10.16 -7.62 unlocked) (layer "F.SilkS")
    (effects (font (size 1 1) (thickness 0.15)))
    (tstamp f95756bb-6c45-41fc-9c39-9ff3b9234d82)
  )
  (fp_text value "INA260 VOLT CURRENT POWER SENSOR" (at 7.62 5.08 unlocked) (layer "F.Fab")
    (effects (font (size 1 1) (thickness 0.15)))
    (tstamp ee962154-2c2d-4e53-bfab-cf92a9ef6920)
  )
  (fp_text user "${REFERENCE}" (at 10.16 -10.16 unlocked) (layer "F.Fab")
    (effects (font (size 1 1) (thickness 0.15)))
    (tstamp 4315422e-b20d-4628-a309-df2fb3e4dfd5)
  )
  (fp_rect (start -2.54 2.54) (end 20.32 -20.32) (layer "F.SilkS") (width 0.12) (fill none) (tstamp 02830542-5483-4725-b556-8d0a1a80da66))
  (pad "" np_thru_hole circle (at 17.78 -17.78) (size 5.08 5.08) (drill 2.54) (layers F&B.Cu *.Mask) (tstamp 0a38a8bf-cbd2-48f2-962d-a8f6dd54b672))
  (pad "" np_thru_hole circle (at 0 -17.78) (size 5.08 5.08) (drill 2.54) (layers F&B.Cu *.Mask) (tstamp a2f2e745-4084-4686-a7a5-103492124bfc))
  (pad "1" thru_hole circle (at 0 0) (size 2 2) (drill 1) (layers *.Cu *.Mask) (tstamp 210acabc-f5a6-4a5a-b7e7-91bca891a21c))
  (pad "2" thru_hole circle (at 2.54 0) (size 2 2) (drill 1) (layers *.Cu *.Mask) (tstamp b1973518-b903-4160-81bf-b60d50d4b13f))
  (pad "3" thru_hole circle (at 5.08 0) (size 2 2) (drill 1) (layers *.Cu *.Mask) (tstamp 94d3d832-b170-4932-a72d-b22d735d1c56))
  (pad "4" thru_hole circle (at 7.62 0) (size 2 2) (drill 1) (layers *.Cu *.Mask) (tstamp b0a2cd15-4b7f-4276-929a-3ecd5c931852))
  (pad "5" thru_hole circle (at 10.16 0) (size 2 2) (drill 1) (layers *.Cu *.Mask) (tstamp a09dede6-79f3-4bac-889e-731f71beed07))
  (pad "6" thru_hole circle (at 12.7 0) (size 2 2) (drill 1) (layers *.Cu *.Mask) (tstamp 4b0b1a04-c9eb-4589-82be-4767e8242359))
  (pad "7" thru_hole circle (at 15.24 0) (size 2 2) (drill 1) (layers *.Cu *.Mask) (tstamp 2d53cb8f-fc01-444b-a0a9-c8980713fbf9))
  (pad "8" thru_hole circle (at 17.78 0) (size 2 2) (drill 1) (layers *.Cu *.Mask) (tstamp c2f44710-720e-4b85-bc78-b133eec78bb5))
)
