(footprint "TO254P465X1016X1935-3P" (version 20211014) (generator pcbnew)
  (layer "F.Cu")
  (tedit 60D3D636)
  (descr "TO-220")
  (tags "Transistor")
  (attr through_hole)
  (fp_text reference "Q**" (at 0 0) (layer "F.SilkS")
    (effects (font (size 1.27 1.27) (thickness 0.254)))
    (tstamp 7067e65b-b40c-4b01-9faa-b01627bf9899)
  )
  (fp_text value "TO254P465X1016X1935-3P" (at 0 0) (layer "F.SilkS") hide
    (effects (font (size 1.27 1.27) (thickness 0.254)))
    (tstamp 3f924721-9c84-4cb2-8374-6d1caea39f15)
  )
  (fp_text user "${REFERENCE}" (at 0 0) (layer "F.Fab")
    (effects (font (size 1.27 1.27) (thickness 0.254)))
    (tstamp 9a8eede7-a052-4d52-adee-26dcb2b9209e)
  )
  (fp_line (start 7.72 -2.94) (end -2.64 -2.94) (layer "F.SilkS") (width 0.2) (tstamp 00bcc08e-4341-43e4-9bdd-8af1818f5594))
  (fp_line (start 7.72 1.71) (end 7.72 -2.94) (layer "F.SilkS") (width 0.2) (tstamp 7317d5eb-d860-4f82-b23c-41042319f7a4))
  (fp_line (start -2.64 -2.94) (end -2.64 0) (layer "F.SilkS") (width 0.2) (tstamp b37e5d95-0048-4f70-925c-4f5ca8b70aba))
  (fp_line (start 7.97 1.96) (end -2.89 1.96) (layer "F.CrtYd") (width 0.05) (tstamp 191ad869-79b4-4e07-aec2-3191495af745))
  (fp_line (start 7.97 -3.19) (end 7.97 1.96) (layer "F.CrtYd") (width 0.05) (tstamp 3bd18d06-5cc7-4b4b-a2d4-1e5039e18e38))
  (fp_line (start -2.89 1.96) (end -2.89 -3.19) (layer "F.CrtYd") (width 0.05) (tstamp 7827c257-787a-43f5-a026-9ccd97226778))
  (fp_line (start -2.89 -3.19) (end 7.97 -3.19) (layer "F.CrtYd") (width 0.05) (tstamp c62e88b0-8c6f-4b8a-9eae-f3f15a67c616))
  (fp_line (start 7.72 -2.94) (end 7.72 1.71) (layer "F.Fab") (width 0.1) (tstamp 115d90f2-cb5c-4269-a5b5-d5afb81968d0))
  (fp_line (start 7.72 1.71) (end -2.64 1.71) (layer "F.Fab") (width 0.1) (tstamp 16a0e138-b943-4c94-bf3b-77f6e834fed0))
  (fp_line (start -2.64 1.71) (end -2.64 -2.94) (layer "F.Fab") (width 0.1) (tstamp 4ec4fc29-6fed-468b-b4cc-0ac0abaef669))
  (fp_line (start -2.64 -2.94) (end 7.72 -2.94) (layer "F.Fab") (width 0.1) (tstamp 9610b678-0c7b-4961-a8d3-f73c15aadeb9))
  (fp_line (start -2.64 -1.67) (end -1.37 -2.94) (layer "F.Fab") (width 0.1) (tstamp b5ca243f-f5bc-49e1-9c8d-d37e0c819858))
  (pad "1" thru_hole rect (at 0 0) (size 2 2) (drill 1) (layers *.Cu *.Mask) (tstamp 5bec7477-3a41-4709-95d6-7ad99d654107))
  (pad "2" thru_hole circle (at 2.54 0) (size 2 2) (drill 1) (layers *.Cu *.Mask) (tstamp f540fac3-da26-457e-8b96-44895574b37b))
  (pad "3" thru_hole circle (at 5.08 0) (size 2 2) (drill 1) (layers *.Cu *.Mask) (tstamp 50ceefe8-8d3a-45dd-8d4a-dad4fc304965))
  (model "${SENKOUKA_LIB}/3D/TK40E06N1,S1X_S.stp"
    (offset (xyz 0 0 0))
    (scale (xyz 1 1 1))
    (rotate (xyz 0 0 0))
  )
)
