(footprint "kata_PinHeader_2x05_P2.54mm_Vertical" (version 20211014) (generator pcbnew)
  (layer "F.Cu")
  (tedit 61761516)
  (descr "Through hole straight pin header, 2x05, 2.54mm pitch, double rows")
  (tags "Through hole pin header THT 2x05 2.54mm double row")
  (attr through_hole)
  (fp_text reference "REF**" (at 1.27 -2.33) (layer "F.SilkS")
    (effects (font (size 1 1) (thickness 0.15)))
    (tstamp e0f69bb1-c817-4d3d-bd0f-5fca8e081223)
  )
  (fp_text value "kata_PinHeader_2x05_P2.54mm_Vertical" (at 1.27 12.49) (layer "F.Fab")
    (effects (font (size 1 1) (thickness 0.15)))
    (tstamp 87cf7ed6-eb20-49a1-a728-f9144d7747f3)
  )
  (fp_text user "${REFERENCE}" (at 1.27 5.08 90) (layer "F.Fab")
    (effects (font (size 1 1) (thickness 0.15)))
    (tstamp bd9bd38d-2615-46ea-855d-4d83983f6a7e)
  )
  (fp_line (start -1.33 11.49) (end 3.87 11.49) (layer "F.SilkS") (width 0.12) (tstamp 1e3d35cf-66dd-492c-8d56-2f20998cf6e4))
  (fp_line (start -1.33 1.27) (end -1.33 11.49) (layer "F.SilkS") (width 0.12) (tstamp 36493e0d-2e33-4f30-aa28-cf0d76c65ab0))
  (fp_line (start -1.33 0) (end -1.33 -1.33) (layer "F.SilkS") (width 0.12) (tstamp 3ec6a423-f791-4587-9449-0d307062416c))
  (fp_line (start 1.27 1.27) (end 1.27 -1.33) (layer "F.SilkS") (width 0.12) (tstamp 88376a0a-a4c6-495a-9e20-08c07fa6ceb7))
  (fp_line (start 3.87 -1.33) (end 3.87 11.49) (layer "F.SilkS") (width 0.12) (tstamp e5cdf1e3-04cf-4561-ae18-fb0f94d4bfa8))
  (fp_line (start 1.27 -1.33) (end 3.87 -1.33) (layer "F.SilkS") (width 0.12) (tstamp ee4fdc76-b9b6-454b-a3e3-5f66af2f649a))
  (fp_line (start -1.33 -1.33) (end 0 -1.33) (layer "F.SilkS") (width 0.12) (tstamp f291f87d-9aff-4a43-8b54-817980cdd310))
  (fp_line (start -1.33 1.27) (end 1.27 1.27) (layer "F.SilkS") (width 0.12) (tstamp ffcdd3d8-b2f3-4746-8b88-87c324911cf0))
  (fp_line (start 4.35 -1.8) (end -1.8 -1.8) (layer "F.CrtYd") (width 0.05) (tstamp 0ee17aae-46e7-406f-8cfe-cbb279f3250a))
  (fp_line (start 4.35 11.95) (end 4.35 -1.8) (layer "F.CrtYd") (width 0.05) (tstamp 19a739c5-998e-4978-a610-8b304717628a))
  (fp_line (start -1.8 11.95) (end 4.35 11.95) (layer "F.CrtYd") (width 0.05) (tstamp ce4ff233-fbcf-4cba-bcaa-b866caa90203))
  (fp_line (start -1.8 -1.8) (end -1.8 11.95) (layer "F.CrtYd") (width 0.05) (tstamp df668594-1c9d-457e-b6bb-ecb64fc4d060))
  (fp_line (start 3.81 -1.27) (end 3.81 11.43) (layer "F.Fab") (width 0.1) (tstamp 30073958-f485-40bf-98c7-ae8423183488))
  (fp_line (start 0 -1.27) (end 3.81 -1.27) (layer "F.Fab") (width 0.1) (tstamp 4b44c39c-9562-4130-99e6-03185960e6c0))
  (fp_line (start -1.27 0) (end 0 -1.27) (layer "F.Fab") (width 0.1) (tstamp 66a78455-011f-43b9-8a40-3697d09bf1ab))
  (fp_line (start -1.27 11.43) (end -1.27 0) (layer "F.Fab") (width 0.1) (tstamp b5866cf8-c305-4156-815e-156569e62ee4))
  (fp_line (start 3.81 11.43) (end -1.27 11.43) (layer "F.Fab") (width 0.1) (tstamp caeb7dd9-435a-4a46-8a18-bc39883f2fdb))
  (pad "1" thru_hole rect (at 0 0 90) (size 1.65 1.65) (drill 1) (layers *.Mask "B.Cu") (tstamp dd62cda0-001e-421d-a0a1-e14610a436f9))
  (pad "2" thru_hole circle (at 2.54 0) (size 1.65 1.65) (drill 1) (layers *.Mask "B.Cu") (tstamp fedd5c91-7062-49eb-9e63-e3556010d300))
  (pad "3" thru_hole circle (at 0 2.54) (size 1.65 1.65) (drill 1) (layers *.Mask "B.Cu") (tstamp 0f50f58c-d09c-4ec1-acfe-5bb9ba2ec8fb))
  (pad "4" thru_hole circle (at 2.54 2.54) (size 1.65 1.65) (drill 1) (layers *.Mask "B.Cu") (tstamp d0a19964-db60-442c-a0af-7def9384b79d))
  (pad "5" thru_hole circle (at 0 5.08) (size 1.65 1.65) (drill 1) (layers *.Mask "B.Cu") (tstamp 5be98994-a3c0-4fbf-9a76-535af9b59654))
  (pad "6" thru_hole circle (at 2.54 5.08) (size 1.65 1.65) (drill 1) (layers *.Mask "B.Cu") (tstamp 85aa97f7-c50a-4fa6-bbc1-9269aea1c688))
  (pad "7" thru_hole circle (at 0 7.62) (size 1.65 1.65) (drill 1) (layers *.Mask "B.Cu") (tstamp 8f633d52-90f8-4e52-bd07-545ac7425963))
  (pad "8" thru_hole circle (at 2.54 7.62) (size 1.65 1.65) (drill 1) (layers *.Mask "B.Cu") (tstamp 0e575748-2dc4-4ae1-a0c6-e3c1c1c00de6))
  (pad "9" thru_hole circle (at 0 10.16) (size 1.65 1.65) (drill 1) (layers *.Mask "B.Cu") (tstamp 50f4b5e4-fd7a-4e24-a94b-4b8cc900bc7d))
  (pad "10" thru_hole circle (at 2.54 10.16) (size 1.65 1.65) (drill 1) (layers *.Mask "B.Cu") (tstamp 41037edf-83d9-4a8d-8a9a-697279e09f34))
  (model "${KICAD6_3DMODEL_DIR}/Connector_PinHeader_2.54mm.3dshapes/PinHeader_2x05_P2.54mm_Vertical.wrl"
    (offset (xyz 0 0 0))
    (scale (xyz 1 1 1))
    (rotate (xyz 0 0 0))
  )
)
