(footprint "LBR-127HLD" (version 20221018) (generator pcbnew)
  (layer "F.Cu")
  (descr "LBR-127HLD")
  (tags "Undefined or Miscellaneous")
  (attr through_hole)
  (fp_text reference "U**" (at 0.225 0) (layer "F.SilkS")
      (effects (font (size 1.27 1.27) (thickness 0.254)))
    (tstamp 7c365923-3ad2-470d-9678-183a11e15061)
  )
  (fp_text value "LBR-127HLD" (at 0.225 0) (layer "F.SilkS") hide
      (effects (font (size 1.27 1.27) (thickness 0.254)))
    (tstamp 96fb593a-772d-4400-bb91-19cd151bf89c)
  )
  (fp_text user "${REFERENCE}" (at 0.225 0) (layer "F.Fab")
      (effects (font (size 1.27 1.27) (thickness 0.254)))
    (tstamp 454d4210-249d-42a6-a819-acf100de6a53)
  )
  (fp_line (start -4.35 -2.25) (end 4.35 -2.25)
    (stroke (width 0.1) (type solid)) (layer "F.SilkS") (tstamp c318f9f8-5ba5-4621-93ab-85d8058eb864))
  (fp_line (start -4.35 2.25) (end -4.35 -2.25)
    (stroke (width 0.1) (type solid)) (layer "F.SilkS") (tstamp 53a78826-1f6c-4945-afd5-8269d91bbdb6))
  (fp_line (start 4.35 -2.25) (end 4.35 2.25)
    (stroke (width 0.1) (type solid)) (layer "F.SilkS") (tstamp 4e0bb5d0-1c70-45ef-99bf-845b2706fae0))
  (fp_line (start 4.35 2.25) (end -4.35 2.25)
    (stroke (width 0.1) (type solid)) (layer "F.SilkS") (tstamp e131e761-4237-4608-850e-d3c091f9fce2))
  (fp_line (start 4.7 -2.54) (end 4.7 -2.54)
    (stroke (width 0.1) (type solid)) (layer "F.SilkS") (tstamp 46975e9b-7b76-4de0-8aef-7a3be54fa772))
  (fp_line (start 4.8 -2.54) (end 4.8 -2.54)
    (stroke (width 0.1) (type solid)) (layer "F.SilkS") (tstamp 0658f96b-f57a-48e3-a9ad-9e60cc96cbf7))
  (fp_arc (start 4.7 -2.54) (mid 4.75 -2.59) (end 4.8 -2.54)
    (stroke (width 0.1) (type solid)) (layer "F.SilkS") (tstamp 0664e564-5997-41cf-acd3-40f762f2cdc9))
  (fp_arc (start 4.8 -2.54) (mid 4.75 -2.49) (end 4.7 -2.54)
    (stroke (width 0.1) (type solid)) (layer "F.SilkS") (tstamp 96c6b52b-8619-4348-baf9-4da48e0bdfd4))
  (fp_line (start -5.35 -3.25) (end 5.8 -3.25)
    (stroke (width 0.1) (type solid)) (layer "F.CrtYd") (tstamp 3019b417-4024-4a38-b869-9e0187706738))
  (fp_line (start -5.35 3.25) (end -5.35 -3.25)
    (stroke (width 0.1) (type solid)) (layer "F.CrtYd") (tstamp b4cc4066-7440-400e-8271-8a2af52e1f61))
  (fp_line (start 5.8 -3.25) (end 5.8 3.25)
    (stroke (width 0.1) (type solid)) (layer "F.CrtYd") (tstamp 067ca189-be19-44c5-bdac-00099a579a25))
  (fp_line (start 5.8 3.25) (end -5.35 3.25)
    (stroke (width 0.1) (type solid)) (layer "F.CrtYd") (tstamp 42dc2918-adc8-455e-b59d-3376528911c8))
  (fp_line (start -4.35 -2.25) (end 4.35 -2.25)
    (stroke (width 0.2) (type solid)) (layer "F.Fab") (tstamp cfe2871d-8ead-473c-817c-3b8bf2cf7148))
  (fp_line (start -4.35 2.25) (end -4.35 -2.25)
    (stroke (width 0.2) (type solid)) (layer "F.Fab") (tstamp 1f9fcd67-7a2c-4a5e-ba4a-e65f08f7e5a6))
  (fp_line (start 4.35 -2.25) (end 4.35 2.25)
    (stroke (width 0.2) (type solid)) (layer "F.Fab") (tstamp 32c68a9f-8b7c-4b25-8df8-5ac2b61cfa69))
  (fp_line (start 4.35 2.25) (end -4.35 2.25)
    (stroke (width 0.2) (type solid)) (layer "F.Fab") (tstamp 9dd9f2a5-33d8-4b68-a7a7-994f969d75e4))
  (pad "1" thru_hole rect (at 2.05 -1.27) (size 1.415556 1.415556) (drill 0.91) (layers "*.Cu" "*.Mask") (tstamp 58413922-5187-4f7c-9c75-ae024e958cb7))
  (pad "2" thru_hole circle (at 2.05 1.27) (size 1.415556 1.415556) (drill 0.91) (layers "*.Cu" "*.Mask") (tstamp 60dfe0b3-c1e5-4ae2-abff-44574e6bbd0a))
  (pad "3" thru_hole circle (at -2.05 -1.27) (size 1.415556 1.415556) (drill 0.91) (layers "*.Cu" "*.Mask") (tstamp 7e40c8e4-76bf-45c2-aafd-99c351969d33))
  (pad "4" thru_hole circle (at -2.05 1.27) (size 1.415556 1.415556) (drill 0.91) (layers "*.Cu" "*.Mask") (tstamp 72a7f705-e13d-4a8b-988e-4d9cbebd2530))
  (model "../3D/LBR-127HLD.stp"
    (offset (xyz 0 0 2.849999862))
    (scale (xyz 1 1 1))
    (rotate (xyz -90 0 0))
  )
)
