module i3blocks-battery

go 1.14

require (
	github.com/deckarep/gosx-notifier v0.0.0-20180201035817-e127226297fb // indirect
	github.com/martinlindhe/notify v0.0.0-20181008203735-20632c9a275a
	github.com/nu7hatch/gouuid v0.0.0-20131221200532-179d4d0c4d8d // indirect
	gopkg.in/toast.v1 v1.0.0-20180812000517-0a84660828b2 // indirect
)
