{
	"id": "koboldworks-pf1-item-summary",
	"title": "Koboldworks – Item Summary for Pathfinder 1e",
	"description": "Adds ability to add and display small item summary for all items.",
	"version": "2.1.0",
	"authors": [
		{
			"name": "MKAh",
			"url": "https://gitlab.com/mkahvi",
			"discord": "manaflower",
			"ko-fi": "mkahvi"
		}
	],
	"esmodules": ["item-summary.mjs"],
	"styles": ["item-summary.css"],
	"languages": [
		{
			"lang": "en",
			"path": "lang/en.json"
		}
	],
	"compatibility": {
		"minimum": 11,
		"verified": 11
	},
	"relationships": {
		"systems": [
			{
				"id": "pf1",
				"compatibility": {
					"minimum": "10"
				}
			}
		]
	},
	"flags": {
		"hotReload": {
			"extensions": ["css", "json", "hbs"]
		}
	},
	"readme": "https://gitlab.com/koboldworks/pf1/item-summary/-/raw/master/README.md",
	"changelog": "https://gitlab.com/koboldworks/pf1/item-summary/-/raw/master/CHANGELOG.md",
	"license": "https://gitlab.com/koboldworks/pf1/item-summary/-/raw/master/LICENSE",
	"manifest": "https://gitlab.com/koboldworks/pf1/item-summary/-/releases/permalink/latest/downloads/module.json",
	"download": "https://gitlab.com/koboldworks/pf1/item-summary/-/releases/2.1.0/downloads/item-summary.zip",
	"url": "https://gitlab.com/koboldworks/pf1/item-summary",
	"bugs": "https://gitlab.com/koboldworks/pf1/item-summary/-/issues"
}
