{
	"id": "unsnap-ruler",
	"name": "unsnap-ruler",
	"title": "Unsnap Ruler",
	"description": "Allows using ruler without it snapping to grid. Hold shift as normal to go free.",
	"version": "1.0.1.2",
	"authors": [
		{
			"name": "MKAh",
			"url": "https://gitlab.com/mkahvi",
			"discord": "Mana#4176",
			"ko-fi": "mkahvi"
		}
	],
	"esmodules": ["unsnap-ruler.mjs"],
	"minimumCoreVersion": "0.7.9",
	"compatibility": {
		"minimum": "0.7.9",
		"verified": 11
	},
	"readme": "https://gitlab.com/koboldworks/agnostic/unsnap-ruler/-/raw/master/README.md",
	"changelog": "https://gitlab.com/koboldworks/agnostic/unsnap-ruler/-/raw/master/CHANGELOG.md",
	"license": "https://gitlab.com/koboldworks/agnostic/unsnap-ruler/-/raw/master/LICENSE",
	"manifest": "https://gitlab.com/koboldworks/agnostic/unsnap-ruler/-/releases/permalink/latest/downloads/module.json",
	"download": "https://gitlab.com/koboldworks/agnostic/unsnap-ruler/-/releases/1.0.1.2/downloads/unsnap-ruler.zip",
	"url": "https://gitlab.com/koboldworks/agnostic/unsnap-ruler",
	"bugs": "https://gitlab.com/koboldworks/agnostic/unsnap-ruler/-/issues"
}
