<svg width="28" height="32" viewBox="0 0 28 32" fill="none" xmlns="http://www.w3.org/2000/svg">
<path d="M0 2.49072C0 0.945234 1.67815 -0.0162571 3.01144 0.765326L26.0567 14.2746C27.3748 15.0473 27.3748 16.9527 26.0567 17.7254L3.01144 31.2347C1.67815 32.0163 0 31.0548 0 29.5093V2.49072Z" fill="#333" stroke="#999" stroke-width="1" stroke-linecap="square"/>
</svg>
