<?xml version="1.0" ?>
<svg enable-background="new 0 0 32 32" id="Editable-line" version="1.1" width="32" height="32" viewBox="0 0 32 32" xml:space="preserve" xmlns="http://www.w3.org/2000/svg" xmlns:xlink="http://www.w3.org/1999/xlink">
<path d="  M16,7C9.934,7,4.798,10.776,3,16c1.798,5.224,6.934,9,13,9s11.202-3.776,13-9C27.202,10.776,22.066,7,16,7z" fill="none" id="XMLID_10_" stroke="#ffffff" stroke-linecap="round" stroke-linejoin="round" stroke-miterlimit="10" stroke-width="3"/>
<circle cx="16" cy="16" fill="none" id="XMLID_12_" r="5" stroke="#ffffff" stroke-linecap="round" stroke-linejoin="round" stroke-miterlimit="10" stroke-width="3"/>
</svg>