<svg width="20" height="21" viewBox="0 0 20 21" fill="none" xmlns="http://www.w3.org/2000/svg">
<path d="M11.0351 15.5489C14.4006 16.35 15.5848 13.4714 14.9915 12.397C14.7538 11.9682 12.6182 11.1447 12.5143 11.1048C11.5969 10.7707 11.2579 11.394 10.6221 12.2142C9.40143 11.6034 8.5829 11.1222 7.74194 9.75443C7.78931 9.69543 7.85246 9.62563 7.89983 9.57244C8.194 9.24337 8.74495 8.6301 8.36934 7.87972C8.05356 7.25066 7.89651 6.8119 7.781 6.49031C7.44611 5.55877 7.191 5.30615 6.03759 5.30615C4.83681 5.30615 3.90527 6.8842 3.90527 8.24286C3.90527 11.2087 7.89235 14.7985 11.0351 15.5489ZM6.03759 6.55263C6.28688 6.55263 6.41319 6.56094 6.47635 6.57092C6.61097 6.85594 6.74725 7.45093 7.24917 8.37665C7.17106 8.66833 6.06169 9.35223 6.57607 10.2364C7.62727 12.0214 8.6793 12.6404 10.1867 13.39C11.1905 13.8437 11.5113 13.0219 12.1478 12.2997C12.4428 12.4194 13.4384 12.8598 13.8755 13.0809C13.8364 13.9418 13.0054 14.7362 11.3243 14.3357C8.43914 13.6468 5.15092 10.4009 5.15092 8.24203C5.15175 7.42102 5.72763 6.55263 6.03759 6.55263Z" fill="#34AD20"/>
<path d="M0.0268312 19.7113C-0.0820281 20.1052 0.212972 20.4999 0.627635 20.4999C0.777213 20.4999 0.532903 20.5381 5.48725 19.2534C7.50406 20.2805 9.03723 20.2481 10.0161 20.3403C18.7872 20.3403 23.0834 9.64302 17.0471 3.41893C8.77298 -4.5785 -4.11315 5.36012 1.27913 15.1583L0.0268312 19.7113ZM16.0549 4.19507C16.1987 4.45766 20.322 8.17633 18.026 13.7331C16.6125 17.1568 13.3509 19.2667 9.6962 19.0689C6.72293 18.9036 5.95344 17.8415 5.40581 17.987L1.5143 19.0008L2.54888 15.2414C2.59375 15.0802 2.57132 14.9082 2.48822 14.7636C-2.48358 6.18445 8.75885 -2.63648 16.0549 4.19507Z" fill="#34AD20"/>
</svg>
