<svg width="14" height="14" viewBox="0 0 14 14" fill="none" xmlns="http://www.w3.org/2000/svg">
<path d="M11.8125 8.75H10.9375C10.6914 8.75 10.5 8.96875 10.5 9.1875V12.25H1.75V3.5H5.6875C5.90625 3.5 6.125 3.30859 6.125 3.0625V2.1875C6.125 1.96875 5.90625 1.75 5.6875 1.75H1.3125C0.574219 1.75 0 2.35156 0 3.0625V12.6875C0 13.4258 0.574219 14 1.3125 14H10.9375C11.6484 14 12.25 13.4258 12.25 12.6875V9.1875C12.25 8.96875 12.0312 8.75 11.8125 8.75ZM13.3438 0H9.84375C9.24219 0 8.94141 0.710938 9.37891 1.12109L10.3359 2.10547L3.69141 8.77734C3.55469 8.88672 3.47266 9.05078 3.47266 9.24219C3.47266 9.43359 3.55469 9.59766 3.69141 9.70703L4.29297 10.3086C4.42969 10.4453 4.59375 10.5273 4.75781 10.5273C4.94922 10.5273 5.11328 10.4453 5.22266 10.3086L11.8945 3.66406L12.8789 4.62109C13.2891 5.03125 14 4.75781 14 4.15625V0.65625C14 0.300781 13.6992 0 13.3438 0Z" fill="black"/>
</svg>
