<svg width="26" height="26" viewBox="0 0 26 26" fill="none" xmlns="http://www.w3.org/2000/svg">
<path fill-rule="evenodd" clip-rule="evenodd" d="M7.79119 18.5879L7.2938 20.4983C7.22863 20.7486 7.15773 20.9924 7.08144 21.2305C7.88448 20.9055 8.68232 20.5087 9.4697 20.0489L10.4376 19.4836L11.5482 19.6352C12.0195 19.6995 12.5043 19.7332 13 19.7332C18.4416 19.7332 22.25 15.8395 22.25 11.7416C22.25 7.64374 18.4416 3.75 13 3.75C7.55841 3.75 3.75 7.64374 3.75 11.7416C3.75 13.8256 4.68054 15.7826 6.32528 17.2659L7.79119 18.5879ZM5.09184 25.2112C3.72125 25.482 2.31584 25.5734 0.894606 25.4382C1.8189 24.2429 2.55879 23.2351 3.12653 22.2108C3.57062 21.4096 3.90938 20.5984 4.14866 19.6794C1.89396 17.6459 0.5 14.8402 0.5 11.7416C0.5 5.53303 6.09644 0.5 13 0.5C19.9036 0.5 25.5 5.53303 25.5 11.7416C25.5 17.9502 19.9036 22.9832 13 22.9832C12.3571 22.9832 11.7255 22.9395 11.1087 22.8554C9.23189 23.9514 7.20316 24.7941 5.09184 25.2112Z" fill="black"/>
</svg>
