<svg width="33" height="28" viewBox="0 0 33 28" fill="none" xmlns="http://www.w3.org/2000/svg">
<path d="M27 7.5V4C27 2.34315 25.6569 1 24 1H4C2.34315 1 1 2.34315 1 4V24C1 25.6569 2.34315 27 4 27H28.3333C29.9902 27 31.3333 25.6569 31.3333 24V10.5C31.3333 8.84315 29.9902 7.5 28.3333 7.5H7.5" stroke="black" stroke-width="2" stroke-linecap="round"/>
<rect x="20.5" y="14" width="4.33333" height="4.33333" rx="2.16667" fill="black"/>
</svg>
