<svg width="18" height="19" viewBox="0 0 18 19" fill="none" xmlns="http://www.w3.org/2000/svg">
<path fill-rule="evenodd" clip-rule="evenodd" d="M15.7702 0.498779C16.3225 0.498779 16.7702 0.946495 16.7702 1.49878V5.80713V6.80713H15.7702H11.4618C10.9095 6.80713 10.4618 6.35941 10.4618 5.80713C10.4618 5.25484 10.9095 4.80713 11.4618 4.80713H12.7409C11.715 3.98827 10.4147 3.49878 9 3.49878C5.78805 3.49878 3.16546 6.02211 3.00642 9.19456L1.00207 9.73162C0.99988 9.65468 0.998779 9.57747 0.998779 9.5C0.998779 5.08105 4.58105 1.49878 9 1.49878C11.2673 1.49878 13.3143 2.4418 14.7702 3.95702V1.49878C14.7702 0.946495 15.2179 0.498779 15.7702 0.498779ZM2.22969 18.5012C1.6774 18.5012 1.22969 18.0535 1.22969 17.5012V13.1929V12.1929H2.22969H6.53803C7.09032 12.1929 7.53803 12.6406 7.53803 13.1929C7.53803 13.7451 7.09032 14.1929 6.53803 14.1929H5.2591C6.28498 15.0117 7.58532 15.5012 9 15.5012C12.2118 15.5012 14.8344 12.9781 14.9936 9.80575L16.9979 9.26868C17.0001 9.34552 17.0012 9.42263 17.0012 9.5C17.0012 13.9189 13.4189 17.5012 9 17.5012C6.73267 17.5012 4.68561 16.5581 3.22969 15.0428V17.5012C3.22969 18.0535 2.78197 18.5012 2.22969 18.5012Z" fill="black"/>
</svg>
