<svg width="21" height="21" viewBox="0 0 21 21" fill="none" xmlns="http://www.w3.org/2000/svg">
<path d="M10.2107 14.0332C7.4929 14.0332 8.84266 11.3146 6.3469 11.3146C2.99204 11.3146 3.92432 17.2808 10.1908 17.2808C17.0427 17.2808 17.7188 10.9728 13.5007 9.21718C15.0733 9.32613 16.142 7.76846 15.2156 6.07107C14.0845 3.98115 10.6839 3.37405 8.184 4.00693C5.97931 4.56579 4.66282 5.97793 4.66282 7.78426C4.66282 12.6702 12.3081 11.4793 12.0553 13.145C11.9888 13.5758 11.321 14.0332 10.2107 14.0332ZM5.91028 7.78426C5.91028 4.49677 12.7456 4.13167 14.1203 6.66653C14.3348 7.06073 14.3723 7.43164 14.2226 7.68446C14.1128 7.86908 13.909 7.97554 13.6637 7.97554C12.6009 7.97554 13.0791 5.72344 10.0693 5.72344C7.57773 5.72344 6.83507 7.48071 7.66589 8.47286C9.12792 10.2609 14.8796 9.23298 14.8796 12.844C14.8721 16.0408 9.83149 16.717 7.37315 15.4329C5.94937 14.6728 4.91896 12.5621 6.3469 12.5621C7.46047 12.5621 6.91242 15.2807 10.2107 15.2807C12.1218 15.2807 13.1456 14.2711 13.2878 13.3322C13.8317 9.76191 5.91028 11.7645 5.91028 7.78426ZM12.5352 8.87953C10.9667 8.41548 9.06471 8.21089 8.6281 7.67781C8.43183 7.44079 9.02812 6.97091 10.0693 6.97091C11.9613 6.97091 11.5297 8.12523 12.5352 8.87953Z" fill="#62B7F4"/>
<path d="M11.838 19.902C12.6647 20.3037 13.5371 20.5 14.3995 20.5C15.8757 20.5 17.3227 19.9228 18.4596 18.8101C20.211 17.0944 20.6768 14.6036 19.6746 12.4098C20.2626 9.44245 19.3686 6.37119 17.262 4.15403C15.1147 1.89362 12.0077 0.829943 8.90234 1.2782C3.95739 -1.54773 -1.8608 3.85547 0.901093 8.94014C-0.244914 15.3139 5.31463 20.9424 11.838 19.902ZM8.44744 2.45997C8.92979 2.76019 12.9242 1.40211 16.358 5.01312C19.737 8.56923 18.2109 12.2667 18.4646 12.7682C20.4306 16.6844 16.0944 20.7487 12.2281 18.7012C11.7249 18.4359 7.78212 19.8114 4.32165 16.2669C0.88446 12.7457 2.3914 9.01249 2.09367 8.51268C-0.285664 4.50997 4.42061 -0.0374622 8.44744 2.45997Z" fill="#62B7F4"/>
</svg>
