<svg width="48" height="48" viewBox="0 0 48 48" fill="none" xmlns="http://www.w3.org/2000/svg">
<g filter="url(#filter0_d)">
<rect x="6" y="4" width="36" height="36" rx="18" fill="#4F9BF4"/>
<path d="M31.1425 16.0808L28.6026 28.3126C28.4121 29.2045 27.9041 29.3956 27.1422 29.0134L23.2054 26.0829L21.3004 27.9304C21.11 28.1215 20.9195 28.3126 20.5385 28.3126L20.7925 24.299L28.0946 17.6735C28.4121 17.4186 28.0311 17.2275 27.5867 17.4823L18.5701 23.216L14.6967 22.0056C13.8713 21.7507 13.8713 21.1137 14.8872 20.7314L30.063 14.8703C30.7615 14.6155 31.3965 15.0615 31.1425 16.0808Z" fill="white"/>
</g>
<defs>
<filter id="filter0_d" x="0" y="0" width="48" height="48" filterUnits="userSpaceOnUse" color-interpolation-filters="sRGB">
<feFlood flood-opacity="0" result="BackgroundImageFix"/>
<feColorMatrix in="SourceAlpha" type="matrix" values="0 0 0 0 0 0 0 0 0 0 0 0 0 0 0 0 0 0 127 0"/>
<feOffset dy="2"/>
<feGaussianBlur stdDeviation="3"/>
<feColorMatrix type="matrix" values="0 0 0 0 0 0 0 0 0 0 0 0 0 0 0 0 0 0 0.15 0"/>
<feBlend mode="normal" in2="BackgroundImageFix" result="effect1_dropShadow"/>
<feBlend mode="normal" in="SourceGraphic" in2="effect1_dropShadow" result="shape"/>
</filter>
</defs>
</svg>
