[
  {
    "question": "Знайти масонів, що відвідали принайти N зустрічей в ложах:",
    "titles": [
      "Mason name",
      "Visited events"
    ],
    "query": "SELECT DISTINCT m.*\r\nFROM masons m\r\nJOIN events_members em ON m.id = em.mason_id\r\nGROUP BY m.id\r\nHAVING COUNT(em.event_id) >= $1;"
  },
  {
    "question": "Знайти всі ложій із країни N і з кількістю учасників не менше K:",
    "titles": [
      "Lodge name",
      "Lodge city"
    ],
    "query": "SELECT DISTINCT l.*\r\nFROM lodges l\r\nJOIN masons m ON m.lodge_id = l.id\r\nWHERE l.country = $1\r\nGROUP BY l.id\r\nHAVING COUNT(m.id) >= $2;"
  },
  {
    "question": "Знайти всіх масонів ступеня мастера з країни N:",
    "titles": [
      "Mason name"
    ],
    "query": "SELECT DISTINCT m.* \r\nFROM masons m\r\nJOIN lodges l ON l.id = m.lodge_id\r\nWHERE m.rank = 'Master Mason'\r\nAND l.country = $1;"
  },
  {
    "question": "Знайти масонів, що відвідали принаймні 1 зустріч в ложі із id N:",
    "titles": [
      "Lodge name"
    ],
    "query": "SELECT DISTINCT m.* \r\nFROM masons m\r\nJOIN events_members em ON em.mason_id = m.id\r\nJOIN lodge_events le ON le.id = em.event_id\r\nWHERE le.lodge_id = $1\r\nGROUP BY m.id\r\nHAVING COUNT(em.event_id) >= 1;"
  },
  {
    "question": "Знайти ложі, де було проведено більше N подій:",
    "titles": [
      "Coutry name"
    ],
    "query": "SELECT DISTINCT l.*\r\nFROM lodges l\r\nJOIN lodge_events le ON le.lodge_id = l.id\r\nGROUP BY l.id\r\nHAVING COUNT(le.id) >= $1;"
  }
]