<?xml version="1.0" ?>
<sdf version="1.4">
  <!-- We use a custom world for the rrbot so that the camera angle is launched correctly -->

  <world name="default">
    <include>
      <uri>model://ground_plane</uri>
    </include>

    <!-- Global light source -->
    <include>
      <uri>model://sun</uri>
    </include>

    <!-- <model name="box">
      <include>
        <uri>model://ar_box</uri>
      </include>
      <pose>1 0 0.1 0 0 0</pose>
      <static>true</static>
    </model>

    <model name="box1">
      <include>
        <uri>model://ar_box1</uri>
      </include>
      <pose>1 -1 0.1 0 0 0</pose>
      <static>true</static>
    </model>

    <model name="box2">
      <include>
        <uri>model://ar_box2</uri>
      </include>
      <pose>3 -3 0.1 0 0 0</pose>
      <static>true</static>
    </model> -->

    <model name="box">
      <include>
        <uri>model://ar_box</uri>
      </include>
      <pose>2 0 0.1 0 0 0</pose>
      <static>true</static>
    </model>

    <model name="box1">
      <include>
        <uri>model://ar_box1</uri>
      </include>
      <pose>4 -3 0.1 0 0 0</pose>
      <static>true</static>
    </model>

    <model name="box2">
      <include>
        <uri>model://ar_box2</uri>
      </include>
      <pose>7 -7 0.1 0 0 0</pose>
      <static>true</static>
    </model>

<!-- 
    <model name="box3">
      <include>
        <uri>model://ar_box3</uri>
      </include>
      <pose>6 -3 0.1 0 0 0</pose>
      <static>true</static>
    </model>

    <model name="box4">
      <include>
        <uri>model://ar_box4</uri>
      </include>
      <pose>-7 5 0.1 0 0 0</pose>
      <static>true</static>
    </model> -->

    <!-- Focus camera on tall pendulum -->
    <gui fullscreen='0'>
      <camera name='user_camera'>
        <pose>4.927360 -4.376610 3.740080 0.000000 0.275643 2.356190</pose>
        <view_controller>orbit</view_controller>
      </camera>
    </gui>

  </world>
</sdf>