<?xml version="1.0"?>
<!-- HAL-062 Mars Rover Simulator-->
<robot name="hal-062" xmlns:xacro="http://www.ros.org/wiki/xacro">

  <!--Hal default vakues-->
  <xacro:arg name="robot_ns" default="hal"/>
  <xacro:arg name="fixed" default="false"/>
  <xacro:arg name="default_antenna" default="true"/>
  <xacro:arg name="rockers_fixed" default="true"/>

  <xacro:arg name="pi" default="3.14159265359"/>

  <!-- Import all Gazebo-customization elements, including Gazebo colors -->
  <xacro:include filename="$(find hal_rover_simulator)/urdf/hal_062.gazebo" /> 
  <!-- Import Rviz colors -->
  <xacro:include filename="$(find hal_rover_simulator)/urdf/materials.xacro" />
 
  <xacro:if value="$(arg fixed)">
    <link name="world"/>
    <joint name="fixed" type="fixed">
      <parent link="world"/>
      <child link="chassis"/>
      <origin xyz="0.0 0.0 0"/>
    </joint>
  </xacro:if>

 <!-- CHASSIS -->
 <!--
 <origin
        xyz="0 0 1"
        rpy="0 0 0" />
        -->
  <link name="chassis">
    <gazebo>
        <pose>0 0 .5 0 0 0</pose>
    </gazebo>

    <inertial>
    <origin
        xyz="-0.0865766790595161 -0.108463241781581 0.0208855225858935"
        rpy="0 0 0" />
      <mass
        value="20.1571429958443" />
      <inertia
        ixx="0.165235848795832"
        ixy="-0.000735581298441556"
        ixz="-0.00199690921071345"
        iyy="0.094167079648996"
        iyz="-6.70970536592532E-05"
        izz="0.219751038279827" />
    </inertial>
    <visual>
      <origin
        xyz="-0.2825 0.330 -0.0915"
        rpy="1.5707 0 0" />
      <geometry>
        <mesh
          filename="package://meshes_gazebo/meshes/kadlub.dae"/>
      </geometry>
      
    </visual>
    <collision>
      <origin
        xyz="0 0 0"
        rpy="0 0 0" />
      <geometry>
        <box size="0.608 0.561 0.1763" />
      </geometry>
    </collision>
  </link>


<!-- LEFT SITE OF ROVER-->
<!-- LEFT SUSPENSION-->
<!-- Left upper suspension-->
 <link name="left_suspension_u">
    <inertial>
      <origin
        xyz="-0.0865766790595161 -0.108463241781581 0.0208855225858935"
        rpy="0 0 0" />
      <mass
        value="1.74870167456714" />
      <inertia
        ixx="0.00252926248276328"
        ixy="0.00127733229620527"
        ixz="1.24274647762414E-06"
        iyy="0.00471425892976128"
        iyz="-1.95968906207085E-06"
        izz="0.00649623539246" />
    </inertial>
    <visual>
      <origin
        xyz="-0.425 0.2 -0.31"
        rpy="1.5707 0 0" />
      <geometry>
        <mesh
          filename="package://meshes_gazebo/meshes/zawieszenie_lewo.dae"/>
      </geometry>
      
    </visual>

    <collision>
      <origin
        xyz="-0.2 0.023 -0.12"
        rpy="0 -0.680678 0" />
      <geometry>
        <box size=".375 .04 .04" />
      </geometry>
    </collision>

    <collision>
      <origin
        xyz="0.15 0.023 -0.067"
        rpy="0 0.61749749 0" />
      <geometry>
        <box size=".239 .04 .04" />
      </geometry>
    </collision>
  </link>

<!--Left down suspension-->
<link
    name="left_suspension_d">
    
    <inertial>
      <origin
        xyz="-0.0865766790595161 -0.108463241781581 0.0208855225858935"
        rpy="0 0 0" />
      <mass
        value="1.74870167456714" />
      <inertia
        ixx="0.00252926248276328"
        ixy="0.00127733229620527"
        ixz="1.24274647762414E-06"
        iyy="0.00471425892976128"
        iyz="-1.95968906207085E-06"
        izz="0.00649623539246" />
    </inertial>
    <visual>
      <origin
        xyz="-0.27 .204 -0.12"
        rpy="1.5707 0 0" />
      <geometry>
        <mesh
          filename="package://meshes_gazebo/meshes/zawieszenie_dol_lewe.dae"/>
      </geometry>
      
    </visual>

    <collision>
      <origin
        xyz="-0.1 -0.023 -0.023"
        rpy="0 -0.33161256 0" />
      <geometry>
        <box size=".170 .04 .04" />
      </geometry>
    </collision>

    <collision>
      <origin
        xyz="0.1 -0.023 -0.023"
        rpy="0 0.33161256 0" />
      <geometry>
        <box size=".170 .04 .04" />
      </geometry>
    </collision>
  </link>

<!-- WHEELS LEFT-->
<!--Wheel left front-->
<link
    name="wheel_link_LF">
    <inertial>
      <origin
        xyz="2.60676627017453E-06 0.00095092519030926 0.0107118731763976"
        rpy="0 0 0" />
      <mass
        value="2.66450210979718" />
      <inertia
        ixx="0.0120626849324792"
        ixy="-2.34555238785698E-06"
        ixz="-4.66555675956134E-07"
        iyy="0.0120247000743743"
        iyz="0.000163335836171467"
        izz="0.0199434523384737" />
    </inertial>
    <visual>
      <origin
        xyz="-.1730 .059 -.1730"
        rpy="1.5707 0 0" />
      <geometry>
        <mesh
          filename="package://meshes_gazebo/meshes/kolo_prawe.dae" />
      </geometry>
      
    </visual>
    <collision>
      <origin
        xyz="0 0 0"
        rpy="1.5707 1.5707 0" />
      <geometry>
        <cylinder radius="0.1586" length="0.1255" />
      </geometry>
    </collision>
  </link>

<!--Wheel left middle-->
<link
    name="wheel_link_LM">
    <inertial>
      <origin
        xyz="2.60676627017453E-06 0.00095092519030926 0.0107118731763976"
        rpy="0 0 0" />
      <mass
        value="2.66450210979718" />
      <inertia
        ixx="0.0120626849324792"
        ixy="-2.34555238785698E-06"
        ixz="-4.66555675956134E-07"
        iyy="0.0120247000743743"
        iyz="0.000163335836171467"
        izz="0.0199434523384737" />
    </inertial>
    <visual>
      <origin
        xyz="-.1730 .059 -.1730"
        rpy="1.5707 0 0" />
      <geometry>
        <mesh
          filename="package://meshes_gazebo/meshes/kolo_prawe.dae" />
      </geometry>
      
    </visual>
    <collision>
      <origin
        xyz="0 0 0"
        rpy="1.5707 1.5707 0" />
      <geometry>
        <cylinder radius="0.1586" length="0.1255" />
      </geometry>
    </collision>
  </link>
 
<!--Wheel left rear-->
<link
    name="wheel_link_LR">
    <inertial>
      <origin
        xyz="2.60676627017453E-06 0.00095092519030926 0.0107118731763976"
        rpy="0 0 0" />
      <mass
        value="2.66450210979718" />
      <inertia
        ixx="0.0120626849324792"
        ixy="-2.34555238785698E-06"
        ixz="-4.66555675956134E-07"
        iyy="0.0120247000743743"
        iyz="0.000163335836171467"
        izz="0.0199434523384737" />
    </inertial>
    <visual>
      <origin
        xyz="-.1730 .059 -.1730"
        rpy="1.5707 0 0" />
      <geometry>
        <mesh
          filename="package://meshes_gazebo/meshes/kolo_prawe.dae" />
      </geometry>
      
    </visual>
    <collision>
      <origin
        xyz="0 0 0"
        rpy="1.5707 1.5707 0" />
      <geometry>
        <cylinder radius="0.1586" length="0.1255" />
      </geometry>
    </collision>
  </link>


<!-- RIGHT SITE OF ROVER-->
<!-- RIGHT SUSPENSION-->
<!--Right upper suspension-->
 <link name="right_suspension_u">
    <inertial>
      <origin
        xyz="-0.0865766790595161 -0.108463241781581 0.0208855225858935"
        rpy="0 0 0" />
      <mass
        value="1.74870167456714" />
      <inertia
        ixx="0.00252926248276328"
        ixy="0.00127733229620527"
        ixz="1.24274647762414E-06"
        iyy="0.00471425892976128"
        iyz="-1.95968906207085E-06"
        izz="0.00649623539246" />
    </inertial>
    <visual>
      <origin
        xyz="-0.425 0.33 -0.31"
        rpy="1.5707 0 0" />
      <geometry>
        <mesh
          filename="package://meshes_gazebo/meshes/zawieszenie_prawo.dae"/>
      </geometry>
      
    </visual>
    <collision>
      <origin
        xyz="-0.2 -0.023 -0.12"
        rpy="0 -0.680678 0" />
      <geometry>
        <box size=".375 .04 .04" />
      </geometry>
    </collision>

    <collision>
      <origin
        xyz="0.15 0.023 -0.067"
        rpy="0 0.61749749 0" />
      <geometry>
        <box size=".239 .04 .04" />
      </geometry>
    </collision>
  </link>

<!--Right down suspension-->
<link
    name="right_suspension_d">
    <inertial>
      <origin
        xyz="-0.0865766790595161 -0.108463241781581 0.0208855225858935"
        rpy="0 0 0" />
      <mass
        value="1.74870167456714" />
      <inertia
        ixx="0.00252926248276328"
        ixy="0.00127733229620527"
        ixz="1.24274647762414E-06"
        iyy="0.00471425892976128"
        iyz="-1.95968906207085E-06"
        izz="0.00649623539246" />
    </inertial>
    <visual>
      <origin
        xyz="-0.27 0.33 -0.12"
        rpy="1.5707 0 0" />
      <geometry>
        <mesh
          filename="package://meshes_gazebo/meshes/zawieszenie_dol_prawe.dae"/>
      </geometry>
      
    </visual>
    <!-- This part of suspension has two collision blocks-->
    <collision>
      <origin
        xyz="-0.1 -0.023 -0.023"
        rpy="0 -0.33161256 0" />
      <geometry>
        <box size=".170 .04 .04" />
      </geometry>
    </collision>

    <collision>
      <origin
        xyz="0.1 -0.023 -0.023"
        rpy="0 0.33161256 0" />
      <geometry>
        <box size=".170 .04 .04" />
      </geometry>
    </collision>
  </link>

<!--Right wheel rear-->
<link
    name="wheel_link_RR">
    <inertial>
      <origin
        xyz="2.60676627017453E-06 0.00095092519030926 0.0107118731763976"
        rpy="0 0 0" />
      <mass
        value="2.66450210979718" />
      <inertia
        ixx="0.0120626849324792"
        ixy="-2.34555238785698E-06"
        ixz="-4.66555675956134E-07"
        iyy="0.0120247000743743"
        iyz="0.000163335836171467"
        izz="0.0199434523384737" />
    </inertial>
    <visual>
      <origin
        xyz="-.1730 .059 -.1730"
        rpy="1.5707 0 0" />
      <geometry>
        <mesh
          filename="package://meshes_gazebo/meshes/kolo_lewe.dae" />
      </geometry>
      
    </visual>
    <collision>
      <origin
        xyz="0 0 0"
        rpy="1.5707 1.5707 0" />
      <geometry>
        <cylinder radius="0.1586" length="0.1255" />
      </geometry>
    </collision>
  </link>

<!--Right wheel middle-->
<link
    name="wheel_link_RM">
    <inertial>
      <origin
        xyz="2.60676627017453E-06 0.00095092519030926 0.0107118731763976"
        rpy="0 0 0" />
      <mass
        value="2.66450210979718" />
      <inertia
        ixx="0.0120626849324792"
        ixy="-2.34555238785698E-06"
        ixz="-4.66555675956134E-07"
        iyy="0.0120247000743743"
        iyz="0.000163335836171467"
        izz="0.0199434523384737" />
    </inertial>
    <visual>
      <origin
        xyz="-.1730 .059 -.1730"
        rpy="1.5707 0 0" />
      <geometry>
        <mesh
          filename="package://meshes_gazebo/meshes/kolo_lewe.dae" />
      </geometry>
      
    </visual>
    <collision>
      <origin
        xyz="0 0 0"
        rpy="1.5707 1.5707 0" />
      <geometry>
        <cylinder radius="0.1586" length="0.1255" />
      </geometry>
    </collision>
  </link>


<!--Right wheel front-->
<link
    name="wheel_link_RF">
    <inertial>
      <origin
        xyz="2.60676627017453E-06 0.00095092519030926 0.0107118731763976"
        rpy="0 0 0" />
      <mass
        value="2.66450210979718" />
      <inertia
        ixx="0.0120626849324792"
        ixy="-2.34555238785698E-06"
        ixz="-4.66555675956134E-07"
        iyy="0.0120247000743743"
        iyz="0.000163335836171467"
        izz="0.0199434523384737" />
    </inertial>
    <visual>
      <origin
        xyz="-.1730 .059 -.1730"
        rpy="1.5707 0 0" />
      <geometry>
        <mesh
          filename="package://meshes_gazebo/meshes/kolo_lewe.dae" />
      </geometry>
      
    </visual>
    <collision>
      <origin
        xyz="0 0 0"
        rpy="1.5707 1.5707 0" />
      <geometry>
        <cylinder radius="0.1586" length="0.1255" />
      </geometry>
    </collision>
  </link>
<!-- LINKS WHEELS END-->
<!--CAMERA LINKS-->

<link name="base_footprint"/>

<link name="camera_frame"/>

<link name="camera_optical_frame"/>

<link name="depth_camera_optical_frame"/>

<!-- LINKS END -->




<!--##################-->
<!--JOINTS SECIOTN-->
<!-- JOINTS OPTIONS -->
<!-- If the rucker buggy will be set as a 'fixed' this logical statement set argument 'rockers_fixed' as fixed-->
<xacro:if value="$(arg rockers_fixed)">
    <xacro:property name="rockers_joint_type" value="fixed"/>
  </xacro:if>
  <xacro:unless value="$(arg rockers_fixed)">
    <xacro:property name="rockers_joint_type" value="revolute"/>
</xacro:unless>

<!--JOINTS-->
<joint name="left_rocker_joint" type="${rockers_joint_type}">
    <parent link="chassis"/>
    <child link="left_suspension_u"/>
    <origin xyz=".25 .34 .035" rpy="0 -0.26 0"/>
    <axis xyz="0 1 0"/>
    <limit effort="100.0" lower="-0.24" upper="0.24" velocity="100.0"/>
    <dynamics friction="1.0" damping="0.1"/>
</joint>

<!-- SUSPENSION-->
<!-- Suspension left-->
<!-- Down left suspension-->
 <joint name="joint_left_d_u" type="revolute">
    <parent link="left_suspension_u"/>
    <child link="left_suspension_d"/>
    <origin xyz=".257 0 -.19166" rpy="0 0 0"/>
    <axis xyz="0 1 0"/>
    <limit effort="100.0" lower="-0.24" upper="0.24" velocity="100.0"/>
    <dynamics damping="0.7"/>
  </joint>

<!-- Suspension right-->
<!-- Down right suspension-->
<joint name="joint_right_d_u" type="revolute">
    <parent link="right_suspension_u"/>
    <child link="right_suspension_d"/>
    <origin xyz=".257 0 -.19166" rpy="0 0 0"/>
    <axis xyz="0 1 0"/>
    <limit effort="100.0" lower="-0.24" upper="0.24" velocity="100.0"/>
    <dynamics damping="0.7"/>
</joint>

<!-- Upper suspension right-->
<joint name="right_rocker_joint" type="${rockers_joint_type}">
    <parent link="chassis"/>
    <child link="right_suspension_u"/>
    <origin xyz=".25 -.34 .035" rpy="0 -0.26 0"/>
    <axis xyz="0 1 0"/>
    <dynamics damping="0.7"/>
    <limit effort="100.0" lower="-0.24" upper="0.24" velocity="100.0"/>
    <dynamics friction="1.0" damping="0.1"/>
    <mimic joint="left_rocker_joint"/>
  </joint>

<!-- WHEELS RIGHT-->
<!-- Wheel right front-->
<joint name="wheel_rf" type="continuous">
    <parent link="right_suspension_d"/>
    <child link="wheel_link_RF"/>
    <origin xyz=".20811 -.1232 -.05573" rpy="0 0 0"/>
    <axis xyz="0 1 0"/>
    <dynamics damping="0.7"/>
  </joint>

<!-- Wheel right middle-->
 <joint name="wheel_rm" type="continuous">
    <parent link="right_suspension_d"/>
    <child link="wheel_link_RM"/>
    <origin xyz="-.20807 -.1232 -.05573" rpy="0 0 0"/>
    <axis xyz="0 1 0"/>
    <dynamics damping="0.7"/>
  </joint>

<!-- Wheel right rear-->
 <joint name="wheel_rr" type="continuous">
    <parent link="right_suspension_u"/>
    <child link="wheel_link_RR"/>
    <origin xyz="-.36433 -.1232 -.24967" rpy="0 0 0"/>
    <axis xyz="0 1 0"/>
    <dynamics damping="0.7"/>
  </joint>

<!-- WHEELS LEFT-->
<!-- Wheel left front-->
 <joint name="wheel_lr" type="continuous">
    <parent link="left_suspension_u"/>
    <child link="wheel_link_LR"/>
    <origin xyz="-.36433 .1232 -.24967" rpy="0 0 0"/>
    <axis xyz="0 1 0"/>
    <dynamics damping="0.7"/>
  </joint>

<!--Wheel left front-->
  <joint name="wheel_lf" type="continuous">
    <parent link="left_suspension_d"/>
    <child link="wheel_link_LF"/>
    <origin xyz=".20811 .1232 -.05573" rpy="0 0 0"/>
    <axis xyz="0 1 0"/>
    <dynamics damping="0.7"/>
  </joint>

<!--Wheel left middle-->
 <joint name="wheel_lm" type="continuous">
    <parent link="left_suspension_d"/>
    <child link="wheel_link_LM"/>
    <origin xyz="-.20807 .1232 -.05573" rpy="0 0 0"/>
    <axis xyz="0 1 0"/>
    <dynamics damping="0.7"/>
  </joint>

<!--CAMERA JOINTS-->

<joint name="camera_optical_joint_chassis" type="fixed">
    <origin xyz="0.34 0 0.1" rpy="0.0 0.0 0.0"/>
    <parent link="chassis"/>
    <child link="camera_frame"/>
</joint>


<joint name="camera_optical_joint" type="fixed">
    <origin xyz="0 0 0" rpy="-${pi/2} 0.0 -${pi/2}"/>
    <parent link="camera_frame"/>
    <child link="camera_optical_frame"/>
</joint>

<!-- joint specific to the depth camera !!!different angles rpy!!! -->
<joint name="depth_camera_optical_joint" type="fixed">
    <origin xyz="0 0 0" rpy="0.0 0.0 0.0"/>
    <parent link="camera_frame"/>
    <child link="depth_camera_optical_frame"/>
</joint>


<joint name="footprint_joint" type="fixed">
    <origin xyz="0 0 -0.19783" rpy="0 0 0"/>
    <parent link="chassis"/>
    <child link="base_footprint"/>
</joint>

<!--END OF THE JOINTS SECTION-->
<!--##################-->

<!--Transmission section-->
<!--LEFT SITE-->
  <transmission name="wheel_lf_trans">
    <type>transmission_interface/SimpleTransmission</type>
    <joint name="wheel_lf">
      <hardwareInterface>hardware_interface/VelocityJointInterface</hardwareInterface>
    </joint>
    <actuator name="wheel_lf_motor">
      <mechanicalReduction>1</mechanicalReduction>
      <hardwareInterface>hardware_interface/VelocityJointInterface</hardwareInterface>
    </actuator>
  </transmission>

  <transmission name="wheel_lm_trans">
    <type>transmission_interface/SimpleTransmission</type>
    <joint name="wheel_lm">
      <hardwareInterface>hardware_interface/VelocityJointInterface</hardwareInterface>
    </joint>
    <actuator name="wheel_lm_motor">
      <mechanicalReduction>1</mechanicalReduction>
      <hardwareInterface>hardware_interface/VelocityJointInterface</hardwareInterface>
    </actuator>
  </transmission>

    <transmission name="wheel_lr_trans">
    <type>transmission_interface/SimpleTransmission</type>
    <joint name="wheel_lr">
      <hardwareInterface>hardware_interface/VelocityJointInterface</hardwareInterface>
    </joint>
    <actuator name="wheel_lr_motor">
      <mechanicalReduction>1</mechanicalReduction>
      <hardwareInterface>hardware_interface/VelocityJointInterface</hardwareInterface>
    </actuator>
  </transmission>


<!--RIGHT SITE-->
  <transmission name="wheel_rf_trans">
    <type>transmission_interface/SimpleTransmission</type>
    <joint name="wheel_rf">
      <hardwareInterface>hardware_interface/VelocityJointInterface</hardwareInterface>
    </joint>
    <actuator name="wheel_rf_motor">
      <mechanicalReduction>1</mechanicalReduction>
      <hardwareInterface>hardware_interface/VelocityJointInterface</hardwareInterface>
    </actuator>
  </transmission>

    <transmission name="wheel_rm_trans">
    <type>transmission_interface/SimpleTransmission</type>
    <joint name="wheel_rm">
      <hardwareInterface>hardware_interface/VelocityJointInterface</hardwareInterface>
    </joint>
    <actuator name="wheel_rm_motor">
      <mechanicalReduction>1</mechanicalReduction>
      <hardwareInterface>hardware_interface/VelocityJointInterface</hardwareInterface>
    </actuator>
  </transmission>

    <transmission name="wheel_rr_trans">
    <type>transmission_interface/SimpleTransmission</type>
    <joint name="wheel_rr">
      <hardwareInterface>hardware_interface/VelocityJointInterface</hardwareInterface>
    </joint>
    <actuator name="wheel_rr_motor">
      <mechanicalReduction>1</mechanicalReduction>
      <hardwareInterface>hardware_interface/VelocityJointInterface</hardwareInterface>
    </actuator>
  </transmission>

<!--Rocker Bogie-->
   <xacro:unless value="$(arg rockers_fixed)">
    <transmission name="rocker_L_trans">
      <type>transmission_interface/SimpleTransmission</type>
      <joint name="left_rocker_joint">
        <hardwareInterface>hardware_interface/EffortJointInterface</hardwareInterface>
      </joint>
      <actuator name="rocker_L_virtual_motor"/>
    </transmission>

    <transmission name="rocker_R_trans">
      <type>transmission_interface/SimpleTransmission</type>
      <joint name="right_rocker_joint">
        <hardwareInterface>hardware_interface/EffortJointInterface</hardwareInterface>
      </joint>
      <actuator name="rocker_R_virtual_motor"/>
    </transmission>
  </xacro:unless>

</robot>