<?xml version="1.0" ?>
<sdf version="1.4">
  <!-- We use a custom world for the rrbot so that the camera angle is launched correctly -->

  <world name="default">
    <!-- <include>
      <uri>model://ground_plane</uri>
    </include> -->

    <!-- Global light source -->
    <include>
      <uri>model://sun</uri>
    </include>

    <model name="mars_map_obj">
      <include>
        <uri>model://mars_map</uri>
      </include>
      <!-- map is 32x32 -->
      <pose>15 -15 0 0 0 0</pose> 
      <static>true</static>
    </model>

    <gui fullscreen='0'>
      <camera name='user_camera'>
        <pose>4.927360 -4.376610 3.740080 0.000000 0.275643 2.356190</pose>
        <view_controller>orbit</view_controller>
      </camera>
    </gui>
    
  </world>
</sdf>