10;5;2;2;2;2;2;2;2;2;2;2;2;2;2;2;2;2;2;2;10;255;255;255;255;2;2;2;2;2;1;1;1;1;1;1;1;1;1;1;1;1;2;2;2;2;2;2;2;2;2;2;2;2;2;2;2;2;2;2;2;2;2;2;
5;2;2;2;2;2;2;2;2;2;2;2;2;2;2;2;2;2;2;2;10;10;255;255;10;2;2;2;2;2;1;1;1;1;1;1;1;1;1;1;1;2;2;2;3;3;3;3;2;2;2;2;2;2;2;2;2;2;2;2;2;2;2;2;
2;2;2;2;2;2;2;2;2;2;2;2;2;2;5;5;5;5;5;5;5;10;10;10;10;2;2;2;2;1;1;1;1;1;1;1;1;1;1;1;2;2;2;3;3;3;3;3;3;3;2;2;2;2;2;2;2;2;2;2;2;2;2;2;
2;2;2;2;2;2;2;2;2;2;2;2;2;5;5;5;5;5;5;5;5;10;10;10;10;2;2;2;2;1;1;1;1;1;1;1;1;1;1;2;2;2;3;3;3;3;3;3;3;3;2;2;2;2;2;2;2;2;2;2;2;2;2;2;
2;2;2;2;2;2;2;2;2;2;2;2;2;5;5;5;5;5;5;5;5;10;10;10;10;2;2;2;1;1;1;1;1;1;1;1;1;1;2;2;3;3;3;3;3;3;3;3;3;3;2;2;2;2;2;2;2;2;2;2;2;2;2;2;
2;2;2;2;2;2;2;2;2;2;2;2;2;5;5;5;5;5;5;5;5;10;10;10;10;2;2;2;1;1;1;1;1;1;1;1;1;1;2;3;3;3;3;3;3;3;3;3;3;3;2;2;2;2;2;2;2;2;2;2;2;2;2;2;
2;2;2;2;2;2;2;2;2;2;2;2;2;5;5;5;5;5;5;5;5;10;10;10;10;2;2;2;1;1;1;1;1;1;1;1;1;2;3;3;3;3;3;3;3;3;3;3;3;2;2;2;2;2;2;2;2;2;2;2;2;2;2;2;
2;2;2;2;2;10;10;2;2;2;2;2;2;5;5;5;5;5;5;5;5;10;10;10;10;2;2;1;1;1;1;1;1;1;1;1;2;2;3;3;3;3;3;3;3;3;3;3;2;2;2;2;2;2;2;2;2;2;2;2;2;2;2;2;
2;2;2;2;2;10;10;2;2;2;2;2;2;5;5;5;5;5;5;5;10;10;20;20;5;2;2;1;1;1;1;1;1;1;1;1;2;2;3;3;3;3;3;3;3;3;3;2;2;2;2;2;2;2;2;2;2;2;2;2;2;2;2;2;
2;2;2;2;2;2;2;2;2;2;2;2;2;10;10;10;10;10;10;10;10;255;255;255;5;2;1;1;1;1;1;1;1;1;1;1;2;2;2;3;3;3;3;3;3;3;2;2;2;2;2;2;2;2;2;2;2;2;2;2;2;2;2;2;
2;2;2;2;2;2;2;2;2;2;2;2;2;1;10;10;10;10;10;10;255;255;255;255;5;2;1;1;1;1;1;1;1;1;1;1;2;2;2;2;2;3;3;3;3;2;2;2;2;2;2;2;2;2;2;2;2;2;2;2;2;2;2;2;
2;2;2;2;2;2;2;2;2;2;10;10;2;1;1;1;1;1;5;255;255;255;255;255;5;1;1;1;1;1;1;1;1;1;1;2;2;2;2;2;2;2;2;2;2;2;2;2;2;2;2;2;2;2;2;2;2;2;2;2;2;2;2;2;
2;2;2;2;2;2;2;2;2;2;10;10;2;1;1;1;1;5;255;255;255;255;255;5;1;1;1;1;1;1;1;1;1;1;1;2;2;2;2;2;2;2;2;2;2;2;2;2;2;2;2;2;2;2;2;2;2;2;2;2;2;2;2;2;
2;2;2;2;2;2;2;2;2;2;2;10;2;1;1;1;5;255;255;255;255;255;255;5;1;1;1;1;1;1;1;1;1;1;2;2;2;2;2;2;2;2;2;2;2;2;2;2;2;2;2;2;2;2;2;2;2;2;2;2;2;2;2;2;
2;2;2;2;2;2;2;2;2;2;2;10;10;1;1;5;255;255;255;255;255;255;5;1;1;1;1;1;1;1;1;1;1;2;2;2;2;2;2;2;2;2;2;2;2;2;2;2;2;2;2;2;2;2;2;2;2;2;2;2;2;2;2;2;
2;2;2;2;2;2;2;10;10;2;2;10;10;1;5;255;255;255;255;255;255;5;1;1;1;1;1;1;1;1;1;1;2;2;2;2;2;2;2;2;2;2;2;2;2;2;2;2;2;2;2;2;2;2;2;2;2;2;2;2;2;2;2;2;
2;2;2;2;2;2;2;10;10;2;2;2;2;5;255;255;255;255;255;255;5;1;1;1;1;1;1;1;1;1;1;1;2;2;2;2;2;2;2;2;2;2;2;2;2;2;2;2;2;2;2;2;2;2;2;2;2;2;2;2;2;2;2;2;
2;2;2;2;2;2;2;10;2;2;2;2;2;255;255;255;255;255;255;5;1;10;1;1;1;1;1;1;1;1;1;2;2;2;2;2;2;2;2;2;2;2;2;2;2;2;2;2;2;2;2;2;2;2;2;2;2;2;2;2;2;2;2;2;
2;2;2;2;2;2;2;2;2;2;2;2;255;255;255;255;255;255;5;1;1;10;10;1;1;1;1;1;1;1;2;2;2;2;2;2;2;2;2;2;2;2;2;2;2;2;2;2;2;2;2;2;2;2;2;2;2;2;2;2;2;2;2;2;
2;2;2;2;2;2;2;2;2;2;2;2;5;255;255;255;255;5;1;1;1;1;10;1;1;1;1;1;1;2;2;2;2;2;2;2;2;2;2;2;2;2;2;2;2;2;2;2;2;2;2;2;2;2;2;2;2;2;2;2;2;2;2;2;
2;2;2;2;2;2;2;2;2;2;2;2;5;255;255;255;5;1;1;1;1;1;1;1;1;1;1;1;1;1;255;255;255;255;255;255;1;1;1;1;1;1;1;1;1;1;1;1;1;1;1;1;1;1;1;1;1;1;1;1;1;1;1;1;
2;2;2;2;2;2;2;2;2;2;2;2;2;5;255;5;1;1;1;1;1;1;1;1;1;255;255;255;1;1;255;255;255;255;255;255;255;1;1;1;1;1;1;1;1;1;1;1;1;1;1;1;1;1;1;1;1;1;1;1;1;1;1;1;
1;1;1;1;1;1;1;1;1;1;1;1;1;1;5;1;1;1;1;255;255;1;1;1;1;255;255;255;1;255;255;255;255;255;255;255;255;255;1;1;1;1;1;1;1;1;1;1;1;1;1;1;1;1;1;1;1;1;1;1;1;1;1;1;
1;1;1;1;1;1;1;1;1;1;1;1;1;1;1;1;1;1;10;255;255;1;1;1;1;1;1;1;255;255;255;255;255;255;255;255;255;255;255;1;1;1;1;1;1;1;1;1;1;1;1;1;1;1;1;1;1;1;1;1;1;1;1;1;
1;1;1;1;1;1;1;1;1;1;1;1;1;1;1;1;1;1;1;1;1;1;1;1;1;1;1;1;255;255;255;255;255;255;255;255;255;255;255;1;1;1;1;1;1;1;1;1;1;1;1;1;1;1;1;1;1;1;1;1;1;1;1;1;
1;1;1;1;1;1;1;1;1;1;1;1;1;1;1;1;1;1;1;1;1;1;1;1;1;1;1;1;255;255;255;255;255;255;255;255;255;255;255;1;1;1;1;1;1;1;1;1;1;1;1;1;1;1;1;1;1;1;1;1;1;1;1;1;
1;1;1;1;1;1;2;2;2;1;1;1;1;1;1;1;1;1;1;1;1;1;1;1;1;1;1;1;255;255;255;255;255;255;255;255;255;255;255;1;1;1;1;1;1;1;1;1;1;1;1;1;1;1;2;1;1;1;1;1;1;1;1;1;
1;1;1;1;1;2;2;2;2;2;5;1;1;1;1;1;1;1;1;1;1;1;1;1;1;1;1;1;255;255;255;255;255;255;255;255;255;255;255;255;1;1;1;1;1;1;1;1;1;1;1;1;2;2;2;2;1;1;1;1;1;1;1;1;
1;1;1;1;1;2;2;2;5;5;5;5;5;1;1;1;1;1;1;1;1;1;1;1;1;1;1;1;1;255;255;255;255;255;255;255;255;255;255;255;255;1;1;1;1;1;1;1;1;1;1;2;2;2;2;2;2;1;1;1;1;1;1;1;
1;1;1;1;1;2;2;5;255;255;255;255;5;5;1;1;1;1;1;1;1;1;1;1;1;1;1;1;1;1;255;255;255;255;255;255;255;255;255;255;255;1;1;1;1;1;1;1;1;1;1;2;2;2;2;2;2;2;1;1;1;1;1;1;
1;1;1;1;1;2;2;10;255;255;255;255;255;5;5;1;1;1;1;1;1;1;1;1;1;1;1;1;1;1;1;255;255;255;255;255;255;255;255;255;255;255;1;1;1;1;1;1;1;1;1;2;2;2;2;2;2;2;1;1;1;1;1;1;
1;1;1;1;1;1;10;10;255;255;255;255;255;255;5;5;1;1;1;1;1;1;1;1;1;1;1;1;1;1;1;1;255;255;255;255;255;255;255;255;255;5;2;1;1;1;1;1;1;1;1;1;2;2;2;2;2;1;1;1;1;1;2;2;
1;1;1;1;1;10;10;255;255;255;255;255;255;255;255;5;1;1;1;1;1;1;1;1;1;1;1;1;1;1;1;1;1;255;255;255;255;255;255;5;5;2;2;2;2;2;1;1;1;1;1;1;2;2;2;2;2;1;1;1;1;2;2;2;
1;1;1;1;1;1;10;255;255;255;255;255;255;255;255;5;5;1;1;1;1;1;1;1;1;1;1;1;1;1;1;1;1;1;2;255;255;255;5;2;2;2;2;10;2;2;1;1;1;1;1;1;2;2;2;2;1;1;1;2;2;2;2;2;
1;1;1;1;1;1;10;255;255;255;255;255;255;255;255;5;5;1;1;1;1;1;1;1;1;1;1;2;2;2;2;2;1;1;1;2;2;5;2;2;2;2;5;10;10;1;1;1;1;1;1;1;1;2;1;1;1;1;2;2;2;2;2;2;
1;1;1;1;1;1;1;255;255;255;255;255;255;255;255;255;5;1;1;1;1;1;1;1;1;1;2;2;2;2;2;1;1;1;1;2;2;2;2;2;2;5;255;255;255;1;1;1;1;1;1;1;1;1;1;1;1;2;2;2;2;2;2;2;
1;1;1;1;1;1;1;255;255;255;255;255;255;255;255;255;5;5;1;1;1;1;1;1;1;2;2;2;2;2;1;1;1;1;1;1;2;2;2;2;2;255;255;255;255;255;1;1;1;1;1;1;1;1;1;1;2;2;2;2;2;2;2;2;
1;1;1;1;1;1;1;1;1;1;255;255;255;255;255;255;255;5;5;1;1;1;1;2;2;2;2;2;2;2;1;1;1;1;1;1;1;2;2;2;255;255;255;255;255;255;255;1;1;1;1;1;1;1;1;2;2;2;2;2;2;2;2;2;
1;1;1;1;1;1;1;1;1;1;255;255;255;255;255;255;255;255;10;255;1;1;1;2;2;2;2;2;2;1;1;1;1;1;1;1;1;1;2;255;255;255;255;255;255;255;255;10;1;1;1;1;1;2;2;2;2;2;2;2;2;2;2;2;
1;1;1;1;1;1;1;1;1;1;1;255;255;255;255;255;255;255;10;5;255;1;2;2;2;2;2;2;1;1;1;1;1;1;1;1;1;1;1;255;255;255;255;255;255;255;255;10;10;2;2;2;2;2;2;2;2;2;2;2;2;2;2;2;
1;1;1;1;1;1;1;1;1;1;1;1;255;255;255;255;255;255;255;10;2;2;2;2;2;2;2;1;1;1;1;1;1;1;1;1;1;1;1;1;255;255;255;255;255;255;2;10;255;255;2;2;2;2;2;2;2;2;2;2;2;2;2;2;
1;1;1;1;1;1;1;1;1;1;1;1;1;1;255;255;255;255;255;10;5;2;2;2;2;1;1;1;1;1;1;1;1;1;1;1;1;1;1;1;1;255;255;255;255;2;2;255;255;255;2;2;2;10;10;2;2;2;2;2;2;2;2;2;
1;1;1;1;1;1;1;1;1;1;1;1;1;1;1;255;255;255;255;10;5;5;2;2;1;1;1;1;1;255;255;255;255;1;1;1;1;1;1;1;1;1;255;255;2;2;255;255;255;255;2;2;10;10;10;2;2;2;2;2;2;2;2;2;
1;1;1;1;1;1;1;1;1;1;1;1;1;1;1;1;255;255;255;10;5;5;2;2;1;1;1;1;1;255;255;255;255;255;255;1;1;1;1;1;1;1;1;2;2;255;255;255;255;255;255;2;10;10;5;2;2;2;2;2;2;2;2;2;
1;1;1;1;1;1;1;1;1;1;1;1;1;1;1;1;255;255;255;10;5;5;5;2;1;1;1;1;1;255;255;255;255;255;255;10;1;1;1;1;1;1;1;1;255;255;255;255;255;255;255;2;2;2;2;2;2;5;5;5;5;5;5;2;
1;1;1;1;1;1;1;1;1;1;1;1;1;1;1;1;1;255;255;10;5;5;5;5;2;1;1;1;255;255;255;10;10;10;10;10;5;1;1;1;1;1;1;1;255;255;255;255;255;255;2;2;2;2;2;2;5;255;255;255;255;255;255;5;
1;1;1;1;1;1;1;1;1;1;1;1;1;1;1;1;1;1;255;255;5;5;5;5;2;1;1;1;255;255;10;10;5;5;5;5;5;5;2;1;1;1;1;1;3;255;255;255;255;255;2;2;2;2;5;5;255;255;255;255;255;255;255;255;
1;1;1;1;1;1;1;1;1;1;1;1;10;10;1;1;1;1;1;10;10;10;10;5;2;2;1;255;255;255;10;10;5;5;5;5;5;5;2;1;1;1;1;3;3;3;255;255;255;2;2;2;2;5;255;255;255;255;255;255;255;255;255;255;
1;1;1;1;1;1;1;1;1;1;1;1;10;10;1;1;1;1;1;1;5;5;2;2;2;2;1;255;255;255;10;10;5;5;5;5;5;2;1;1;1;1;3;3;3;3;3;3;1;1;2;5;5;5;255;255;255;255;255;255;255;255;255;255;
1;1;1;1;1;1;1;1;1;1;1;1;1;1;1;1;1;1;1;1;1;1;2;2;2;2;10;255;255;255;10;10;10;5;5;5;2;1;1;1;1;20;20;20;3;3;3;1;1;1;5;255;255;255;255;255;255;255;255;255;255;255;255;255;
1;1;1;1;1;1;1;1;1;1;1;1;1;1;1;1;1;1;1;1;1;1;2;2;2;2;5;20;255;255;10;10;10;10;10;2;1;1;1;255;255;20;20;20;10;3;1;1;1;1;5;255;255;255;255;255;255;255;255;255;255;255;255;255;
1;1;1;1;1;1;1;1;1;1;1;1;1;1;1;1;1;1;1;1;1;1;1;2;2;2;5;10;20;255;255;255;255;255;1;1;1;1;255;255;255;20;20;20;10;3;1;1;1;1;5;255;255;255;255;255;255;255;255;255;255;255;255;255;
1;1;1;1;1;1;1;1;1;1;1;1;1;1;1;1;1;1;1;1;1;1;1;1;2;2;5;5;10;20;255;255;255;1;1;1;1;255;255;255;10;10;10;10;10;1;1;1;1;1;5;255;255;255;255;255;255;255;255;255;255;255;255;255;
1;1;1;1;1;1;1;1;1;1;1;1;1;1;1;1;1;1;1;1;1;1;1;1;1;2;5;5;5;5;255;255;1;1;1;1;255;255;255;255;10;10;10;10;1;1;1;5;5;5;255;255;255;255;255;255;255;255;255;255;255;255;255;255;
1;1;1;1;1;1;1;1;1;1;1;1;1;1;1;1;1;1;1;1;1;1;1;1;1;1;1;1;5;1;1;1;1;1;1;255;255;255;255;10;10;10;10;10;1;1;5;255;255;255;255;255;255;255;255;255;255;255;255;255;255;255;255;255;
1;1;1;1;1;1;1;1;1;1;1;1;1;1;1;255;255;1;1;1;1;1;1;1;1;1;1;1;1;1;1;1;1;1;255;255;255;255;10;10;10;10;10;1;1;1;5;255;255;255;255;255;255;255;255;255;255;255;255;255;255;255;255;255;
1;1;1;1;1;1;1;1;1;1;1;1;1;10;1;255;1;1;1;1;1;1;1;1;1;1;1;1;1;1;1;1;1;255;255;255;10;10;10;10;10;10;10;1;1;1;5;255;255;255;255;255;255;255;255;255;255;255;255;255;255;255;255;255;
1;1;1;1;1;1;1;1;1;1;1;1;10;10;1;1;1;255;255;1;1;1;1;1;1;1;1;1;1;1;1;1;1;255;255;255;10;10;10;10;10;10;1;1;1;1;5;255;255;255;255;255;255;255;255;255;255;255;255;255;255;255;255;255;
1;1;1;1;1;1;1;1;1;1;1;1;10;1;1;1;1;255;255;1;1;1;1;1;1;1;1;1;1;1;1;1;1;10;255;255;10;10;10;10;10;10;1;1;1;5;255;255;255;255;255;255;255;255;255;255;255;255;255;255;255;255;255;255;
1;1;1;1;1;1;1;1;1;1;1;1;1;1;1;1;1;1;1;1;1;1;1;1;1;1;1;1;1;1;1;1;1;1;10;255;255;10;10;10;10;1;1;1;5;255;255;255;255;255;255;255;255;255;255;255;255;255;255;255;255;255;255;255;
1;1;1;1;1;1;1;1;1;1;1;1;1;1;1;1;1;1;1;1;1;1;1;1;1;1;1;1;1;1;1;1;1;1;1;10;10;10;10;10;1;1;1;5;255;255;255;255;255;255;255;255;255;255;255;255;255;255;255;255;255;255;255;255;
1;1;1;1;1;1;1;1;1;1;1;1;1;1;1;1;1;1;1;1;1;1;1;1;1;1;1;1;1;1;1;1;1;1;1;1;10;10;10;1;1;1;5;255;255;255;255;255;255;255;255;255;255;255;255;255;255;255;255;255;255;255;255;255;
1;1;1;1;1;1;1;1;1;1;1;1;1;1;1;1;1;1;1;1;1;1;1;1;1;1;1;1;1;1;1;1;1;1;1;1;1;1;1;1;1;5;255;255;255;255;255;255;255;255;255;255;255;255;255;255;255;255;255;255;255;255;255;255;
1;1;1;1;1;1;1;1;1;1;1;1;1;1;1;1;1;1;1;1;1;1;1;1;1;1;1;1;1;1;1;1;1;1;1;1;1;1;1;1;1;5;255;255;255;255;255;255;255;255;255;255;255;255;255;255;255;255;255;255;255;255;255;255;
