{
  "extends": "../../tslint.json",
  "rules": {
    "directive-selector": [
      true,
      "attribute",
      "ngxThm",
      "camelCase"
    ],
    "component-selector": [
      true,
      "element",
      "ngx-thm",
      "kebab-case"
    ]
  }
}
