{
  "title": "scratch_3",
  "description": "Auto generated JSON schema based on the 'scratch_3' file",
  "type": "object",
  "properties": {
    "products": {
      "type": "array",
      "items": {
        "properties": {
          "productBaseUnit": {
            "type": "string"
          },
          "productID": {
            "type": "string"
          },
          "materialGroup": {
            "type": "string"
          },
          "productAttributes": {
            "type": "array",
            "items": {
              "properties": {
                "propertyLow": {
                  "type": "string"
                },
                "storeId": {
                  "type": "string"
                },
                "characteristicCode": {
                  "type": "string"
                }
              }
            }
          },
          "productUnit": {
            "type": "array",
            "items": {
              "properties": {
                "numeratorBaseUnit": {
                  "type": "string"
                },
                "volume": {
                  "type": "string"
                },
                "productGtin": {
                  "type": "array",
                  "items": {
                    "properties": {
                      "gtin": {
                        "type": "string"
                      },
                      "mainGtin": {
                        "type": "string"
                      },
                      "gtinType": {
                        "type": "string"
                      }
                    }
                  }
                },
                "denominatorBaseUnit": {
                  "type": "string"
                },
                "grossWeight": {
                  "type": "string"
                },
                "unitCode": {
                  "type": "string"
                },
                "length": {
                  "type": "string"
                },
                "width": {
                  "type": "string"
                },
                "dimensionUnit": {
                  "type": "string"
                },
                "volumeUnit": {
                  "type": "string"
                },
                "height": {
                  "type": "string"
                },
                "weightUnit": {
                  "type": "string"
                }
              }
            }
          },
          "productType": {
            "type": "string"
          },
          "productDescription": {
            "type": "array",
            "items": {
              "properties": {
                "isoCode": {
                  "type": "string"
                },
                "description": {
                  "type": "string"
                }
              }
            }
          }
        }
      }
    }
  }
}